Mailinglist Archive: opensuse (4053 mails)

< Previous Next >
Cannot compile Apache 1.3.19
  • From: "Chuck" <suse@xxxxxxxxxxxxx>
  • Date: Tue, 7 Aug 2001 13:22:10 -0700
  • Message-id: <000001c11f7e$a3395b30$37960355@xxxxxxxxxxxxx>

I get the following error trying to compile apache on SuSE 7.2:

gcc -c -I../../os/unix -I../../include -DLINUX=22 -DUSE_HSREGEX
-DUSE_EXPAT -I../../lib/expat-lite `../../apaci` -fpic -DSHARED_MODULE
mod_rewrite.c && mv mod_rewrite.o mod_rewrite.lo
In file included from mod_rewrite.c:93:
mod_rewrite.h:135: db1/ndbm.h: No such file or directory
make[4]: *** [mod_rewrite.so] Error 1
make[3]: *** [all] Error 1
make[2]: *** [subdirs] Error 1
make[2]: Leaving directory `/usr/local/src/apache_1.3.19/src'
make[1]: *** [build-std] Error 2
make[1]: Leaving directory `/usr/local/src/apache_1.3.19'
make: *** [build] Error 2

Here is my configure command:

./configure --prefix=/usr/local/apache --enable-module=all
--enable-shared=max

I currently have 1.3.20 compiled and running but am having problems with
a few DSO's and need to downgrade for testing.

Any ideas?

Thanks,
CC

---
Chuck Carson
Sr. Systems Engineer
San Diego, California
O: +1 (858) 646-2095
F: +1 (858) 297-8570



< Previous Next >
This Thread
  • No further messages