Mailinglist Archive: zypp-commit (20 mails)

< Previous Next >
[zypp-commit] Build failed in Jenkins: zypp » s15sp1 » 10-libsolv #112
  • From: jenkins@xxxxxxx
  • Date: Mon, 30 Sep 2019 12:43:47 +0000 (UTC)
  • Message-id: <1143149477.3005.1569847427426.JavaMail.jenkins@ci>
See
<https://ci.suse.de/job/zypp/job/s15sp1/job/10-libsolv/112/display/redirect?page=changes>

Changes:

[mls] Add POOL_FLAG_WHATPROVIDESWITHDISABLED pool flag

------------------------------------------
Started by an SCM change
Running as SYSTEM
[EnvInject] - Loading node environment variables.
Building remotely on zypp-node-02 (zypp-node zypp-s15sp1) in workspace
<https://ci.suse.de/job/zypp/job/s15sp1/job/10-libsolv/ws/>
No credentials specified
git rev-parse --is-inside-work-tree # timeout=10
Fetching changes from the remote Git repository
git config remote.origin.url git://github.com/openSUSE/libsolv.git #
timeout=10
Fetching upstream changes from git://github.com/openSUSE/libsolv.git
git --version # timeout=10
git fetch --tags --progress git://github.com/openSUSE/libsolv.git
+refs/heads/*:refs/remotes/origin/*
git rev-parse origin/master^{commit} # timeout=10
Checking out Revision bfdc347fdfc350a9b290543fac905cb21f9a71a8 (origin/master)
git config core.sparsecheckout # timeout=10
git checkout -f bfdc347fdfc350a9b290543fac905cb21f9a71a8
Commit message: "Add POOL_FLAG_WHATPROVIDESWITHDISABLED pool flag"
git rev-list --no-walk 2d024af2d85a599f025af529c18736b23658eb7f # timeout=10
Cleaning workspace
git rev-parse --verify HEAD # timeout=10
Resetting working tree
git reset --hard # timeout=10
git clean -fdx # timeout=10
[10-libsolv] $ /bin/sh -xe /tmp/jenkins1770616993258547332.sh
+ . /root/zypp-ci-utils/bin/ci-profile.sh
++ . /root/zypp-ci-utils/bin/ascii_art
++ trap exit_check EXIT
++ test -n s15sp1
++ export Z_ALLOWSUBMIT=0
++ Z_ALLOWSUBMIT=0
++ export Z_OBS_PROJECT
++ export Z_DOC_PROJECT
++ case "$Z_LABEL" in
++ export CMAKE_INSTALL_PREFIX=/usr
++ CMAKE_INSTALL_PREFIX=/usr
++ export CMAKEPARAS=-DCMAKE_INSTALL_PREFIX=/usr
++ CMAKEPARAS=-DCMAKE_INSTALL_PREFIX=/usr
++ export CLEANBUILD=0
++ CLEANBUILD=0
++ export MAKEJOBS=4
++ MAKEJOBS=4
++ export
CHECKOUTDIR=<https://ci.suse.de/job/zypp/job/s15sp1/job/10-libsolv/ws/checkout>
++
CHECKOUTDIR=<https://ci.suse.de/job/zypp/job/s15sp1/job/10-libsolv/ws/checkout>
++ export
ARTIFACTS=<https://ci.suse.de/job/zypp/job/s15sp1/job/10-libsolv/112/artifact/artifacts>
++
ARTIFACTS=<https://ci.suse.de/job/zypp/job/s15sp1/job/10-libsolv/112/artifact/artifacts>
++ export
BUILDDIR=<https://ci.suse.de/job/zypp/job/s15sp1/job/10-libsolv/ws/build>
++ BUILDDIR=<https://ci.suse.de/job/zypp/job/s15sp1/job/10-libsolv/ws/build>
++ export
BUILDPACKAGEDIR=<https://ci.suse.de/job/zypp/job/s15sp1/job/10-libsolv/ws/build/package>
++
BUILDPACKAGEDIR=<https://ci.suse.de/job/zypp/job/s15sp1/job/10-libsolv/ws/build/package>
++ export OBSDIR=<https://ci.suse.de/job/zypp/job/s15sp1/job/10-libsolv/ws/obs>
++ OBSDIR=<https://ci.suse.de/job/zypp/job/s15sp1/job/10-libsolv/ws/obs>
++ rm -rf
'<https://ci.suse.de/job/zypp/job/s15sp1/job/10-libsolv/ws/copy-to-slave*.dir'>
++ rm -rf
<https://ci.suse.de/job/zypp/job/s15sp1/job/10-libsolv/112/artifact/artifacts>
++ '[' 0 '!=' 0 ']'
++ rm -rf
<https://ci.suse.de/job/zypp/job/s15sp1/job/10-libsolv/ws/build/package>
++ rm -rf <https://ci.suse.de/job/zypp/job/s15sp1/job/10-libsolv/ws/obs>
++ mkdir -p
<https://ci.suse.de/job/zypp/job/s15sp1/job/10-libsolv/112/artifact/artifacts>
++ mkdir -p <https://ci.suse.de/job/zypp/job/s15sp1/job/10-libsolv/ws/build>
++ mkdir -p <https://ci.suse.de/job/zypp/job/s15sp1/job/10-libsolv/ws/obs>
+ CMAKEPARAS='-DCMAKE_INSTALL_PREFIX=/usr -DSUSE=1 -DENABLE_APPDATA=0
-DENABLE_STATIC=1 -DDISABLE_SHARED=1 -DWITH_LIBXML2=1 '
+ ci_build
+ pushd <https://ci.suse.de/job/zypp/job/s15sp1/job/10-libsolv/ws/build>
~/hudson/workspace/zypp/s15sp1/10-libsolv/build
~/hudson/workspace/zypp/s15sp1/10-libsolv
+ msg '==> Building'
+ echo '==> Building'
==> Building
+ test -e /usr/local/include/solv
+ test -e /usr/local/include/zypp
+ export CMAKE_PREFIX_PATH=/usr/local/include:/usr/include
+ CMAKE_PREFIX_PATH=/usr/local/include:/usr/include
+ cmake -DCMAKE_INSTALL_PREFIX=/usr -DSUSE=1 -DENABLE_APPDATA=0
-DENABLE_STATIC=1 -DDISABLE_SHARED=1 -DWITH_LIBXML2=1
<https://ci.suse.de/job/zypp/job/s15sp1/job/10-libsolv/ws/checkout>
-- Libraries will be installed in /usr/lib64
-- Header files will be installed in /usr/include
-- Binaries will be installed in /usr/bin
-- Man pages will be installed in /usr/share/man
-- Building for SUSE
-- Looking for modules in
<https://ci.suse.de/job/zypp/job/s15sp1/job/10-libsolv/ws/checkout/cmake/modules>
-- Version: 0.7.6
-- Writing spec file...
-- Writing pkg-config files...
-- Configuring done
-- Generating done
-- Build files have been written to:
<https://ci.suse.de/job/zypp/job/s15sp1/job/10-libsolv/ws/build>
+ '[' '' == clean ']'
+ make -j 4
Scanning dependencies of target toolstuff
Scanning dependencies of target libsolvext
Scanning dependencies of target libsolv
[ 1%] Building C object tools/CMakeFiles/toolstuff.dir/common_write.c.o
[ 1%] Building C object ext/CMakeFiles/libsolvext.dir/testcase.c.o
[ 2%] Building C object src/CMakeFiles/libsolv.dir/poolarch.c.o
[ 3%] Building C object ext/CMakeFiles/libsolvext.dir/repo_testcase.c.o
FATAL: kernel too old
ICECC[15878] 12:43:46: Compiled on 10.161.16.29
make[2]: *** [tools/CMakeFiles/toolstuff.dir/build.make:63:
tools/CMakeFiles/toolstuff.dir/common_write.c.o] Error 127
make[1]: *** [CMakeFiles/Makefile2:404: tools/CMakeFiles/toolstuff.dir/all]
Error 2
make[1]: *** Waiting for unfinished jobs....
ICECC[15882] 12:43:46: compiler failed: FATAL: kernel too old - compiled on
10.160.224.2
ICECC[15882] 12:43:46: got exception 23 (10.160.224.2)
ICECC[15881] 12:43:46: write of source chunk to host 10.161.16.29
ICECC[15881] 12:43:46: failed Broken pipe
ICECC[15881] 12:43:46: got exception 15 (10.161.16.29)
[ 4%] Building C object ext/CMakeFiles/libsolvext.dir/pool_fileconflicts.c.o
ICECC[15884] 12:43:46: write of source chunk to host 10.161.16.29
ICECC[15884] 12:43:46: failed Broken pipe
ICECC[15884] 12:43:46: got exception 15 (10.161.16.29)
ICECC[15893] 12:43:46: write of source chunk to host 10.161.16.29
ICECC[15893] 12:43:46: failed Broken pipe
ICECC[15893] 12:43:46: got exception 15 (10.161.16.29)
[ 5%] Building C object src/CMakeFiles/libsolv.dir/poolvendor.c.o
FATAL: kernel too old
ICECC[15899] 12:43:46: Compiled on 10.161.16.29
make[2]: *** [src/CMakeFiles/libsolv.dir/build.make:111:
src/CMakeFiles/libsolv.dir/poolvendor.c.o] Error 127
make[1]: *** [CMakeFiles/Makefile2:150: src/CMakeFiles/libsolv.dir/all] Error 2
[ 6%] Building C object ext/CMakeFiles/libsolvext.dir/repo_rpmdb.c.o
ICECC[15903] 12:43:46: write of source chunk to host 10.161.16.29
ICECC[15903] 12:43:46: failed Broken pipe
ICECC[15903] 12:43:46: got exception 15 (10.161.16.29)
[ 7%] Building C object ext/CMakeFiles/libsolvext.dir/repo_pubkey.c.o
ICECC[15909] 12:43:46: write of source chunk to host 10.161.16.29
ICECC[15909] 12:43:46: failed Broken pipe
ICECC[15909] 12:43:46: got exception 15 (10.161.16.29)
[ 8%] Building C object ext/CMakeFiles/libsolvext.dir/repo_repomdxml.c.o
ICECC[15915] 12:43:46: write of source chunk to host 10.161.16.29
ICECC[15915] 12:43:46: failed Broken pipe
ICECC[15915] 12:43:46: got exception 15 (10.161.16.29)
[ 9%] Building C object ext/CMakeFiles/libsolvext.dir/repo_rpmmd.c.o
ICECC[15921] 12:43:46: write of source chunk to host 10.161.16.29
ICECC[15921] 12:43:46: failed Broken pipe
ICECC[15921] 12:43:46: got exception 15 (10.161.16.29)
[ 10%] Building C object ext/CMakeFiles/libsolvext.dir/repo_deltainfoxml.c.o
FATAL: kernel too old
ICECC[15927] 12:43:46: Compiled on 10.161.16.29
make[2]: *** [ext/CMakeFiles/libsolvext.dir/build.make:279:
ext/CMakeFiles/libsolvext.dir/repo_deltainfoxml.c.o] Error 127
make[2]: *** Waiting for unfinished jobs....
make[1]: *** [CMakeFiles/Makefile2:205: ext/CMakeFiles/libsolvext.dir/all]
Error 2
make: *** [Makefile:163: all] Error 2
+ exit_check
+ local RET=2
+ '[' 2 == 0 ']'
+ ascii_bad 2
+ cat

( )
( ) (
) _ )
( \_
_(_\ \)__
(____\___))

OOps :(

+ return 2
Build step 'Execute shell' marked build as failure
Skipped archiving because build is not successful

< Previous Next >
List Navigation
This Thread
Follow Ups