Mailinglist Archive: zypp-commit (95 mails)

< Previous Next >
[zypp-commit] Build failed in Jenkins: zypp » head » 30-zypper #388
  • From: jenkins@xxxxxxx
  • Date: Fri, 25 Aug 2017 10:55:12 +0000 (UTC)
  • Message-id: <-1294145033.3986.1503658512871.JavaMail.jenkins@ci>
See
<https://ci.suse.de/job/zypp/job/head/job/30-zypper/388/display/redirect?page=changes>

Changes:

[ma] remove dead code

[ma] libzypp-devel >= 16.15.4

[ma] GPG key: Also show a gpg keys subkeys (bsc#1008325)

[ma] Translation: updated .pot file

[ma] changes 1.13.32

------------------------------------------
Started by an SCM change
[EnvInject] - Loading node environment variables.
Building remotely on zypp-node-06 (zypp-head zypp-node) in workspace
<https://ci.suse.de/job/zypp/job/head/job/30-zypper/ws/>
git rev-parse --is-inside-work-tree # timeout=10
Fetching changes from the remote Git repository
git config remote.origin.url git://github.com/openSUSE/zypper.git #
timeout=10
Fetching upstream changes from git://github.com/openSUSE/zypper.git
git --version # timeout=10
git fetch --tags --progress git://github.com/openSUSE/zypper.git
+refs/heads/*:refs/remotes/origin/*
git rev-parse origin/master^{commit} # timeout=10
Checking out Revision e77efa5e35b36aca1244782ef325c48fb51fb572 (origin/master)
git config core.sparsecheckout # timeout=10
git checkout -f e77efa5e35b36aca1244782ef325c48fb51fb572
git rev-list 94d2df158360a642aef279b5ef6c76f9ed478b1a # timeout=10
Cleaning workspace
git rev-parse --verify HEAD # timeout=10
Resetting working tree
git reset --hard # timeout=10
git clean -fdx # timeout=10
[30-zypper] $ /bin/sh -xe /tmp/jenkins1957417991404673088.sh
+ . /root/zypp-ci-utils/bin/ci-profile.sh
++ . /root/zypp-ci-utils/bin/ascii_art
++ trap exit_check EXIT
++ test -n head
++ export Z_ALLOWSUBMIT=1
++ Z_ALLOWSUBMIT=1
++ export Z_OBS_PROJECT
++ export Z_DOC_PROJECT
++ case "$Z_LABEL" in
++ Z_OBS_PROJECT=zypp:Head
++ Z_DOC_PROJECT=HEAD
++ export CMAKE_INSTALL_PREFIX=/usr
++ CMAKE_INSTALL_PREFIX=/usr
++ export CMAKEPARAS=-DCMAKE_INSTALL_PREFIX=/usr
++ CMAKEPARAS=-DCMAKE_INSTALL_PREFIX=/usr
++ export CLEANBUILD=0
++ CLEANBUILD=0
++ export MAKEJOBS=4
++ MAKEJOBS=4
++ export
CHECKOUTDIR=<https://ci.suse.de/job/zypp/job/head/job/30-zypper/ws/checkout>
++ CHECKOUTDIR=<https://ci.suse.de/job/zypp/job/head/job/30-zypper/ws/checkout>
++ export
ARTIFACTS=<https://ci.suse.de/job/zypp/job/head/job/30-zypper/388/artifact/artifacts>
++
ARTIFACTS=<https://ci.suse.de/job/zypp/job/head/job/30-zypper/388/artifact/artifacts>
++ export BUILDDIR=<https://ci.suse.de/job/zypp/job/head/job/30-zypper/ws/build>
++ BUILDDIR=<https://ci.suse.de/job/zypp/job/head/job/30-zypper/ws/build>
++ export
BUILDPACKAGEDIR=<https://ci.suse.de/job/zypp/job/head/job/30-zypper/ws/build/package>
++
BUILDPACKAGEDIR=<https://ci.suse.de/job/zypp/job/head/job/30-zypper/ws/build/package>
++ export OBSDIR=<https://ci.suse.de/job/zypp/job/head/job/30-zypper/ws/obs>
++ OBSDIR=<https://ci.suse.de/job/zypp/job/head/job/30-zypper/ws/obs>
++ rm -rf
'<https://ci.suse.de/job/zypp/job/head/job/30-zypper/ws/copy-to-slave*.dir'>
++ rm -rf
<https://ci.suse.de/job/zypp/job/head/job/30-zypper/388/artifact/artifacts>
++ '[' 0 '!=' 0 ']'
++ rm -rf <https://ci.suse.de/job/zypp/job/head/job/30-zypper/ws/build/package>
++ rm -rf <https://ci.suse.de/job/zypp/job/head/job/30-zypper/ws/obs>
++ mkdir -p
<https://ci.suse.de/job/zypp/job/head/job/30-zypper/388/artifact/artifacts>
++ mkdir -p <https://ci.suse.de/job/zypp/job/head/job/30-zypper/ws/build>
++ mkdir -p <https://ci.suse.de/job/zypp/job/head/job/30-zypper/ws/obs>
+ ci_build
+ pushd <https://ci.suse.de/job/zypp/job/head/job/30-zypper/ws/build>
~/hudson/workspace/zypp/head/30-zypper/build
~/hudson/workspace/zypp/head/30-zypper
+ msg '==> Building'
+ echo '==> Building'
==> Building
+ cmake -DCMAKE_INSTALL_PREFIX=/usr
<https://ci.suse.de/job/zypp/job/head/job/30-zypper/ws/checkout>
-- Libraries will be installed in /usr/lib64
-- Header files will be installed in /usr/include
-- Config files will be installed in /etc
** Manual files will be installed in /usr/share/man
-- Writing spec file...
-- I hate you rpm-lint...!!!
-- ZYpp path not set. Looking for it.
-- ZYpp found: includes in /usr/include, library in /usr/lib64/libzypp.so
-- readline found: includes in /usr/include, library in
/usr/lib64/libreadline.so
-- augeas found: includes in /usr/include, library in /usr/lib64/libaugeas.so
** Locale dir is /usr/share/locale
** ZYpper binary will be installed in /usr/bin
-- Configuring done
-- Generating done
-- Build files have been written to:
<https://ci.suse.de/job/zypp/job/head/job/30-zypper/ws/build>
+ make -j 4
[ 2%] Built target man
[ 3%] Extract translatable messages to
<https://ci.suse.de/job/zypp/job/head/job/30-zypper/ws/build/po/zypper.pot>
Scanning dependencies of target zypp-refresh
Scanning dependencies of target zypper_lib
[ 3%] Building CXX object src/CMakeFiles/zypp-refresh.dir/zypp-refresh.cc.o
[ 4%] Building CXX object src/CMakeFiles/zypper_lib.dir/Command.cc.o
[ 5%] Building CXX object src/CMakeFiles/zypper_lib.dir/Zypper.cc.o
[ 6%] Update
<https://ci.suse.de/job/zypp/job/head/job/30-zypper/ws/build/po/zu.gmo>
[ 7%] Update
<https://ci.suse.de/job/zypp/job/head/job/30-zypper/ws/build/po/af.gmo>
[ 8%] Update
<https://ci.suse.de/job/zypp/job/head/job/30-zypper/ws/build/po/ar.gmo>
[ 8%] Update
<https://ci.suse.de/job/zypp/job/head/job/30-zypper/ws/build/po/ast.gmo>
In file included from
<https://ci.suse.de/job/zypp/job/head/job/30-zypper/ws/checkout/src/Zypper.cc>:23:0:
/usr/include/zypp/zypp_detail/ZYppReadOnlyHack.h:15:2: warning: #warning
ZYPP_ZYPP_DETAIL_ZYPPREADONLYHACK_H [-Wcpp]
#warning ZYPP_ZYPP_DETAIL_ZYPPREADONLYHACK_H
^~~~~~~
[ 9%] Update
<https://ci.suse.de/job/zypp/job/head/job/30-zypper/ws/build/po/be.gmo>
[ 10%] Update
<https://ci.suse.de/job/zypp/job/head/job/30-zypper/ws/build/po/bg.gmo>
[ 11%] Update
<https://ci.suse.de/job/zypp/job/head/job/30-zypper/ws/build/po/bn.gmo>
[ 12%] Update
<https://ci.suse.de/job/zypp/job/head/job/30-zypper/ws/build/po/bs.gmo>
[ 13%] Update
<https://ci.suse.de/job/zypp/job/head/job/30-zypper/ws/build/po/ca.gmo>
[ 13%] Update
<https://ci.suse.de/job/zypp/job/head/job/30-zypper/ws/build/po/cs.gmo>
[ 15%] Update
<https://ci.suse.de/job/zypp/job/head/job/30-zypper/ws/build/po/cy.gmo>
[ 16%] Update
<https://ci.suse.de/job/zypp/job/head/job/30-zypper/ws/build/po/da.gmo>
[ 17%] Update
<https://ci.suse.de/job/zypp/job/head/job/30-zypper/ws/build/po/de.gmo>
[ 18%] Update
<https://ci.suse.de/job/zypp/job/head/job/30-zypper/ws/build/po/el.gmo>
[ 19%] Building CXX object src/CMakeFiles/zypper_lib.dir/Config.cc.o
[ 20%] Update
<https://ci.suse.de/job/zypp/job/head/job/30-zypper/ws/build/po/en.gmo>
[ 21%] Update
<https://ci.suse.de/job/zypp/job/head/job/30-zypper/ws/build/po/en_GB.gmo>
[ 22%] Linking CXX executable zypp-refresh
[ 22%] Update
<https://ci.suse.de/job/zypp/job/head/job/30-zypper/ws/build/po/en_US.gmo>
[ 23%] Update
<https://ci.suse.de/job/zypp/job/head/job/30-zypper/ws/build/po/eo.gmo>
[ 24%] Update
<https://ci.suse.de/job/zypp/job/head/job/30-zypper/ws/build/po/es.gmo>
[ 25%] Update
<https://ci.suse.de/job/zypp/job/head/job/30-zypper/ws/build/po/et.gmo>
[ 25%] Built target zypp-refresh
[ 25%] Building CXX object src/CMakeFiles/zypper_lib.dir/repos.cc.o
[ 26%] Update
<https://ci.suse.de/job/zypp/job/head/job/30-zypper/ws/build/po/eu.gmo>
[ 27%] Update
<https://ci.suse.de/job/zypp/job/head/job/30-zypper/ws/build/po/fa.gmo>
[ 27%] Update
<https://ci.suse.de/job/zypp/job/head/job/30-zypper/ws/build/po/fi.gmo>
[ 29%] Update
<https://ci.suse.de/job/zypp/job/head/job/30-zypper/ws/build/po/fr.gmo>
[ 30%] Update
<https://ci.suse.de/job/zypp/job/head/job/30-zypper/ws/build/po/gl.gmo>
[ 31%] Update
<https://ci.suse.de/job/zypp/job/head/job/30-zypper/ws/build/po/gu.gmo>
[ 32%] Update
<https://ci.suse.de/job/zypp/job/head/job/30-zypper/ws/build/po/he.gmo>
[ 33%] Update
<https://ci.suse.de/job/zypp/job/head/job/30-zypper/ws/build/po/hi.gmo>
[ 34%] Update
<https://ci.suse.de/job/zypp/job/head/job/30-zypper/ws/build/po/hr.gmo>
[ 35%] Building CXX object src/CMakeFiles/zypper_lib.dir/misc.cc.o
[ 36%] Building CXX object src/CMakeFiles/zypper_lib.dir/search.cc.o
<https://ci.suse.de/job/zypp/job/head/job/30-zypper/ws/checkout/src/Zypper.cc>:
In member function 'void Zypper::doCommand()':
<https://ci.suse.de/job/zypp/job/head/job/30-zypper/ws/checkout/src/Zypper.cc>:3390:24:
warning: 'void zypp::zypp_readonly_hack::IWantIt()' is deprecated
[-Wdeprecated-declarations]
In file included from
<https://ci.suse.de/job/zypp/job/head/job/30-zypper/ws/checkout/src/Zypper.cc>:23:0:
/usr/include/zypp/zypp_detail/ZYppReadOnlyHack.h:26:10: note: declared here
<https://ci.suse.de/job/zypp/job/head/job/30-zypper/ws/checkout/src/Zypper.cc>:3390:33:
warning: 'void zypp::zypp_readonly_hack::IWantIt()' is deprecated
[-Wdeprecated-declarations]
In file included from
<https://ci.suse.de/job/zypp/job/head/job/30-zypper/ws/checkout/src/Zypper.cc>:23:0:
/usr/include/zypp/zypp_detail/ZYppReadOnlyHack.h:26:10: note: declared here
<https://ci.suse.de/job/zypp/job/head/job/30-zypper/ws/checkout/src/Zypper.cc>:3396:24:
warning: 'void zypp::zypp_readonly_hack::IWantIt()' is deprecated
[-Wdeprecated-declarations]
In file included from
<https://ci.suse.de/job/zypp/job/head/job/30-zypper/ws/checkout/src/Zypper.cc>:23:0:
/usr/include/zypp/zypp_detail/ZYppReadOnlyHack.h:26:10: note: declared here
<https://ci.suse.de/job/zypp/job/head/job/30-zypper/ws/checkout/src/Zypper.cc>:3396:33:
warning: 'void zypp::zypp_readonly_hack::IWantIt()' is deprecated
[-Wdeprecated-declarations]
In file included from
<https://ci.suse.de/job/zypp/job/head/job/30-zypper/ws/checkout/src/Zypper.cc>:23:0:
/usr/include/zypp/zypp_detail/ZYppReadOnlyHack.h:26:10: note: declared here
[ 36%] Update
<https://ci.suse.de/job/zypp/job/head/job/30-zypper/ws/build/po/hu.gmo>
[ 37%] Update
<https://ci.suse.de/job/zypp/job/head/job/30-zypper/ws/build/po/id.gmo>
[ 38%] Update
<https://ci.suse.de/job/zypp/job/head/job/30-zypper/ws/build/po/it.gmo>
[ 39%] Update
<https://ci.suse.de/job/zypp/job/head/job/30-zypper/ws/build/po/ja.gmo>
[ 40%] Building CXX object src/CMakeFiles/zypper_lib.dir/info.cc.o
[ 41%] Building CXX object src/CMakeFiles/zypper_lib.dir/Table.cc.o
[ 43%] Building CXX object src/CMakeFiles/zypper_lib.dir/locks.cc.o
[ 44%] Building CXX object src/CMakeFiles/zypper_lib.dir/update.cc.o
[ 44%] Update
<https://ci.suse.de/job/zypp/job/head/job/30-zypper/ws/build/po/ka.gmo>
[ 45%] Update
<https://ci.suse.de/job/zypp/job/head/job/30-zypper/ws/build/po/km.gmo>
[ 45%] Update
<https://ci.suse.de/job/zypp/job/head/job/30-zypper/ws/build/po/ko.gmo>
[ 46%] Building CXX object src/CMakeFiles/zypper_lib.dir/download.cc.o
[ 47%] Update
<https://ci.suse.de/job/zypp/job/head/job/30-zypper/ws/build/po/ku.gmo>
[ 48%] Update
<https://ci.suse.de/job/zypp/job/head/job/30-zypper/ws/build/po/lo.gmo>
[ 49%] Update
<https://ci.suse.de/job/zypp/job/head/job/30-zypper/ws/build/po/lt.gmo>
[ 50%] Update
<https://ci.suse.de/job/zypp/job/head/job/30-zypper/ws/build/po/mk.gmo>
[ 51%] Update
<https://ci.suse.de/job/zypp/job/head/job/30-zypper/ws/build/po/mr.gmo>
[ 52%] Update
<https://ci.suse.de/job/zypp/job/head/job/30-zypper/ws/build/po/nb.gmo>
[ 52%] Update
<https://ci.suse.de/job/zypp/job/head/job/30-zypper/ws/build/po/nds.gmo>
[ 53%] Update
<https://ci.suse.de/job/zypp/job/head/job/30-zypper/ws/build/po/nl.gmo>
[ 54%] Update
<https://ci.suse.de/job/zypp/job/head/job/30-zypper/ws/build/po/nn.gmo>
[ 55%] Update
<https://ci.suse.de/job/zypp/job/head/job/30-zypper/ws/build/po/pa.gmo>
[ 56%] Update
<https://ci.suse.de/job/zypp/job/head/job/30-zypper/ws/build/po/pl.gmo>
[ 58%] Update
<https://ci.suse.de/job/zypp/job/head/job/30-zypper/ws/build/po/pt.gmo>
[ 59%] Update
<https://ci.suse.de/job/zypp/job/head/job/30-zypper/ws/build/po/pt_BR.gmo>
[ 59%] Update
<https://ci.suse.de/job/zypp/job/head/job/30-zypper/ws/build/po/ro.gmo>
[ 60%] Building CXX object src/CMakeFiles/zypper_lib.dir/source-download.cc.o
[ 61%] Update
<https://ci.suse.de/job/zypp/job/head/job/30-zypper/ws/build/po/ru.gmo>
[ 62%] Update
<https://ci.suse.de/job/zypp/job/head/job/30-zypper/ws/build/po/si.gmo>
[ 63%] Update
<https://ci.suse.de/job/zypp/job/head/job/30-zypper/ws/build/po/sk.gmo>
[ 64%] Update
<https://ci.suse.de/job/zypp/job/head/job/30-zypper/ws/build/po/sl.gmo>
[ 65%] Update
<https://ci.suse.de/job/zypp/job/head/job/30-zypper/ws/build/po/sr.gmo>
[ 65%] Update
<https://ci.suse.de/job/zypp/job/head/job/30-zypper/ws/build/po/sv.gmo>
[ 66%] Update
<https://ci.suse.de/job/zypp/job/head/job/30-zypper/ws/build/po/ta.gmo>
[ 67%] Update
<https://ci.suse.de/job/zypp/job/head/job/30-zypper/ws/build/po/tg.gmo>
[ 68%] Update
<https://ci.suse.de/job/zypp/job/head/job/30-zypper/ws/build/po/th.gmo>
[ 69%] Update
<https://ci.suse.de/job/zypp/job/head/job/30-zypper/ws/build/po/tr.gmo>
[ 70%] Update
<https://ci.suse.de/job/zypp/job/head/job/30-zypper/ws/build/po/uk.gmo>
[ 72%] Update
<https://ci.suse.de/job/zypp/job/head/job/30-zypper/ws/build/po/vi.gmo>
[ 72%] Update
<https://ci.suse.de/job/zypp/job/head/job/30-zypper/ws/build/po/wa.gmo>
[ 73%] Update
<https://ci.suse.de/job/zypp/job/head/job/30-zypper/ws/build/po/xh.gmo>
[ 74%] Update
<https://ci.suse.de/job/zypp/job/head/job/30-zypper/ws/build/po/zh_CN.gmo>
[ 75%] Building CXX object src/CMakeFiles/zypper_lib.dir/subcommand.cc.o
[ 76%] Update
<https://ci.suse.de/job/zypp/job/head/job/30-zypper/ws/build/po/zh_TW.gmo>
[ 77%] .pot file diff...
[ 78%] Building CXX object src/CMakeFiles/zypper_lib.dir/configtest.cc.o
[ 78%] Built target translations
[ 79%] Building CXX object src/CMakeFiles/zypper_lib.dir/solve-commit.cc.o
[ 80%] Building CXX object src/CMakeFiles/zypper_lib.dir/PackageArgs.cc.o
[ 80%] Building CXX object src/CMakeFiles/zypper_lib.dir/ps.cc.o
[ 81%] Building CXX object src/CMakeFiles/zypper_lib.dir/RequestFeedback.cc.o
[ 82%] Building CXX object src/CMakeFiles/zypper_lib.dir/SolverRequester.cc.o
<https://ci.suse.de/job/zypp/job/head/job/30-zypper/ws/checkout/src/SolverRequester.cc>:615:2:
warning: #warning TODO handle pseudoinstalled objects [-Wcpp]
#warning TODO handle pseudoinstalled objects
^~~~~~~
[ 83%] Building CXX object src/CMakeFiles/zypper_lib.dir/Summary.cc.o
[ 84%] Building CXX object src/CMakeFiles/zypper_lib.dir/callbacks/media.cc.o
[ 86%] Building CXX object src/CMakeFiles/zypper_lib.dir/output/Out.cc.o
[ 86%] Building CXX object src/CMakeFiles/zypper_lib.dir/output/OutNormal.cc.o
[ 87%] Building CXX object src/CMakeFiles/zypper_lib.dir/output/OutXML.cc.o
[ 88%] Building CXX object src/CMakeFiles/zypper_lib.dir/utils/Augeas.cc.o
[ 89%] Building CXX object src/CMakeFiles/zypper_lib.dir/utils/colors.cc.o
[ 90%] Building CXX object src/CMakeFiles/zypper_lib.dir/utils/console.cc.o
[ 91%] Building CXX object src/CMakeFiles/zypper_lib.dir/utils/getopt.cc.o
[ 92%] Building CXX object src/CMakeFiles/zypper_lib.dir/utils/messages.cc.o
[ 92%] Building CXX object src/CMakeFiles/zypper_lib.dir/utils/misc.cc.o
[ 93%] Building CXX object src/CMakeFiles/zypper_lib.dir/utils/pager.cc.o
[ 94%] Building CXX object src/CMakeFiles/zypper_lib.dir/utils/prompt.cc.o
[ 95%] Building CXX object src/CMakeFiles/zypper_lib.dir/utils/richtext.cc.o
[ 96%] Building CXX object src/CMakeFiles/zypper_lib.dir/utils/text.cc.o
[ 97%] Linking CXX static library libzypper_lib.a
[ 97%] Built target zypper_lib
Scanning dependencies of target zypper
[ 98%] Building CXX object src/CMakeFiles/zypper.dir/main.cc.o
In file included from
<https://ci.suse.de/job/zypp/job/head/job/30-zypper/ws/checkout/src/main.cc>:12:0:
<https://ci.suse.de/job/zypp/job/head/job/30-zypper/ws/checkout/src/callbacks/keyring.h>:
In function 'std::ostream& zypp::{anonymous}::dumpKeyInfo(std::ostream&, const
zypp::PublicKeyData&, const zypp::KeyContext&)':
<https://ci.suse.de/job/zypp/job/head/job/30-zypper/ws/checkout/src/callbacks/keyring.h>:85:19:
error: 'PublicSubkeyData' does not name a type
<https://ci.suse.de/job/zypp/job/head/job/30-zypper/ws/checkout/src/callbacks/keyring.h>:87:7:
error: expected ';' before 't'
<https://ci.suse.de/job/zypp/job/head/job/30-zypper/ws/checkout/src/callbacks/keyring.h>:87:9:
error: could not convert 'operator<<(t, TableRow((* & operator<<
<zypp::str::Format&>((* & operator<< <char*>((* & operator<< <const char
(&)[1]>(TableRow(), "")), gettext(((const char*)"Rpm Name:")))), (* &(&
zypp::str::Format(std::__cxx11::basic_string<char>(((const
char*)"gpg-pubkey-%1%-%2%"),
std::allocator<char>())).zypp::str::Format::operator%<std::__cxx11::basic_string<char>
(zypp::PublicKeyData::gpgPubkeyVersion()
const()))->zypp::str::Format::operator%<std::__cxx11::basic_string<char>
(zypp::PublicKeyData::gpgPubkeyRelease() const()))))))' from 'Table' to 'bool'
<https://ci.suse.de/job/zypp/job/head/job/30-zypper/ws/checkout/src/callbacks/keyring.h>:89:7:
error: expected primary-expression before 'return'
<https://ci.suse.de/job/zypp/job/head/job/30-zypper/ws/checkout/src/callbacks/keyring.h>:89:7:
error: expected ')' before 'return'
ICECC[13082] 10:55:12: Compiled on 10.161.16.20
make[2]: *** [src/CMakeFiles/zypper.dir/build.make:63:
src/CMakeFiles/zypper.dir/main.cc.o] Error 1
make[1]: *** [CMakeFiles/Makefile2:1082: src/CMakeFiles/zypper.dir/all] Error 2
make: *** [Makefile:161: all] Error 2
+ exit_check
+ local RET=2
+ '[' 2 == 0 ']'
+ ascii_bad 2
+ cat

( )
( ) (
) _ )
( \_
_(_\ \)__
(____\___))

OOps :(

+ return 2
Build step 'Execute shell' marked build as failure
Skipped archiving because build is not successful

< Previous Next >
This Thread
Follow Ups