Mailinglist Archive: zypp-commit (19 mails)

< Previous Next >
[zypp-commit] Build failed in Jenkins: libzypp-HEAD #2410
  • From: hudson@xxxxxxx
  • Date: Mon, 18 Jan 2016 10:26:07 +0100 (CET)
  • Message-id: <159878161.3013.1453109167917.JavaMail.jenkins@river>
See <http://river.suse.de/job/libzypp-HEAD/2410/>

------------------------------------------
[...truncated 952 lines...]
+ pushd <http://river.suse.de/job/libzypp-HEAD/ws/build>
~/hudson/workspace/libzypp-HEAD/build /home/hudson/workspace/libzypp-HEAD
+ '[' -e ./CTestTestfile.cmake ']'
+ '[' -e tests ']'
+ pushd tests
~/hudson/workspace/libzypp-HEAD/build/tests
~/hudson/workspace/libzypp-HEAD/build /home/hudson/workspace/libzypp-HEAD
+ make -j 10
cd <http://river.suse.de/job/libzypp-HEAD/ws/build> && /usr/bin/cmake
-H<http://river.suse.de/job/libzypp-HEAD/ws/checkout>
-B<http://river.suse.de/job/libzypp-HEAD/ws/build> --check-build-system
CMakeFiles/Makefile.cmake 0
cd <http://river.suse.de/job/libzypp-HEAD/ws/build> && /usr/bin/cmake -E
cmake_progress_start
<http://river.suse.de/job/libzypp-HEAD/ws/build/CMakeFiles>
<http://river.suse.de/job/libzypp-HEAD/ws/build/tests/CMakeFiles/progress.marks>
cd <http://river.suse.de/job/libzypp-HEAD/ws/build> && make -f
CMakeFiles/Makefile2 tests/all
make[1]: Entering directory '/home/hudson/workspace/libzypp-HEAD/build'
make -f vendor/mongoose/CMakeFiles/mongoose.dir/build.make
vendor/mongoose/CMakeFiles/mongoose.dir/depend
make -f zypp/CMakeFiles/zypp.dir/build.make zypp/CMakeFiles/zypp.dir/depend
make[2]: Entering directory '/home/hudson/workspace/libzypp-HEAD/build'
cd <http://river.suse.de/job/libzypp-HEAD/ws/build> && /usr/bin/cmake -E
cmake_depends "Unix Makefiles"
<http://river.suse.de/job/libzypp-HEAD/ws/checkout>
<http://river.suse.de/job/libzypp-HEAD/ws/checkout/vendor/mongoose>
<http://river.suse.de/job/libzypp-HEAD/ws/build>
<http://river.suse.de/job/libzypp-HEAD/ws/build/vendor/mongoose>
<http://river.suse.de/job/libzypp-HEAD/ws/build/vendor/mongoose/CMakeFiles/mongoose.dir/DependInfo.cmake>
--color=
make[2]: Leaving directory '/home/hudson/workspace/libzypp-HEAD/build'
make -f vendor/mongoose/CMakeFiles/mongoose.dir/build.make
vendor/mongoose/CMakeFiles/mongoose.dir/build
make[2]: Entering directory '/home/hudson/workspace/libzypp-HEAD/build'
make[2]: Nothing to be done for 'vendor/mongoose/CMakeFiles/mongoose.dir/build'.
make[2]: Leaving directory '/home/hudson/workspace/libzypp-HEAD/build'
[ 1%] Built target mongoose
make[2]: Entering directory '/home/hudson/workspace/libzypp-HEAD/build'
cd <http://river.suse.de/job/libzypp-HEAD/ws/build> && /usr/bin/cmake -E
cmake_depends "Unix Makefiles"
<http://river.suse.de/job/libzypp-HEAD/ws/checkout>
<http://river.suse.de/job/libzypp-HEAD/ws/checkout/zypp>
<http://river.suse.de/job/libzypp-HEAD/ws/build>
<http://river.suse.de/job/libzypp-HEAD/ws/build/zypp>
<http://river.suse.de/job/libzypp-HEAD/ws/build/zypp/CMakeFiles/zypp.dir/DependInfo.cmake>
--color=
make[2]: Leaving directory '/home/hudson/workspace/libzypp-HEAD/build'
make -f zypp/CMakeFiles/zypp.dir/build.make zypp/CMakeFiles/zypp.dir/build
make[2]: Entering directory '/home/hudson/workspace/libzypp-HEAD/build'
make[2]: Nothing to be done for 'zypp/CMakeFiles/zypp.dir/build'.
make[2]: Leaving directory '/home/hudson/workspace/libzypp-HEAD/build'
[ 58%] Built target zypp
make -f tests/lib/CMakeFiles/zypp_test_utils.dir/build.make
tests/lib/CMakeFiles/zypp_test_utils.dir/depend
make[2]: Entering directory '/home/hudson/workspace/libzypp-HEAD/build'
cd <http://river.suse.de/job/libzypp-HEAD/ws/build> && /usr/bin/cmake -E
cmake_depends "Unix Makefiles"
<http://river.suse.de/job/libzypp-HEAD/ws/checkout>
<http://river.suse.de/job/libzypp-HEAD/ws/checkout/tests/lib>
<http://river.suse.de/job/libzypp-HEAD/ws/build>
<http://river.suse.de/job/libzypp-HEAD/ws/build/tests/lib>
<http://river.suse.de/job/libzypp-HEAD/ws/build/tests/lib/CMakeFiles/zypp_test_utils.dir/DependInfo.cmake>
--color=
Dependee
"<http://river.suse.de/job/libzypp-HEAD/ws/build/tests/lib/CMakeFiles/zypp_test_utils.dir/DependInfo.cmake";>
is newer than depender
"<http://river.suse.de/job/libzypp-HEAD/ws/build/tests/lib/CMakeFiles/zypp_test_utils.dir/depend.internal";.>
Dependee
"<http://river.suse.de/job/libzypp-HEAD/ws/build/tests/lib/CMakeFiles/CMakeDirectoryInformation.cmake";>
is newer than depender
"<http://river.suse.de/job/libzypp-HEAD/ws/build/tests/lib/CMakeFiles/zypp_test_utils.dir/depend.internal";.>
Scanning dependencies of target zypp_test_utils
make[2]: Leaving directory '/home/hudson/workspace/libzypp-HEAD/build'
make -f tests/lib/CMakeFiles/zypp_test_utils.dir/build.make
tests/lib/CMakeFiles/zypp_test_utils.dir/build
make[2]: Entering directory '/home/hudson/workspace/libzypp-HEAD/build'
[ 58%] Building CXX object
tests/lib/CMakeFiles/zypp_test_utils.dir/WebServer.cc.o
cd <http://river.suse.de/job/libzypp-HEAD/ws/build/tests/lib> &&
/usr/lib/icecc/bin/g++ -DHAVE_PIPE2 -DVERSION=\"15.20.0\"
-D_FILE_OFFSET_BITS=64 -D_RPM_4_X -fvisibility-inlines-hidden
-fno-strict-aliasing -fPIC -g -rdynamic -Wall -Woverloaded-virtual
-Wnon-virtual-dtor -Wl,-as-needed -std=c++11 -fvisibility-inlines-hidden
-fno-strict-aliasing -fPIC -g -rdynamic -Wall -Woverloaded-virtual
-Wnon-virtual-dtor -Wl,-as-needed -std=c++11 -O3 -DZYPP_NDEBUG
-I<http://river.suse.de/job/libzypp-HEAD/ws/checkout>
-I<http://river.suse.de/job/libzypp-HEAD/ws/build> -I/usr/include/rpm
-I/usr/include/libxml2
-I<http://river.suse.de/job/libzypp-HEAD/ws/checkout/vendor/mongoose> -o
CMakeFiles/zypp_test_utils.dir/WebServer.cc.o -c
<http://river.suse.de/job/libzypp-HEAD/ws/checkout/tests/lib/WebServer.cc>
[ 60%] Linking CXX static library libzypp_test_utils.a
cd <http://river.suse.de/job/libzypp-HEAD/ws/build/tests/lib> && /usr/bin/cmake
-P CMakeFiles/zypp_test_utils.dir/cmake_clean_target.cmake
cd <http://river.suse.de/job/libzypp-HEAD/ws/build/tests/lib> && /usr/bin/cmake
-E cmake_link_script CMakeFiles/zypp_test_utils.dir/link.txt --verbose=1
/usr/bin/ar cq libzypp_test_utils.a
CMakeFiles/zypp_test_utils.dir/WebServer.cc.o
/usr/bin/ranlib libzypp_test_utils.a
make[2]: Leaving directory '/home/hudson/workspace/libzypp-HEAD/build'
[ 60%] Built target zypp_test_utils
make -f tests/media/CMakeFiles/CredentialFileReader_test.dir/build.make
tests/media/CMakeFiles/CredentialFileReader_test.dir/depend
make -f tests/media/CMakeFiles/CredentialManager_test.dir/build.make
tests/media/CMakeFiles/CredentialManager_test.dir/depend
make -f tests/media/CMakeFiles/MetaLinkParser_test.dir/build.make
tests/media/CMakeFiles/MetaLinkParser_test.dir/depend
make -f tests/zypp/CMakeFiles/Arch_test.dir/build.make
tests/zypp/CMakeFiles/Arch_test.dir/depend
make -f tests/zypp/CMakeFiles/Capabilities_test.dir/build.make
tests/zypp/CMakeFiles/Capabilities_test.dir/depend
make -f tests/zypp/CMakeFiles/CheckSum_test.dir/build.make
tests/zypp/CMakeFiles/CheckSum_test.dir/depend
make -f tests/zypp/CMakeFiles/ContentType_test.dir/build.make
tests/zypp/CMakeFiles/ContentType_test.dir/depend
make -f tests/zypp/CMakeFiles/CpeId_test.dir/build.make
tests/zypp/CMakeFiles/CpeId_test.dir/depend
make[2]: Entering directory '/home/hudson/workspace/libzypp-HEAD/build'
make[2]: Entering directory '/home/hudson/workspace/libzypp-HEAD/build'
make[2]: Entering directory '/home/hudson/workspace/libzypp-HEAD/build'
make[2]: Entering directory '/home/hudson/workspace/libzypp-HEAD/build'
make -f tests/zypp/CMakeFiles/Date_test.dir/build.make
tests/zypp/CMakeFiles/Date_test.dir/depend
make -f tests/zypp/CMakeFiles/Deltarpm_test.dir/build.make
tests/zypp/CMakeFiles/Deltarpm_test.dir/depend
make[2]: Entering directory '/home/hudson/workspace/libzypp-HEAD/build'
cd <http://river.suse.de/job/libzypp-HEAD/ws/build> && /usr/bin/cmake -E
cmake_depends "Unix Makefiles"
<http://river.suse.de/job/libzypp-HEAD/ws/checkout>
<http://river.suse.de/job/libzypp-HEAD/ws/checkout/tests/zypp>
<http://river.suse.de/job/libzypp-HEAD/ws/build>
<http://river.suse.de/job/libzypp-HEAD/ws/build/tests/zypp>
<http://river.suse.de/job/libzypp-HEAD/ws/build/tests/zypp/CMakeFiles/CheckSum_test.dir/DependInfo.cmake>
--color=
make[2]: Entering directory '/home/hudson/workspace/libzypp-HEAD/build'
cd <http://river.suse.de/job/libzypp-HEAD/ws/build> && /usr/bin/cmake -E
cmake_depends "Unix Makefiles"
<http://river.suse.de/job/libzypp-HEAD/ws/checkout>
<http://river.suse.de/job/libzypp-HEAD/ws/checkout/tests/zypp>
<http://river.suse.de/job/libzypp-HEAD/ws/build>
<http://river.suse.de/job/libzypp-HEAD/ws/build/tests/zypp>
<http://river.suse.de/job/libzypp-HEAD/ws/build/tests/zypp/CMakeFiles/Capabilities_test.dir/DependInfo.cmake>
--color=
cd <http://river.suse.de/job/libzypp-HEAD/ws/build> && /usr/bin/cmake -E
cmake_depends "Unix Makefiles"
<http://river.suse.de/job/libzypp-HEAD/ws/checkout>
<http://river.suse.de/job/libzypp-HEAD/ws/checkout/tests/zypp>
<http://river.suse.de/job/libzypp-HEAD/ws/build>
<http://river.suse.de/job/libzypp-HEAD/ws/build/tests/zypp>
<http://river.suse.de/job/libzypp-HEAD/ws/build/tests/zypp/CMakeFiles/ContentType_test.dir/DependInfo.cmake>
--color=
make[2]: Entering directory '/home/hudson/workspace/libzypp-HEAD/build'
cd <http://river.suse.de/job/libzypp-HEAD/ws/build> && /usr/bin/cmake -E
cmake_depends "Unix Makefiles"
<http://river.suse.de/job/libzypp-HEAD/ws/checkout>
<http://river.suse.de/job/libzypp-HEAD/ws/checkout/tests/media>
<http://river.suse.de/job/libzypp-HEAD/ws/build>
<http://river.suse.de/job/libzypp-HEAD/ws/build/tests/media>
<http://river.suse.de/job/libzypp-HEAD/ws/build/tests/media/CMakeFiles/MetaLinkParser_test.dir/DependInfo.cmake>
--color=
make[2]: Entering directory '/home/hudson/workspace/libzypp-HEAD/build'
cd <http://river.suse.de/job/libzypp-HEAD/ws/build> && /usr/bin/cmake -E
cmake_depends "Unix Makefiles"
<http://river.suse.de/job/libzypp-HEAD/ws/checkout>
<http://river.suse.de/job/libzypp-HEAD/ws/checkout/tests/media>
<http://river.suse.de/job/libzypp-HEAD/ws/build>
<http://river.suse.de/job/libzypp-HEAD/ws/build/tests/media>
<http://river.suse.de/job/libzypp-HEAD/ws/build/tests/media/CMakeFiles/CredentialManager_test.dir/DependInfo.cmake>
--color=
cd <http://river.suse.de/job/libzypp-HEAD/ws/build> && /usr/bin/cmake -E
cmake_depends "Unix Makefiles"
<http://river.suse.de/job/libzypp-HEAD/ws/checkout>
<http://river.suse.de/job/libzypp-HEAD/ws/checkout/tests/zypp>
<http://river.suse.de/job/libzypp-HEAD/ws/build>
<http://river.suse.de/job/libzypp-HEAD/ws/build/tests/zypp>
<http://river.suse.de/job/libzypp-HEAD/ws/build/tests/zypp/CMakeFiles/CpeId_test.dir/DependInfo.cmake>
--color=
make[2]: Entering directory '/home/hudson/workspace/libzypp-HEAD/build'
cd <http://river.suse.de/job/libzypp-HEAD/ws/build> && /usr/bin/cmake -E
cmake_depends "Unix Makefiles"
<http://river.suse.de/job/libzypp-HEAD/ws/checkout>
<http://river.suse.de/job/libzypp-HEAD/ws/checkout/tests/media>
<http://river.suse.de/job/libzypp-HEAD/ws/build>
<http://river.suse.de/job/libzypp-HEAD/ws/build/tests/media>
<http://river.suse.de/job/libzypp-HEAD/ws/build/tests/media/CMakeFiles/CredentialFileReader_test.dir/DependInfo.cmake>
--color=
make[2]: Entering directory '/home/hudson/workspace/libzypp-HEAD/build'
cd <http://river.suse.de/job/libzypp-HEAD/ws/build> && /usr/bin/cmake -E
cmake_depends "Unix Makefiles"
<http://river.suse.de/job/libzypp-HEAD/ws/checkout>
<http://river.suse.de/job/libzypp-HEAD/ws/checkout/tests/zypp>
<http://river.suse.de/job/libzypp-HEAD/ws/build>
<http://river.suse.de/job/libzypp-HEAD/ws/build/tests/zypp>
<http://river.suse.de/job/libzypp-HEAD/ws/build/tests/zypp/CMakeFiles/Arch_test.dir/DependInfo.cmake>
--color=
cd <http://river.suse.de/job/libzypp-HEAD/ws/build> && /usr/bin/cmake -E
cmake_depends "Unix Makefiles"
<http://river.suse.de/job/libzypp-HEAD/ws/checkout>
<http://river.suse.de/job/libzypp-HEAD/ws/checkout/tests/zypp>
<http://river.suse.de/job/libzypp-HEAD/ws/build>
<http://river.suse.de/job/libzypp-HEAD/ws/build/tests/zypp>
<http://river.suse.de/job/libzypp-HEAD/ws/build/tests/zypp/CMakeFiles/Date_test.dir/DependInfo.cmake>
--color=
cd <http://river.suse.de/job/libzypp-HEAD/ws/build> && /usr/bin/cmake -E
cmake_depends "Unix Makefiles"
<http://river.suse.de/job/libzypp-HEAD/ws/checkout>
<http://river.suse.de/job/libzypp-HEAD/ws/checkout/tests/zypp>
<http://river.suse.de/job/libzypp-HEAD/ws/build>
<http://river.suse.de/job/libzypp-HEAD/ws/build/tests/zypp>
<http://river.suse.de/job/libzypp-HEAD/ws/build/tests/zypp/CMakeFiles/Deltarpm_test.dir/DependInfo.cmake>
--color=
Dependee
"<http://river.suse.de/job/libzypp-HEAD/ws/build/tests/media/CMakeFiles/MetaLinkParser_test.dir/DependInfo.cmake";>
is newer than depender
"<http://river.suse.de/job/libzypp-HEAD/ws/build/tests/media/CMakeFiles/MetaLinkParser_test.dir/depend.internal";.>
Dependee
"<http://river.suse.de/job/libzypp-HEAD/ws/build/tests/media/CMakeFiles/CredentialFileReader_test.dir/DependInfo.cmake";>
is newer than depender
"<http://river.suse.de/job/libzypp-HEAD/ws/build/tests/media/CMakeFiles/CredentialFileReader_test.dir/depend.internal";.>
Dependee
"<http://river.suse.de/job/libzypp-HEAD/ws/build/tests/zypp/CMakeFiles/Capabilities_test.dir/DependInfo.cmake";>
is newer than depender
"<http://river.suse.de/job/libzypp-HEAD/ws/build/tests/zypp/CMakeFiles/Capabilities_test.dir/depend.internal";.>
Dependee
"<http://river.suse.de/job/libzypp-HEAD/ws/build/tests/zypp/CMakeFiles/CMakeDirectoryInformation.cmake";>
is newer than depender
"<http://river.suse.de/job/libzypp-HEAD/ws/build/tests/zypp/CMakeFiles/Capabilities_test.dir/depend.internal";.>
Dependee
"<http://river.suse.de/job/libzypp-HEAD/ws/build/tests/zypp/CMakeFiles/ContentType_test.dir/DependInfo.cmake";>
is newer than depender
"<http://river.suse.de/job/libzypp-HEAD/ws/build/tests/zypp/CMakeFiles/ContentType_test.dir/depend.internal";.>
Dependee
"<http://river.suse.de/job/libzypp-HEAD/ws/build/tests/zypp/CMakeFiles/CMakeDirectoryInformation.cmake";>
is newer than depender
"<http://river.suse.de/job/libzypp-HEAD/ws/build/tests/zypp/CMakeFiles/ContentType_test.dir/depend.internal";.>
Dependee
"<http://river.suse.de/job/libzypp-HEAD/ws/build/tests/zypp/CMakeFiles/CheckSum_test.dir/DependInfo.cmake";>
is newer than depender
"<http://river.suse.de/job/libzypp-HEAD/ws/build/tests/zypp/CMakeFiles/CheckSum_test.dir/depend.internal";.>
Dependee
"<http://river.suse.de/job/libzypp-HEAD/ws/build/tests/zypp/CMakeFiles/CMakeDirectoryInformation.cmake";>
is newer than depender
"<http://river.suse.de/job/libzypp-HEAD/ws/build/tests/zypp/CMakeFiles/CheckSum_test.dir/depend.internal";.>
Dependee
"<http://river.suse.de/job/libzypp-HEAD/ws/build/tests/zypp/CMakeFiles/CpeId_test.dir/DependInfo.cmake";>
is newer than depender
"<http://river.suse.de/job/libzypp-HEAD/ws/build/tests/zypp/CMakeFiles/CpeId_test.dir/depend.internal";.>
Dependee
"<http://river.suse.de/job/libzypp-HEAD/ws/build/tests/zypp/CMakeFiles/CMakeDirectoryInformation.cmake";>
is newer than depender
"<http://river.suse.de/job/libzypp-HEAD/ws/build/tests/zypp/CMakeFiles/CpeId_test.dir/depend.internal";.>
Dependee
"<http://river.suse.de/job/libzypp-HEAD/ws/build/tests/media/CMakeFiles/CMakeDirectoryInformation.cmake";>
is newer than depender
"<http://river.suse.de/job/libzypp-HEAD/ws/build/tests/media/CMakeFiles/MetaLinkParser_test.dir/depend.internal";.>
Dependee
"<http://river.suse.de/job/libzypp-HEAD/ws/build/tests/media/CMakeFiles/CredentialManager_test.dir/DependInfo.cmake";>
is newer than depender
"<http://river.suse.de/job/libzypp-HEAD/ws/build/tests/media/CMakeFiles/CredentialManager_test.dir/depend.internal";.>
Dependee
"<http://river.suse.de/job/libzypp-HEAD/ws/build/tests/media/CMakeFiles/CMakeDirectoryInformation.cmake";>
is newer than depender
"<http://river.suse.de/job/libzypp-HEAD/ws/build/tests/media/CMakeFiles/CredentialManager_test.dir/depend.internal";.>
Dependee
"<http://river.suse.de/job/libzypp-HEAD/ws/build/tests/media/CMakeFiles/CMakeDirectoryInformation.cmake";>
is newer than depender
"<http://river.suse.de/job/libzypp-HEAD/ws/build/tests/media/CMakeFiles/CredentialFileReader_test.dir/depend.internal";.>
Dependee
"<http://river.suse.de/job/libzypp-HEAD/ws/build/tests/zypp/CMakeFiles/Date_test.dir/DependInfo.cmake";>
is newer than depender
"<http://river.suse.de/job/libzypp-HEAD/ws/build/tests/zypp/CMakeFiles/Date_test.dir/depend.internal";.>
Dependee
"<http://river.suse.de/job/libzypp-HEAD/ws/build/tests/zypp/CMakeFiles/CMakeDirectoryInformation.cmake";>
is newer than depender
"<http://river.suse.de/job/libzypp-HEAD/ws/build/tests/zypp/CMakeFiles/Date_test.dir/depend.internal";.>
Dependee
"<http://river.suse.de/job/libzypp-HEAD/ws/build/tests/zypp/CMakeFiles/Arch_test.dir/DependInfo.cmake";>
is newer than depender
"<http://river.suse.de/job/libzypp-HEAD/ws/build/tests/zypp/CMakeFiles/Arch_test.dir/depend.internal";.>
Dependee
"<http://river.suse.de/job/libzypp-HEAD/ws/build/tests/zypp/CMakeFiles/CMakeDirectoryInformation.cmake";>
is newer than depender
"<http://river.suse.de/job/libzypp-HEAD/ws/build/tests/zypp/CMakeFiles/Arch_test.dir/depend.internal";.>
Dependee
"<http://river.suse.de/job/libzypp-HEAD/ws/build/tests/zypp/CMakeFiles/Deltarpm_test.dir/DependInfo.cmake";>
is newer than depender
"<http://river.suse.de/job/libzypp-HEAD/ws/build/tests/zypp/CMakeFiles/Deltarpm_test.dir/depend.internal";.>
Dependee
"<http://river.suse.de/job/libzypp-HEAD/ws/build/tests/zypp/CMakeFiles/CMakeDirectoryInformation.cmake";>
is newer than depender
"<http://river.suse.de/job/libzypp-HEAD/ws/build/tests/zypp/CMakeFiles/Deltarpm_test.dir/depend.internal";.>
Scanning dependencies of target CredentialManager_test
Scanning dependencies of target CpeId_test
Scanning dependencies of target ContentType_test
Scanning dependencies of target MetaLinkParser_test
Scanning dependencies of target CredentialFileReader_test
Scanning dependencies of target Date_test
Scanning dependencies of target Arch_test
make[2]: Leaving directory '/home/hudson/workspace/libzypp-HEAD/build'
make[2]: Leaving directory '/home/hudson/workspace/libzypp-HEAD/build'
make[2]: Leaving directory '/home/hudson/workspace/libzypp-HEAD/build'
make[2]: Leaving directory '/home/hudson/workspace/libzypp-HEAD/build'
make[2]: Leaving directory '/home/hudson/workspace/libzypp-HEAD/build'
make -f tests/media/CMakeFiles/CredentialManager_test.dir/build.make
tests/media/CMakeFiles/CredentialManager_test.dir/build
make -f tests/media/CMakeFiles/MetaLinkParser_test.dir/build.make
tests/media/CMakeFiles/MetaLinkParser_test.dir/build
make -f tests/zypp/CMakeFiles/Arch_test.dir/build.make
tests/zypp/CMakeFiles/Arch_test.dir/build
make -f tests/zypp/CMakeFiles/ContentType_test.dir/build.make
tests/zypp/CMakeFiles/ContentType_test.dir/build
Scanning dependencies of target Deltarpm_test
make[2]: Leaving directory '/home/hudson/workspace/libzypp-HEAD/build'
Scanning dependencies of target CheckSum_test
make[2]: Leaving directory '/home/hudson/workspace/libzypp-HEAD/build'
make[2]: Leaving directory '/home/hudson/workspace/libzypp-HEAD/build'
make[2]: Leaving directory '/home/hudson/workspace/libzypp-HEAD/build'
make -f tests/media/CMakeFiles/CredentialFileReader_test.dir/build.make
tests/media/CMakeFiles/CredentialFileReader_test.dir/build
make -f tests/zypp/CMakeFiles/CheckSum_test.dir/build.make
tests/zypp/CMakeFiles/CheckSum_test.dir/build
make -f tests/zypp/CMakeFiles/CpeId_test.dir/build.make
tests/zypp/CMakeFiles/CpeId_test.dir/build
make -f tests/zypp/CMakeFiles/Date_test.dir/build.make
tests/zypp/CMakeFiles/Date_test.dir/build
make -f tests/zypp/CMakeFiles/Deltarpm_test.dir/build.make
tests/zypp/CMakeFiles/Deltarpm_test.dir/build
Scanning dependencies of target Capabilities_test
make[2]: Leaving directory '/home/hudson/workspace/libzypp-HEAD/build'
make -f tests/zypp/CMakeFiles/Capabilities_test.dir/build.make
tests/zypp/CMakeFiles/Capabilities_test.dir/build
make[2]: Entering directory '/home/hudson/workspace/libzypp-HEAD/build'
make[2]: Entering directory '/home/hudson/workspace/libzypp-HEAD/build'
make[2]: Entering directory '/home/hudson/workspace/libzypp-HEAD/build'
make[2]: Entering directory '/home/hudson/workspace/libzypp-HEAD/build'
make[2]: Entering directory '/home/hudson/workspace/libzypp-HEAD/build'
make[2]: Entering directory '/home/hudson/workspace/libzypp-HEAD/build'
make[2]: Entering directory '/home/hudson/workspace/libzypp-HEAD/build'
make[2]: Entering directory '/home/hudson/workspace/libzypp-HEAD/build'
make[2]: Entering directory '/home/hudson/workspace/libzypp-HEAD/build'
make[2]: Entering directory '/home/hudson/workspace/libzypp-HEAD/build'
[ 60%] Building CXX object
tests/media/CMakeFiles/MetaLinkParser_test.dir/MetaLinkParser_test.cc.o
[ 60%] Building CXX object
tests/media/CMakeFiles/CredentialFileReader_test.dir/CredentialFileReader_test.cc.o
[ 60%] Building CXX object tests/zypp/CMakeFiles/Date_test.dir/Date_test.cc.o
cd <http://river.suse.de/job/libzypp-HEAD/ws/build/tests/zypp> &&
/usr/lib/icecc/bin/g++ -DHAVE_PIPE2
-DTESTS_BUILD_DIR=\"<http://river.suse.de/job/libzypp-HEAD/ws/build/tests\";>
-DTESTS_SRC_DIR=\"<http://river.suse.de/job/libzypp-HEAD/ws/checkout/tests\";>
-DVERSION=\"15.20.0\" -D_FILE_OFFSET_BITS=64 -D_RPM_4_X
-fvisibility-inlines-hidden -fno-strict-aliasing -fPIC -g -rdynamic -Wall
-Woverloaded-virtual -Wnon-virtual-dtor -Wl,-as-needed -std=c++11
-fvisibility-inlines-hidden -fno-strict-aliasing -fPIC -g -rdynamic -Wall
-Woverloaded-virtual -Wnon-virtual-dtor -Wl,-as-needed -std=c++11 -O3
-DZYPP_NDEBUG -I<http://river.suse.de/job/libzypp-HEAD/ws/checkout>
-I<http://river.suse.de/job/libzypp-HEAD/ws/build> -I/usr/include/rpm
-I/usr/include/libxml2
-I<http://river.suse.de/job/libzypp-HEAD/ws/checkout/tests/lib>
-DBOOST_TEST_DYN_LINK -DBOOST_TEST_MAIN -DBOOST_AUTO_TEST_MAIN="" -o
CMakeFiles/Date_test.dir/Date_test.cc.o -c
<http://river.suse.de/job/libzypp-HEAD/ws/checkout/tests/zypp/Date_test.cc>
[ 60%] Building CXX object
tests/zypp/CMakeFiles/ContentType_test.dir/ContentType_test.cc.o
cd <http://river.suse.de/job/libzypp-HEAD/ws/build/tests/zypp> &&
/usr/lib/icecc/bin/g++ -DHAVE_PIPE2
-DTESTS_BUILD_DIR=\"<http://river.suse.de/job/libzypp-HEAD/ws/build/tests\";>
-DTESTS_SRC_DIR=\"<http://river.suse.de/job/libzypp-HEAD/ws/checkout/tests\";>
-DVERSION=\"15.20.0\" -D_FILE_OFFSET_BITS=64 -D_RPM_4_X
-fvisibility-inlines-hidden -fno-strict-aliasing -fPIC -g -rdynamic -Wall
-Woverloaded-virtual -Wnon-virtual-dtor -Wl,-as-needed -std=c++11
-fvisibility-inlines-hidden -fno-strict-aliasing -fPIC -g -rdynamic -Wall
-Woverloaded-virtual -Wnon-virtual-dtor -Wl,-as-needed -std=c++11 -O3
-DZYPP_NDEBUG -I<http://river.suse.de/job/libzypp-HEAD/ws/checkout>
-I<http://river.suse.de/job/libzypp-HEAD/ws/build> -I/usr/include/rpm
-I/usr/include/libxml2
-I<http://river.suse.de/job/libzypp-HEAD/ws/checkout/tests/lib>
-DBOOST_TEST_DYN_LINK -DBOOST_TEST_MAIN -DBOOST_AUTO_TEST_MAIN="" -o
CMakeFiles/ContentType_test.dir/ContentType_test.cc.o -c
<http://river.suse.de/job/libzypp-HEAD/ws/checkout/tests/zypp/ContentType_test.cc>
[ 60%] Building CXX object tests/zypp/CMakeFiles/CpeId_test.dir/CpeId_test.cc.o
cd <http://river.suse.de/job/libzypp-HEAD/ws/build/tests/zypp> &&
/usr/lib/icecc/bin/g++ -DHAVE_PIPE2
-DTESTS_BUILD_DIR=\"<http://river.suse.de/job/libzypp-HEAD/ws/build/tests\";>
-DTESTS_SRC_DIR=\"<http://river.suse.de/job/libzypp-HEAD/ws/checkout/tests\";>
-DVERSION=\"15.20.0\" -D_FILE_OFFSET_BITS=64 -D_RPM_4_X
-fvisibility-inlines-hidden -fno-strict-aliasing -fPIC -g -rdynamic -Wall
-Woverloaded-virtual -Wnon-virtual-dtor -Wl,-as-needed -std=c++11
-fvisibility-inlines-hidden -fno-strict-aliasing -fPIC -g -rdynamic -Wall
-Woverloaded-virtual -Wnon-virtual-dtor -Wl,-as-needed -std=c++11 -O3
-DZYPP_NDEBUG -I<http://river.suse.de/job/libzypp-HEAD/ws/checkout>
-I<http://river.suse.de/job/libzypp-HEAD/ws/build> -I/usr/include/rpm
-I/usr/include/libxml2
-I<http://river.suse.de/job/libzypp-HEAD/ws/checkout/tests/lib>
-DBOOST_TEST_DYN_LINK -DBOOST_TEST_MAIN -DBOOST_AUTO_TEST_MAIN="" -o
CMakeFiles/CpeId_test.dir/CpeId_test.cc.o -c
<http://river.suse.de/job/libzypp-HEAD/ws/checkout/tests/zypp/CpeId_test.cc>
[ 61%] Building CXX object
tests/zypp/CMakeFiles/Capabilities_test.dir/Capabilities_test.cc.o
[ 61%] Building CXX object tests/zypp/CMakeFiles/Arch_test.dir/Arch_test.cc.o
cd <http://river.suse.de/job/libzypp-HEAD/ws/build/tests/zypp> &&
/usr/lib/icecc/bin/g++ -DHAVE_PIPE2
-DTESTS_BUILD_DIR=\"<http://river.suse.de/job/libzypp-HEAD/ws/build/tests\";>
-DTESTS_SRC_DIR=\"<http://river.suse.de/job/libzypp-HEAD/ws/checkout/tests\";>
-DVERSION=\"15.20.0\" -D_FILE_OFFSET_BITS=64 -D_RPM_4_X
-fvisibility-inlines-hidden -fno-strict-aliasing -fPIC -g -rdynamic -Wall
-Woverloaded-virtual -Wnon-virtual-dtor -Wl,-as-needed -std=c++11
-fvisibility-inlines-hidden -fno-strict-aliasing -fPIC -g -rdynamic -Wall
-Woverloaded-virtual -Wnon-virtual-dtor -Wl,-as-needed -std=c++11 -O3
-DZYPP_NDEBUG -I<http://river.suse.de/job/libzypp-HEAD/ws/checkout>
-I<http://river.suse.de/job/libzypp-HEAD/ws/build> -I/usr/include/rpm
-I/usr/include/libxml2
-I<http://river.suse.de/job/libzypp-HEAD/ws/checkout/tests/lib>
-DBOOST_TEST_DYN_LINK -DBOOST_TEST_MAIN -DBOOST_AUTO_TEST_MAIN="" -o
CMakeFiles/Arch_test.dir/Arch_test.cc.o -c
<http://river.suse.de/job/libzypp-HEAD/ws/checkout/tests/zypp/Arch_test.cc>
[ 61%] Building CXX object
tests/zypp/CMakeFiles/Deltarpm_test.dir/Deltarpm_test.cc.o
cd <http://river.suse.de/job/libzypp-HEAD/ws/build/tests/media> &&
/usr/lib/icecc/bin/g++ -DHAVE_PIPE2
-DTESTS_BUILD_DIR=\"<http://river.suse.de/job/libzypp-HEAD/ws/build/tests\";>
-DTESTS_SRC_DIR=\"<http://river.suse.de/job/libzypp-HEAD/ws/checkout/tests\";>
-DVERSION=\"15.20.0\" -D_FILE_OFFSET_BITS=64 -D_RPM_4_X
-fvisibility-inlines-hidden -fno-strict-aliasing -fPIC -g -rdynamic -Wall
-Woverloaded-virtual -Wnon-virtual-dtor -Wl,-as-needed -std=c++11
-fvisibility-inlines-hidden -fno-strict-aliasing -fPIC -g -rdynamic -Wall
-Woverloaded-virtual -Wnon-virtual-dtor -Wl,-as-needed -std=c++11 -O3
-DZYPP_NDEBUG -I<http://river.suse.de/job/libzypp-HEAD/ws/checkout>
-I<http://river.suse.de/job/libzypp-HEAD/ws/build> -I/usr/include/rpm
-I/usr/include/libxml2
-I<http://river.suse.de/job/libzypp-HEAD/ws/checkout/tests/lib>
-DBOOST_TEST_DYN_LINK -DBOOST_TEST_MAIN -DBOOST_AUTO_TEST_MAIN="" -o
CMakeFiles/MetaLinkParser_test.dir/MetaLinkParser_test.cc.o -c
<http://river.suse.de/job/libzypp-HEAD/ws/checkout/tests/media/MetaLinkParser_test.cc>
[ 62%] Building CXX object
tests/media/CMakeFiles/CredentialManager_test.dir/CredentialManager_test.cc.o
cd <http://river.suse.de/job/libzypp-HEAD/ws/build/tests/media> &&
/usr/lib/icecc/bin/g++ -DHAVE_PIPE2
-DTESTS_BUILD_DIR=\"<http://river.suse.de/job/libzypp-HEAD/ws/build/tests\";>
-DTESTS_SRC_DIR=\"<http://river.suse.de/job/libzypp-HEAD/ws/checkout/tests\";>
-DVERSION=\"15.20.0\" -D_FILE_OFFSET_BITS=64 -D_RPM_4_X
-fvisibility-inlines-hidden -fno-strict-aliasing -fPIC -g -rdynamic -Wall
-Woverloaded-virtual -Wnon-virtual-dtor -Wl,-as-needed -std=c++11
-fvisibility-inlines-hidden -fno-strict-aliasing -fPIC -g -rdynamic -Wall
-Woverloaded-virtual -Wnon-virtual-dtor -Wl,-as-needed -std=c++11 -O3
-DZYPP_NDEBUG -I<http://river.suse.de/job/libzypp-HEAD/ws/checkout>
-I<http://river.suse.de/job/libzypp-HEAD/ws/build> -I/usr/include/rpm
-I/usr/include/libxml2
-I<http://river.suse.de/job/libzypp-HEAD/ws/checkout/tests/lib>
-DBOOST_TEST_DYN_LINK -DBOOST_TEST_MAIN -DBOOST_AUTO_TEST_MAIN="" -o
CMakeFiles/CredentialManager_test.dir/CredentialManager_test.cc.o -c
<http://river.suse.de/job/libzypp-HEAD/ws/checkout/tests/media/CredentialManager_test.cc>
cd <http://river.suse.de/job/libzypp-HEAD/ws/build/tests/media> &&
/usr/lib/icecc/bin/g++ -DHAVE_PIPE2
-DTESTS_BUILD_DIR=\"<http://river.suse.de/job/libzypp-HEAD/ws/build/tests\";>
-DTESTS_SRC_DIR=\"<http://river.suse.de/job/libzypp-HEAD/ws/checkout/tests\";>
-DVERSION=\"15.20.0\" -D_FILE_OFFSET_BITS=64 -D_RPM_4_X
-fvisibility-inlines-hidden -fno-strict-aliasing -fPIC -g -rdynamic -Wall
-Woverloaded-virtual -Wnon-virtual-dtor -Wl,-as-needed -std=c++11
-fvisibility-inlines-hidden -fno-strict-aliasing -fPIC -g -rdynamic -Wall
-Woverloaded-virtual -Wnon-virtual-dtor -Wl,-as-needed -std=c++11 -O3
-DZYPP_NDEBUG -I<http://river.suse.de/job/libzypp-HEAD/ws/checkout>
-I<http://river.suse.de/job/libzypp-HEAD/ws/build> -I/usr/include/rpm
-I/usr/include/libxml2
-I<http://river.suse.de/job/libzypp-HEAD/ws/checkout/tests/lib>
-DBOOST_TEST_DYN_LINK -DBOOST_TEST_MAIN -DBOOST_AUTO_TEST_MAIN="" -o
CMakeFiles/CredentialFileReader_test.dir/CredentialFileReader_test.cc.o -c
<http://river.suse.de/job/libzypp-HEAD/ws/checkout/tests/media/CredentialFileReader_test.cc>
[ 62%] Building CXX object
tests/zypp/CMakeFiles/CheckSum_test.dir/CheckSum_test.cc.o
cd <http://river.suse.de/job/libzypp-HEAD/ws/build/tests/zypp> &&
/usr/lib/icecc/bin/g++ -DHAVE_PIPE2
-DTESTS_BUILD_DIR=\"<http://river.suse.de/job/libzypp-HEAD/ws/build/tests\";>
-DTESTS_SRC_DIR=\"<http://river.suse.de/job/libzypp-HEAD/ws/checkout/tests\";>
-DVERSION=\"15.20.0\" -D_FILE_OFFSET_BITS=64 -D_RPM_4_X
-fvisibility-inlines-hidden -fno-strict-aliasing -fPIC -g -rdynamic -Wall
-Woverloaded-virtual -Wnon-virtual-dtor -Wl,-as-needed -std=c++11
-fvisibility-inlines-hidden -fno-strict-aliasing -fPIC -g -rdynamic -Wall
-Woverloaded-virtual -Wnon-virtual-dtor -Wl,-as-needed -std=c++11 -O3
-DZYPP_NDEBUG -I<http://river.suse.de/job/libzypp-HEAD/ws/checkout>
-I<http://river.suse.de/job/libzypp-HEAD/ws/build> -I/usr/include/rpm
-I/usr/include/libxml2
-I<http://river.suse.de/job/libzypp-HEAD/ws/checkout/tests/lib>
-DBOOST_TEST_DYN_LINK -DBOOST_TEST_MAIN -DBOOST_AUTO_TEST_MAIN="" -o
CMakeFiles/CheckSum_test.dir/CheckSum_test.cc.o -c
<http://river.suse.de/job/libzypp-HEAD/ws/checkout/tests/zypp/CheckSum_test.cc>
cd <http://river.suse.de/job/libzypp-HEAD/ws/build/tests/zypp> &&
/usr/lib/icecc/bin/g++ -DHAVE_PIPE2
-DTESTS_BUILD_DIR=\"<http://river.suse.de/job/libzypp-HEAD/ws/build/tests\";>
-DTESTS_SRC_DIR=\"<http://river.suse.de/job/libzypp-HEAD/ws/checkout/tests\";>
-DVERSION=\"15.20.0\" -D_FILE_OFFSET_BITS=64 -D_RPM_4_X
-fvisibility-inlines-hidden -fno-strict-aliasing -fPIC -g -rdynamic -Wall
-Woverloaded-virtual -Wnon-virtual-dtor -Wl,-as-needed -std=c++11
-fvisibility-inlines-hidden -fno-strict-aliasing -fPIC -g -rdynamic -Wall
-Woverloaded-virtual -Wnon-virtual-dtor -Wl,-as-needed -std=c++11 -O3
-DZYPP_NDEBUG -I<http://river.suse.de/job/libzypp-HEAD/ws/checkout>
-I<http://river.suse.de/job/libzypp-HEAD/ws/build> -I/usr/include/rpm
-I/usr/include/libxml2
-I<http://river.suse.de/job/libzypp-HEAD/ws/checkout/tests/lib>
-DBOOST_TEST_DYN_LINK -DBOOST_TEST_MAIN -DBOOST_AUTO_TEST_MAIN="" -o
CMakeFiles/Deltarpm_test.dir/Deltarpm_test.cc.o -c
<http://river.suse.de/job/libzypp-HEAD/ws/checkout/tests/zypp/Deltarpm_test.cc>
cd <http://river.suse.de/job/libzypp-HEAD/ws/build/tests/zypp> &&
/usr/lib/icecc/bin/g++ -DHAVE_PIPE2
-DTESTS_BUILD_DIR=\"<http://river.suse.de/job/libzypp-HEAD/ws/build/tests\";>
-DTESTS_SRC_DIR=\"<http://river.suse.de/job/libzypp-HEAD/ws/checkout/tests\";>
-DVERSION=\"15.20.0\" -D_FILE_OFFSET_BITS=64 -D_RPM_4_X
-fvisibility-inlines-hidden -fno-strict-aliasing -fPIC -g -rdynamic -Wall
-Woverloaded-virtual -Wnon-virtual-dtor -Wl,-as-needed -std=c++11
-fvisibility-inlines-hidden -fno-strict-aliasing -fPIC -g -rdynamic -Wall
-Woverloaded-virtual -Wnon-virtual-dtor -Wl,-as-needed -std=c++11 -O3
-DZYPP_NDEBUG -I<http://river.suse.de/job/libzypp-HEAD/ws/checkout>
-I<http://river.suse.de/job/libzypp-HEAD/ws/build> -I/usr/include/rpm
-I/usr/include/libxml2
-I<http://river.suse.de/job/libzypp-HEAD/ws/checkout/tests/lib>
-DBOOST_TEST_DYN_LINK -DBOOST_TEST_MAIN -DBOOST_AUTO_TEST_MAIN="" -o
CMakeFiles/Capabilities_test.dir/Capabilities_test.cc.o -c
<http://river.suse.de/job/libzypp-HEAD/ws/checkout/tests/zypp/Capabilities_test.cc>
[ 63%] Linking CXX executable ContentType_test
cd <http://river.suse.de/job/libzypp-HEAD/ws/build/tests/zypp> &&
/usr/bin/cmake -E cmake_link_script CMakeFiles/ContentType_test.dir/link.txt
--verbose=1
/usr/lib/icecc/bin/g++ -fvisibility-inlines-hidden -fno-strict-aliasing
-fPIC -g -rdynamic -Wall -Woverloaded-virtual -Wnon-virtual-dtor -Wl,-as-needed
-std=c++11 -fvisibility-inlines-hidden -fno-strict-aliasing -fPIC -g -rdynamic
-Wall -Woverloaded-virtual -Wnon-virtual-dtor -Wl,-as-needed -std=c++11 -O3
-DZYPP_NDEBUG CMakeFiles/ContentType_test.dir/ContentType_test.cc.o -o
ContentType_test -rdynamic -lboost_unit_test_framework-mt
../lib/libzypp_test_utils.a ../../zypp/libzypp.so.1519.1.0 -lutil -lrpm -lcurl
-lxml2 -lz -lsolv -lsolvext -lexpat -lssl -lcrypto
../../vendor/mongoose/libmongoose.a -ldl -lpthread -lboost_thread-mt
-Wl,-rpath,<http://river.suse.de/job/libzypp-HEAD/ws/build/zypp>
make[2]: Leaving directory '/home/hudson/workspace/libzypp-HEAD/build'
[ 63%] Built target ContentType_test
make -f tests/zypp/CMakeFiles/Digest_test.dir/build.make
tests/zypp/CMakeFiles/Digest_test.dir/depend
make[2]: Entering directory '/home/hudson/workspace/libzypp-HEAD/build'
cd <http://river.suse.de/job/libzypp-HEAD/ws/build> && /usr/bin/cmake -E
cmake_depends "Unix Makefiles"
<http://river.suse.de/job/libzypp-HEAD/ws/checkout>
<http://river.suse.de/job/libzypp-HEAD/ws/checkout/tests/zypp>
<http://river.suse.de/job/libzypp-HEAD/ws/build>
<http://river.suse.de/job/libzypp-HEAD/ws/build/tests/zypp>
<http://river.suse.de/job/libzypp-HEAD/ws/build/tests/zypp/CMakeFiles/Digest_test.dir/DependInfo.cmake>
--color=
Dependee
"<http://river.suse.de/job/libzypp-HEAD/ws/build/tests/zypp/CMakeFiles/Digest_test.dir/DependInfo.cmake";>
is newer than depender
"<http://river.suse.de/job/libzypp-HEAD/ws/build/tests/zypp/CMakeFiles/Digest_test.dir/depend.internal";.>
Dependee
"<http://river.suse.de/job/libzypp-HEAD/ws/build/tests/zypp/CMakeFiles/CMakeDirectoryInformation.cmake";>
is newer than depender
"<http://river.suse.de/job/libzypp-HEAD/ws/build/tests/zypp/CMakeFiles/Digest_test.dir/depend.internal";.>
Scanning dependencies of target Digest_test
make[2]: Leaving directory '/home/hudson/workspace/libzypp-HEAD/build'
make -f tests/zypp/CMakeFiles/Digest_test.dir/build.make
tests/zypp/CMakeFiles/Digest_test.dir/build
make[2]: Entering directory '/home/hudson/workspace/libzypp-HEAD/build'
[ 63%] Building CXX object
tests/zypp/CMakeFiles/Digest_test.dir/Digest_test.cc.o
cd <http://river.suse.de/job/libzypp-HEAD/ws/build/tests/zypp> &&
/usr/lib/icecc/bin/g++ -DHAVE_PIPE2
-DTESTS_BUILD_DIR=\"<http://river.suse.de/job/libzypp-HEAD/ws/build/tests\";>
-DTESTS_SRC_DIR=\"<http://river.suse.de/job/libzypp-HEAD/ws/checkout/tests\";>
-DVERSION=\"15.20.0\" -D_FILE_OFFSET_BITS=64 -D_RPM_4_X
-fvisibility-inlines-hidden -fno-strict-aliasing -fPIC -g -rdynamic -Wall
-Woverloaded-virtual -Wnon-virtual-dtor -Wl,-as-needed -std=c++11
-fvisibility-inlines-hidden -fno-strict-aliasing -fPIC -g -rdynamic -Wall
-Woverloaded-virtual -Wnon-virtual-dtor -Wl,-as-needed -std=c++11 -O3
-DZYPP_NDEBUG -I<http://river.suse.de/job/libzypp-HEAD/ws/checkout>
-I<http://river.suse.de/job/libzypp-HEAD/ws/build> -I/usr/include/rpm
-I/usr/include/libxml2
-I<http://river.suse.de/job/libzypp-HEAD/ws/checkout/tests/lib>
-DBOOST_TEST_DYN_LINK -DBOOST_TEST_MAIN -DBOOST_AUTO_TEST_MAIN="" -o
CMakeFiles/Digest_test.dir/Digest_test.cc.o -c
<http://river.suse.de/job/libzypp-HEAD/ws/checkout/tests/zypp/Digest_test.cc>
[ 65%] Linking CXX executable Date_test
cd <http://river.suse.de/job/libzypp-HEAD/ws/build/tests/zypp> &&
/usr/bin/cmake -E cmake_link_script CMakeFiles/Date_test.dir/link.txt
--verbose=1
/usr/lib/icecc/bin/g++ -fvisibility-inlines-hidden -fno-strict-aliasing
-fPIC -g -rdynamic -Wall -Woverloaded-virtual -Wnon-virtual-dtor -Wl,-as-needed
-std=c++11 -fvisibility-inlines-hidden -fno-strict-aliasing -fPIC -g -rdynamic
-Wall -Woverloaded-virtual -Wnon-virtual-dtor -Wl,-as-needed -std=c++11 -O3
-DZYPP_NDEBUG CMakeFiles/Date_test.dir/Date_test.cc.o -o Date_test -rdynamic
-lboost_unit_test_framework-mt ../lib/libzypp_test_utils.a
../../zypp/libzypp.so.1519.1.0 -lutil -lrpm -lcurl -lxml2 -lz -lsolv -lsolvext
-lexpat -lssl -lcrypto ../../vendor/mongoose/libmongoose.a -ldl -lpthread
-lboost_thread-mt
-Wl,-rpath,<http://river.suse.de/job/libzypp-HEAD/ws/build/zypp>
[ 65%] Linking CXX executable CredentialFileReader_test
cd <http://river.suse.de/job/libzypp-HEAD/ws/build/tests/media> &&
/usr/bin/cmake -E cmake_link_script
CMakeFiles/CredentialFileReader_test.dir/link.txt --verbose=1
/usr/lib/icecc/bin/g++ -fvisibility-inlines-hidden -fno-strict-aliasing
-fPIC -g -rdynamic -Wall -Woverloaded-virtual -Wnon-virtual-dtor -Wl,-as-needed
-std=c++11 -fvisibility-inlines-hidden -fno-strict-aliasing -fPIC -g -rdynamic
-Wall -Woverloaded-virtual -Wnon-virtual-dtor -Wl,-as-needed -std=c++11 -O3
-DZYPP_NDEBUG
CMakeFiles/CredentialFileReader_test.dir/CredentialFileReader_test.cc.o -o
CredentialFileReader_test -rdynamic -lboost_unit_test_framework-mt
../lib/libzypp_test_utils.a ../../zypp/libzypp.so.1519.1.0 -lutil -lrpm -lcurl
-lxml2 -lz -lsolv -lsolvext -lexpat -lssl -lcrypto
../../vendor/mongoose/libmongoose.a -ldl -lpthread -lboost_thread-mt
-Wl,-rpath,<http://river.suse.de/job/libzypp-HEAD/ws/build/zypp>
[ 65%] Linking CXX executable MetaLinkParser_test
cd <http://river.suse.de/job/libzypp-HEAD/ws/build/tests/media> &&
/usr/bin/cmake -E cmake_link_script CMakeFiles/MetaLinkParser_test.dir/link.txt
--verbose=1
/usr/lib/icecc/bin/g++ -fvisibility-inlines-hidden -fno-strict-aliasing
-fPIC -g -rdynamic -Wall -Woverloaded-virtual -Wnon-virtual-dtor -Wl,-as-needed
-std=c++11 -fvisibility-inlines-hidden -fno-strict-aliasing -fPIC -g -rdynamic
-Wall -Woverloaded-virtual -Wnon-virtual-dtor -Wl,-as-needed -std=c++11 -O3
-DZYPP_NDEBUG CMakeFiles/MetaLinkParser_test.dir/MetaLinkParser_test.cc.o -o
MetaLinkParser_test -rdynamic -lboost_unit_test_framework-mt
../lib/libzypp_test_utils.a ../../zypp/libzypp.so.1519.1.0 -lutil -lrpm -lcurl
-lxml2 -lz -lsolv -lsolvext -lexpat -lssl -lcrypto
../../vendor/mongoose/libmongoose.a -ldl -lpthread -lboost_thread-mt
-Wl,-rpath,<http://river.suse.de/job/libzypp-HEAD/ws/build/zypp>
make[2]: Leaving directory '/home/hudson/workspace/libzypp-HEAD/build'
[ 65%] Built target Date_test
make -f tests/zypp/CMakeFiles/Dup_test.dir/build.make
tests/zypp/CMakeFiles/Dup_test.dir/depend
make[2]: Entering directory '/home/hudson/workspace/libzypp-HEAD/build'
cd <http://river.suse.de/job/libzypp-HEAD/ws/build> && /usr/bin/cmake -E
cmake_depends "Unix Makefiles"
<http://river.suse.de/job/libzypp-HEAD/ws/checkout>
<http://river.suse.de/job/libzypp-HEAD/ws/checkout/tests/zypp>
<http://river.suse.de/job/libzypp-HEAD/ws/build>
<http://river.suse.de/job/libzypp-HEAD/ws/build/tests/zypp>
<http://river.suse.de/job/libzypp-HEAD/ws/build/tests/zypp/CMakeFiles/Dup_test.dir/DependInfo.cmake>
--color=
Dependee
"<http://river.suse.de/job/libzypp-HEAD/ws/build/tests/zypp/CMakeFiles/Dup_test.dir/DependInfo.cmake";>
is newer than depender
"<http://river.suse.de/job/libzypp-HEAD/ws/build/tests/zypp/CMakeFiles/Dup_test.dir/depend.internal";.>
Dependee
"<http://river.suse.de/job/libzypp-HEAD/ws/build/tests/zypp/CMakeFiles/CMakeDirectoryInformation.cmake";>
is newer than depender
"<http://river.suse.de/job/libzypp-HEAD/ws/build/tests/zypp/CMakeFiles/Dup_test.dir/depend.internal";.>
Scanning dependencies of target Dup_test
make[2]: Leaving directory '/home/hudson/workspace/libzypp-HEAD/build'
make -f tests/zypp/CMakeFiles/Dup_test.dir/build.make
tests/zypp/CMakeFiles/Dup_test.dir/build
make[2]: Entering directory '/home/hudson/workspace/libzypp-HEAD/build'
[ 65%] Building CXX object tests/zypp/CMakeFiles/Dup_test.dir/Dup_test.cc.o
cd <http://river.suse.de/job/libzypp-HEAD/ws/build/tests/zypp> &&
/usr/lib/icecc/bin/g++ -DHAVE_PIPE2
-DTESTS_BUILD_DIR=\"<http://river.suse.de/job/libzypp-HEAD/ws/build/tests\";>
-DTESTS_SRC_DIR=\"<http://river.suse.de/job/libzypp-HEAD/ws/checkout/tests\";>
-DVERSION=\"15.20.0\" -D_FILE_OFFSET_BITS=64 -D_RPM_4_X
-fvisibility-inlines-hidden -fno-strict-aliasing -fPIC -g -rdynamic -Wall
-Woverloaded-virtual -Wnon-virtual-dtor -Wl,-as-needed -std=c++11
-fvisibility-inlines-hidden -fno-strict-aliasing -fPIC -g -rdynamic -Wall
-Woverloaded-virtual -Wnon-virtual-dtor -Wl,-as-needed -std=c++11 -O3
-DZYPP_NDEBUG -I<http://river.suse.de/job/libzypp-HEAD/ws/checkout>
-I<http://river.suse.de/job/libzypp-HEAD/ws/build> -I/usr/include/rpm
-I/usr/include/libxml2
-I<http://river.suse.de/job/libzypp-HEAD/ws/checkout/tests/lib>
-DBOOST_TEST_DYN_LINK -DBOOST_TEST_MAIN -DBOOST_AUTO_TEST_MAIN="" -o
CMakeFiles/Dup_test.dir/Dup_test.cc.o -c
<http://river.suse.de/job/libzypp-HEAD/ws/checkout/tests/zypp/Dup_test.cc>
<http://river.suse.de/job/libzypp-HEAD/ws/checkout/tests/zypp/Arch_test.cc>:19:26:
error: 'boost::test_tools::close_at_tolerance' has not been declared
ICECC[7538] 10:25:58: Compiled on 10.161.8.222
tests/zypp/CMakeFiles/Arch_test.dir/build.make:62: recipe for target
'tests/zypp/CMakeFiles/Arch_test.dir/Arch_test.cc.o' failed
make[2]: *** [tests/zypp/CMakeFiles/Arch_test.dir/Arch_test.cc.o] Error 1
make[2]: Leaving directory '/home/hudson/workspace/libzypp-HEAD/build'
CMakeFiles/Makefile2:2633: recipe for target
'tests/zypp/CMakeFiles/Arch_test.dir/all' failed
make[1]: *** [tests/zypp/CMakeFiles/Arch_test.dir/all] Error 2
make[1]: *** Waiting for unfinished jobs....
make[2]: Leaving directory '/home/hudson/workspace/libzypp-HEAD/build'
[ 65%] Built target CredentialFileReader_test
make[2]: Leaving directory '/home/hudson/workspace/libzypp-HEAD/build'
[ 65%] Built target MetaLinkParser_test
[ 65%] Linking CXX executable Deltarpm_test
cd <http://river.suse.de/job/libzypp-HEAD/ws/build/tests/zypp> &&
/usr/bin/cmake -E cmake_link_script CMakeFiles/Deltarpm_test.dir/link.txt
--verbose=1
/usr/lib/icecc/bin/g++ -fvisibility-inlines-hidden -fno-strict-aliasing
-fPIC -g -rdynamic -Wall -Woverloaded-virtual -Wnon-virtual-dtor -Wl,-as-needed
-std=c++11 -fvisibility-inlines-hidden -fno-strict-aliasing -fPIC -g -rdynamic
-Wall -Woverloaded-virtual -Wnon-virtual-dtor -Wl,-as-needed -std=c++11 -O3
-DZYPP_NDEBUG CMakeFiles/Deltarpm_test.dir/Deltarpm_test.cc.o -o
Deltarpm_test -rdynamic -lboost_unit_test_framework-mt
../lib/libzypp_test_utils.a ../../zypp/libzypp.so.1519.1.0 -lutil -lrpm -lcurl
-lxml2 -lz -lsolv -lsolvext -lexpat -lssl -lcrypto
../../vendor/mongoose/libmongoose.a -ldl -lpthread -lboost_thread-mt
-Wl,-rpath,<http://river.suse.de/job/libzypp-HEAD/ws/build/zypp>
[ 65%] Linking CXX executable CredentialManager_test
cd <http://river.suse.de/job/libzypp-HEAD/ws/build/tests/media> &&
/usr/bin/cmake -E cmake_link_script
CMakeFiles/CredentialManager_test.dir/link.txt --verbose=1
[ 65%] Linking CXX executable CheckSum_test
/usr/lib/icecc/bin/g++ -fvisibility-inlines-hidden -fno-strict-aliasing
-fPIC -g -rdynamic -Wall -Woverloaded-virtual -Wnon-virtual-dtor -Wl,-as-needed
-std=c++11 -fvisibility-inlines-hidden -fno-strict-aliasing -fPIC -g -rdynamic
-Wall -Woverloaded-virtual -Wnon-virtual-dtor -Wl,-as-needed -std=c++11 -O3
-DZYPP_NDEBUG
CMakeFiles/CredentialManager_test.dir/CredentialManager_test.cc.o -o
CredentialManager_test -rdynamic -lboost_unit_test_framework-mt
../lib/libzypp_test_utils.a ../../zypp/libzypp.so.1519.1.0 -lutil -lrpm -lcurl
-lxml2 -lz -lsolv -lsolvext -lexpat -lssl -lcrypto
../../vendor/mongoose/libmongoose.a -ldl -lpthread -lboost_thread-mt
-Wl,-rpath,<http://river.suse.de/job/libzypp-HEAD/ws/build/zypp>
cd <http://river.suse.de/job/libzypp-HEAD/ws/build/tests/zypp> &&
/usr/bin/cmake -E cmake_link_script CMakeFiles/CheckSum_test.dir/link.txt
--verbose=1
/usr/lib/icecc/bin/g++ -fvisibility-inlines-hidden -fno-strict-aliasing
-fPIC -g -rdynamic -Wall -Woverloaded-virtual -Wnon-virtual-dtor -Wl,-as-needed
-std=c++11 -fvisibility-inlines-hidden -fno-strict-aliasing -fPIC -g -rdynamic
-Wall -Woverloaded-virtual -Wnon-virtual-dtor -Wl,-as-needed -std=c++11 -O3
-DZYPP_NDEBUG CMakeFiles/CheckSum_test.dir/CheckSum_test.cc.o -o
CheckSum_test -rdynamic -lboost_unit_test_framework-mt
../lib/libzypp_test_utils.a ../../zypp/libzypp.so.1519.1.0 -lutil -lrpm -lcurl
-lxml2 -lz -lsolv -lsolvext -lexpat -lssl -lcrypto
../../vendor/mongoose/libmongoose.a -ldl -lpthread -lboost_thread-mt
-Wl,-rpath,<http://river.suse.de/job/libzypp-HEAD/ws/build/zypp>
<http://river.suse.de/job/libzypp-HEAD/ws/checkout/tests/zypp/Capabilities_test.cc>:19:26:
error: 'boost::test_tools::close_at_tolerance' has not been declared
ICECC[7543] 10:26:01: Compiled on 10.161.8.222
tests/zypp/CMakeFiles/Capabilities_test.dir/build.make:62: recipe for target
'tests/zypp/CMakeFiles/Capabilities_test.dir/Capabilities_test.cc.o' failed
make[2]: ***
[tests/zypp/CMakeFiles/Capabilities_test.dir/Capabilities_test.cc.o] Error 1
make[2]: Leaving directory '/home/hudson/workspace/libzypp-HEAD/build'
CMakeFiles/Makefile2:2667: recipe for target
'tests/zypp/CMakeFiles/Capabilities_test.dir/all' failed
make[1]: *** [tests/zypp/CMakeFiles/Capabilities_test.dir/all] Error 2
make[2]: Leaving directory '/home/hudson/workspace/libzypp-HEAD/build'
[ 65%] Built target Deltarpm_test
make[2]: Leaving directory '/home/hudson/workspace/libzypp-HEAD/build'
[ 65%] Built target CredentialManager_test
[ 65%] Linking CXX executable CpeId_test
cd <http://river.suse.de/job/libzypp-HEAD/ws/build/tests/zypp> &&
/usr/bin/cmake -E cmake_link_script CMakeFiles/CpeId_test.dir/link.txt
--verbose=1
/usr/lib/icecc/bin/g++ -fvisibility-inlines-hidden -fno-strict-aliasing
-fPIC -g -rdynamic -Wall -Woverloaded-virtual -Wnon-virtual-dtor -Wl,-as-needed
-std=c++11 -fvisibility-inlines-hidden -fno-strict-aliasing -fPIC -g -rdynamic
-Wall -Woverloaded-virtual -Wnon-virtual-dtor -Wl,-as-needed -std=c++11 -O3
-DZYPP_NDEBUG CMakeFiles/CpeId_test.dir/CpeId_test.cc.o -o CpeId_test
-rdynamic -lboost_unit_test_framework-mt ../lib/libzypp_test_utils.a
../../zypp/libzypp.so.1519.1.0 -lutil -lrpm -lcurl -lxml2 -lz -lsolv -lsolvext
-lexpat -lssl -lcrypto ../../vendor/mongoose/libmongoose.a -ldl -lpthread
-lboost_thread-mt
-Wl,-rpath,<http://river.suse.de/job/libzypp-HEAD/ws/build/zypp>
make[2]: Leaving directory '/home/hudson/workspace/libzypp-HEAD/build'
[ 65%] Built target CheckSum_test
[ 65%] Linking CXX executable Digest_test
cd <http://river.suse.de/job/libzypp-HEAD/ws/build/tests/zypp> &&
/usr/bin/cmake -E cmake_link_script CMakeFiles/Digest_test.dir/link.txt
--verbose=1
/usr/lib/icecc/bin/g++ -fvisibility-inlines-hidden -fno-strict-aliasing
-fPIC -g -rdynamic -Wall -Woverloaded-virtual -Wnon-virtual-dtor -Wl,-as-needed
-std=c++11 -fvisibility-inlines-hidden -fno-strict-aliasing -fPIC -g -rdynamic
-Wall -Woverloaded-virtual -Wnon-virtual-dtor -Wl,-as-needed -std=c++11 -O3
-DZYPP_NDEBUG CMakeFiles/Digest_test.dir/Digest_test.cc.o -o Digest_test
-rdynamic -lboost_unit_test_framework-mt ../lib/libzypp_test_utils.a
../../zypp/libzypp.so.1519.1.0 -lutil -lrpm -lcurl -lxml2 -lz -lsolv -lsolvext
-lexpat -lssl -lcrypto ../../vendor/mongoose/libmongoose.a -ldl -lpthread
-lboost_thread-mt
-Wl,-rpath,<http://river.suse.de/job/libzypp-HEAD/ws/build/zypp>
make[2]: Leaving directory '/home/hudson/workspace/libzypp-HEAD/build'
[ 65%] Built target CpeId_test
make[2]: Leaving directory '/home/hudson/workspace/libzypp-HEAD/build'
[ 65%] Built target Digest_test
[ 66%] Linking CXX executable Dup_test
cd <http://river.suse.de/job/libzypp-HEAD/ws/build/tests/zypp> &&
/usr/bin/cmake -E cmake_link_script CMakeFiles/Dup_test.dir/link.txt --verbose=1
/usr/lib/icecc/bin/g++ -fvisibility-inlines-hidden -fno-strict-aliasing
-fPIC -g -rdynamic -Wall -Woverloaded-virtual -Wnon-virtual-dtor -Wl,-as-needed
-std=c++11 -fvisibility-inlines-hidden -fno-strict-aliasing -fPIC -g -rdynamic
-Wall -Woverloaded-virtual -Wnon-virtual-dtor -Wl,-as-needed -std=c++11 -O3
-DZYPP_NDEBUG CMakeFiles/Dup_test.dir/Dup_test.cc.o -o Dup_test -rdynamic
-lboost_unit_test_framework-mt ../lib/libzypp_test_utils.a
../../zypp/libzypp.so.1519.1.0 -lutil -lrpm -lcurl -lxml2 -lz -lsolv -lsolvext
-lexpat -lssl -lcrypto ../../vendor/mongoose/libmongoose.a -ldl -lpthread
-lboost_thread-mt
-Wl,-rpath,<http://river.suse.de/job/libzypp-HEAD/ws/build/zypp>
make[2]: Leaving directory '/home/hudson/workspace/libzypp-HEAD/build'
[ 66%] Built target Dup_test
make[1]: Leaving directory '/home/hudson/workspace/libzypp-HEAD/build'
Makefile:160: recipe for target 'all' failed
make: *** [all] Error 2
Build step 'Execute shell' marked build as failure
Archiving artifacts

< Previous Next >
This Thread
Follow Ups
References