Mailinglist Archive: zypp-commit (42 mails)

< Previous Next >
[zypp-commit] Build failed in Jenkins: libzypp-testsuite-HEAD #1528
  • From: hudson@xxxxxxx
  • Date: Mon, 26 Oct 2015 11:39:55 +0100 (CET)
  • Message-id: <697530854.651.1445855995432.JavaMail.jenkins@river>
See <http://river.suse.de/job/libzypp-testsuite-HEAD/1528/>

------------------------------------------
Started by user anonymous
Building remotely on node-zyppHEAD in workspace
<http://river.suse.de/job/libzypp-testsuite-HEAD/ws/>
Checkout:libzypp-testsuite-HEAD /
<http://river.suse.de/job/libzypp-testsuite-HEAD/ws/> -
hudson.remoting.Channel@50ee337c:node-zyppHEAD
Using strategy: Default
Last Built Revision: Revision 2676c66154ffd5914b692c67520a2770b80515af
(origin/master)
Checkout:checkout /
<http://river.suse.de/job/libzypp-testsuite-HEAD/ws/checkout> -
hudson.remoting.LocalChannel@31dad50f
Fetching changes from the remote Git repository
Fetching upstream changes from
git://github.com/openSUSE/zypp-solver-testcase-runner.git
Commencing build of Revision 2676c66154ffd5914b692c67520a2770b80515af
(origin/master)
Checking out Revision 2676c66154ffd5914b692c67520a2770b80515af (origin/master)
[copy-to-slave] Copying '.hudson-scripts/**', excluding nothing, from
'file:/var/lib/jenkins/userContent/' on the master to
'<http://river.suse.de/job/libzypp-testsuite-HEAD/ws/'> on 'node-zyppHEAD'.
[libzypp-testsuite-HEAD] $ /bin/sh -xe /tmp/hudson7842840378071341926.sh
+ echo '### BUILD ###'
### BUILD ###
+ export AUTOTOOLS=1
+ AUTOTOOLS=1
+ echo '==> Reading build configuration'
==> Reading build configuration
+ . .hudson-scripts/base-functions
++ . .hudson-scripts/ascii_art
++ trap 'error_exit $?' ERR
++ echo 'Job running as user: root'
Job running as user: root
+++ date '+%F %T'
++ echo 'Started at: 2015-10-26 11:39:42'
Started at: 2015-10-26 11:39:42
+++ hostname --fqdn
++ export SITENAME=host-44-0-0-74.openstack.local.p2.cloud.suse.de
++ SITENAME=host-44-0-0-74.openstack.local.p2.cloud.suse.de
++ export TARGET_DIST=HEAD
++ TARGET_DIST=HEAD
++ export PROJECT=libzypp-testsuite
++ PROJECT=libzypp-testsuite
+ . .hudson-scripts/build-functions
+ . .hudson-scripts/obs-functions
++ trap 'error_exit $?' ERR
++ export ALLOW_OBS_SUBMIT=yes
++ ALLOW_OBS_SUBMIT=yes
+ . .hudson-scripts/setup-buildenvironment
++ export RUNTESTS=1
++ RUNTESTS=1
++ export ICEJOBS=4
++ ICEJOBS=4
++ export CMAKE_INSTALL_PREFIX=/usr
++ CMAKE_INSTALL_PREFIX=/usr
+++ uname -m
+++ hostname -f
++ export 'CMAKEPARAS=-DBUILDNAME=x86_64
-DSITE=host-44-0-0-74.openstack.local.p2.cloud.suse.de
-DCMAKE_INSTALL_PREFIX=/usr'
++ CMAKEPARAS='-DBUILDNAME=x86_64
-DSITE=host-44-0-0-74.openstack.local.p2.cloud.suse.de
-DCMAKE_INSTALL_PREFIX=/usr'
++ export ICECCDIR=<http://river.suse.de/job/libzypp-testsuite-HEAD/ws/ICECC>
++ ICECCDIR=<http://river.suse.de/job/libzypp-testsuite-HEAD/ws/ICECC>
++ echo 'Configuring cmake for Icecream ...'
Configuring cmake for Icecream ...
++ rm -rf <http://river.suse.de/job/libzypp-testsuite-HEAD/ws/ICECC>
++ mkdir -p <http://river.suse.de/job/libzypp-testsuite-HEAD/ws/ICECC>
++ pushd <http://river.suse.de/job/libzypp-testsuite-HEAD/ws/ICECC>
~/hudson/workspace/libzypp-testsuite-HEAD/ICECC
/home/hudson/workspace/libzypp-testsuite-HEAD
+++ sed -e 's/creating //'
+++ tail -1
+++ grep .tar.gz
+++ icecc --build-native
++ export ICECC_ENV=fbb476cf81522249b07bef6422b100de.tar.gz
++ ICECC_ENV=fbb476cf81522249b07bef6422b100de.tar.gz
++ export ICECC_ENV=fbb476cf81522249b07bef6422b100de.tar.gz
++ ICECC_ENV=fbb476cf81522249b07bef6422b100de.tar.gz
++ export
ICECC_VERSION=<http://river.suse.de/job/libzypp-testsuite-HEAD/ws/ICECC/fbb476cf81522249b07bef6422b100de.tar.gz>
++
ICECC_VERSION=<http://river.suse.de/job/libzypp-testsuite-HEAD/ws/ICECC/fbb476cf81522249b07bef6422b100de.tar.gz>
++ popd
/home/hudson/workspace/libzypp-testsuite-HEAD
++ pushd <http://river.suse.de/job/libzypp-testsuite-HEAD/ws/>
~/hudson/workspace/libzypp-testsuite-HEAD
/home/hudson/workspace/libzypp-testsuite-HEAD
++ export ICECREAM_BIN=/opt/icecream/bin
++ ICECREAM_BIN=/opt/icecream/bin
++ test -d /usr/lib/icecc/bin
++ ICECREAM_BIN=/usr/lib/icecc/bin
++ export ICECREAM=-DCMAKE_CXX_COMPILER=/usr/lib/icecc/bin/g++
++ ICECREAM=-DCMAKE_CXX_COMPILER=/usr/lib/icecc/bin/g++
++ export CXX=/usr/lib/icecc/bin/g++
++ CXX=/usr/lib/icecc/bin/g++
++ export 'MAKECMD=make -j 4'
++ MAKECMD='make -j 4'
++ export MAKEBIN=make
++ MAKEBIN=make
++ export
PATH=/usr/lib/icecc/bin:/sbin:/usr/sbin:/usr/local/sbin:/root/bin:/usr/local/bin:/usr/bin:/bin:/usr/games
++
PATH=/usr/lib/icecc/bin:/sbin:/usr/sbin:/usr/local/sbin:/root/bin:/usr/local/bin:/usr/bin:/bin:/usr/games
++ popd
/home/hudson/workspace/libzypp-testsuite-HEAD
++ export
CHECKOUTDIR=<http://river.suse.de/job/libzypp-testsuite-HEAD/ws/checkout>
++ CHECKOUTDIR=<http://river.suse.de/job/libzypp-testsuite-HEAD/ws/checkout>
++ export BUILDDIR=<http://river.suse.de/job/libzypp-testsuite-HEAD/ws/build>
++ BUILDDIR=<http://river.suse.de/job/libzypp-testsuite-HEAD/ws/build>
++ export
PACKAGEDIR=<http://river.suse.de/job/libzypp-testsuite-HEAD/ws/build/package>
++ PACKAGEDIR=<http://river.suse.de/job/libzypp-testsuite-HEAD/ws/build/package>
++ export
ARTIFACTS=<http://river.suse.de/job/libzypp-testsuite-HEAD/1528/artifact/.artifacts>
++
ARTIFACTS=<http://river.suse.de/job/libzypp-testsuite-HEAD/1528/artifact/.artifacts>
++ export OBSDIR=<http://river.suse.de/job/libzypp-testsuite-HEAD/ws/OBS>
++ OBSDIR=<http://river.suse.de/job/libzypp-testsuite-HEAD/ws/OBS>
++ export RPMTOPDIR=<http://river.suse.de/job/libzypp-testsuite-HEAD/ws/rpm>
++ RPMTOPDIR=<http://river.suse.de/job/libzypp-testsuite-HEAD/ws/rpm>
++ export RPMOUT=<http://river.suse.de/job/libzypp-testsuite-HEAD/ws/rpm/rpms>
++ RPMOUT=<http://river.suse.de/job/libzypp-testsuite-HEAD/ws/rpm/rpms>
++ export
RPMBUILDDIR=<http://river.suse.de/job/libzypp-testsuite-HEAD/ws/rpm/rpmbuild>
++ RPMBUILDDIR=<http://river.suse.de/job/libzypp-testsuite-HEAD/ws/rpm/rpmbuild>
++ export
RPMBUILDROOT=<http://river.suse.de/job/libzypp-testsuite-HEAD/ws/rpm/rpmbuildroot>
++
RPMBUILDROOT=<http://river.suse.de/job/libzypp-testsuite-HEAD/ws/rpm/rpmbuildroot>
++ rm -rf <http://river.suse.de/job/libzypp-testsuite-HEAD/ws/rpm/rpms>
++ rm -rf <http://river.suse.de/job/libzypp-testsuite-HEAD/ws/rpm/rpmbuild>
++ rm -rf <http://river.suse.de/job/libzypp-testsuite-HEAD/ws/rpm/rpmbuildroot>
++ rm -rf
<http://river.suse.de/job/libzypp-testsuite-HEAD/1528/artifact/.artifacts>
++ rm -rf <http://river.suse.de/job/libzypp-testsuite-HEAD/ws/OBS>
++ rm -rf
'<http://river.suse.de/job/libzypp-testsuite-HEAD/ws/copy-to-slave*.dir'>
++ [[ 1 == 1 ]]
++ echo 'Using autotools for building'
Using autotools for building
++ export BUILDDIR=<http://river.suse.de/job/libzypp-testsuite-HEAD/ws/checkout>
++ BUILDDIR=<http://river.suse.de/job/libzypp-testsuite-HEAD/ws/checkout>
++ export
PACKAGEDIR=<http://river.suse.de/job/libzypp-testsuite-HEAD/ws/checkout/package>
++
PACKAGEDIR=<http://river.suse.de/job/libzypp-testsuite-HEAD/ws/checkout/package>
++ mkdir -p <http://river.suse.de/job/libzypp-testsuite-HEAD/ws/rpm>
++ mkdir -p <http://river.suse.de/job/libzypp-testsuite-HEAD/ws/rpm/rpms>
++ mkdir -p <http://river.suse.de/job/libzypp-testsuite-HEAD/ws/rpm/rpmbuild>
++ mkdir -p
<http://river.suse.de/job/libzypp-testsuite-HEAD/ws/rpm/rpmbuildroot>
++ mkdir -p
<http://river.suse.de/job/libzypp-testsuite-HEAD/1528/artifact/.artifacts>
++ mkdir -p <http://river.suse.de/job/libzypp-testsuite-HEAD/ws/OBS>
++ cat
+ build_make
+ echo '==> Building (legacy make)'
==> Building (legacy make)
+ echo '--> Running make, make install and make package-local'
--> Running make, make install and make package-local
+ pushd <http://river.suse.de/job/libzypp-testsuite-HEAD/ws/checkout>
~/hudson/workspace/libzypp-testsuite-HEAD/checkout
/home/hudson/workspace/libzypp-testsuite-HEAD
+ '[' -f Makefile.cvs ']'
+ make -f Makefile.cvs
rm -rf autom4te.cache
autoreconf --force --install --symlink --verbose
autoreconf: Entering directory `.'
autoreconf: configure.ac: not using Gettext
autoreconf: running: aclocal --force
autoreconf: configure.ac: tracing
autoreconf: running: libtoolize --force
libtoolize: putting auxiliary files in '.'.
libtoolize: linking file './ltmain.sh'
libtoolize: Consider adding 'AC_CONFIG_MACRO_DIRS([m4])' to configure.ac,
libtoolize: and rerunning libtoolize and aclocal.
libtoolize: Consider adding '-I m4' to ACLOCAL_AMFLAGS in Makefile.am.
autoreconf: running: /usr/bin/autoconf --force
autoreconf: running: /usr/bin/autoheader --force
autoreconf: running: automake --add-missing --force-missing
configure.ac:17: installing './compile'
configure.ac:8: installing './config.guess'
configure.ac:8: installing './config.sub'
configure.ac:11: installing './install-sh'
configure.ac:11: installing './missing'
src/Makefile.am: installing './depcomp'
autoreconf: Leaving directory `.'
./configure --prefix=/usr --libdir=/usr/lib64 \
--disable-static \
--with-qt-dir=/usr/lib/qt4 \
--with-qt-libdir=/usr/lib64 \

configure: WARNING: unrecognized options: --with-qt-dir, --with-qt-libdir
configure: loading site script /usr/share/site/x86_64-unknown-linux-gnu
checking build system type... x86_64-suse-linux-gnu
checking host system type... x86_64-suse-linux-gnu
checking target system type... x86_64-suse-linux-gnu
checking for a BSD-compatible install... /usr/bin/install -c
checking whether build environment is sane... yes
checking for a thread-safe mkdir -p... /usr/bin/mkdir -p
checking for gawk... gawk
checking whether make sets $(MAKE)... yes
checking whether make supports nested variables... yes
checking whether UID '0' is supported by ustar format... yes
checking whether GID '0' is supported by ustar format... yes
checking how to create a ustar tar archive... gnutar
checking for style of include used by make... GNU
checking for gcc... gcc
checking whether the C compiler works... yes
checking for C compiler default output file name... a.out
checking for suffix of executables...
checking whether we are cross compiling... no
checking for suffix of object files... configure: error: in
`<http://river.suse.de/job/libzypp-testsuite-HEAD/ws/checkout'>:
configure: error: cannot compute suffix of object files: cannot compile
See `config.log' for more details
Makefile.cvs:21: recipe for target 'configure' failed
make: *** [configure] Error 1
Build step 'Execute shell' marked build as failure
Archiving artifacts

< Previous Next >
Follow Ups
References