Mailinglist Archive: zypp-commit (36 mails)

< Previous Next >
[zypp-commit] Build failed in Jenkins: libzypp-testsuite-SLE12SP1 #33
  • From: hudson@xxxxxxx
  • Date: Mon, 20 Jul 2015 14:13:57 +0200 (CEST)
  • Message-id: <568014622.1052.1437394437733.JavaMail.jenkins@river>
See <http://river.suse.de/job/libzypp-testsuite-SLE12SP1/33/>

------------------------------------------
[...truncated 56 lines...]
~/hudson/workspace/libzypp-testsuite-SLE12SP1/ICECC
~/hudson/workspace/libzypp-testsuite-SLE12SP1
+++ grep .tar.gz
+++ tail -1
+++ sed -e 's/creating //'
+++ icecc --build-native
++ export ICECC_ENV=4084f6f9a671b53f58017abe8deebcb9.tar.gz
++ ICECC_ENV=4084f6f9a671b53f58017abe8deebcb9.tar.gz
++ export ICECC_ENV=4084f6f9a671b53f58017abe8deebcb9.tar.gz
++ ICECC_ENV=4084f6f9a671b53f58017abe8deebcb9.tar.gz
++ export
ICECC_VERSION=<http://river.suse.de/job/libzypp-testsuite-SLE12SP1/ws/ICECC/4084f6f9a671b53f58017abe8deebcb9.tar.gz>
++
ICECC_VERSION=<http://river.suse.de/job/libzypp-testsuite-SLE12SP1/ws/ICECC/4084f6f9a671b53f58017abe8deebcb9.tar.gz>
++ popd
~/hudson/workspace/libzypp-testsuite-SLE12SP1
++ pushd <http://river.suse.de/job/libzypp-testsuite-SLE12SP1/ws/>
~/hudson/workspace/libzypp-testsuite-SLE12SP1
~/hudson/workspace/libzypp-testsuite-SLE12SP1
++ export ICECREAM_BIN=/opt/icecream/bin
++ ICECREAM_BIN=/opt/icecream/bin
++ test -d /usr/lib/icecc/bin
++ ICECREAM_BIN=/usr/lib/icecc/bin
++ export ICECREAM=-DCMAKE_CXX_COMPILER=/usr/lib/icecc/bin/g++
++ ICECREAM=-DCMAKE_CXX_COMPILER=/usr/lib/icecc/bin/g++
++ export CXX=/usr/lib/icecc/bin/g++
++ CXX=/usr/lib/icecc/bin/g++
++ export 'MAKECMD=make -j 4'
++ MAKECMD='make -j 4'
++ export MAKEBIN=make
++ MAKEBIN=make
++ export
PATH=/usr/lib/icecc/bin:/sbin:/usr/sbin:/usr/local/sbin:/root/bin:/usr/local/bin:/usr/bin:/bin:/usr/games
++
PATH=/usr/lib/icecc/bin:/sbin:/usr/sbin:/usr/local/sbin:/root/bin:/usr/local/bin:/usr/bin:/bin:/usr/games
++ popd
~/hudson/workspace/libzypp-testsuite-SLE12SP1
++ export
CHECKOUTDIR=<http://river.suse.de/job/libzypp-testsuite-SLE12SP1/ws/checkout>
++ CHECKOUTDIR=<http://river.suse.de/job/libzypp-testsuite-SLE12SP1/ws/checkout>
++ export
BUILDDIR=<http://river.suse.de/job/libzypp-testsuite-SLE12SP1/ws/build>
++ BUILDDIR=<http://river.suse.de/job/libzypp-testsuite-SLE12SP1/ws/build>
++ export
PACKAGEDIR=<http://river.suse.de/job/libzypp-testsuite-SLE12SP1/ws/build/package>
++
PACKAGEDIR=<http://river.suse.de/job/libzypp-testsuite-SLE12SP1/ws/build/package>
++ export
ARTIFACTS=<http://river.suse.de/job/libzypp-testsuite-SLE12SP1/33/artifact/.artifacts>
++
ARTIFACTS=<http://river.suse.de/job/libzypp-testsuite-SLE12SP1/33/artifact/.artifacts>
++ export OBSDIR=<http://river.suse.de/job/libzypp-testsuite-SLE12SP1/ws/OBS>
++ OBSDIR=<http://river.suse.de/job/libzypp-testsuite-SLE12SP1/ws/OBS>
++ export RPMTOPDIR=<http://river.suse.de/job/libzypp-testsuite-SLE12SP1/ws/rpm>
++ RPMTOPDIR=<http://river.suse.de/job/libzypp-testsuite-SLE12SP1/ws/rpm>
++ export
RPMOUT=<http://river.suse.de/job/libzypp-testsuite-SLE12SP1/ws/rpm/rpms>
++ RPMOUT=<http://river.suse.de/job/libzypp-testsuite-SLE12SP1/ws/rpm/rpms>
++ export
RPMBUILDDIR=<http://river.suse.de/job/libzypp-testsuite-SLE12SP1/ws/rpm/rpmbuild>
++
RPMBUILDDIR=<http://river.suse.de/job/libzypp-testsuite-SLE12SP1/ws/rpm/rpmbuild>
++ export
RPMBUILDROOT=<http://river.suse.de/job/libzypp-testsuite-SLE12SP1/ws/rpm/rpmbuildroot>
++
RPMBUILDROOT=<http://river.suse.de/job/libzypp-testsuite-SLE12SP1/ws/rpm/rpmbuildroot>
++ rm -rf <http://river.suse.de/job/libzypp-testsuite-SLE12SP1/ws/rpm/rpms>
++ rm -rf <http://river.suse.de/job/libzypp-testsuite-SLE12SP1/ws/rpm/rpmbuild>
++ rm -rf
<http://river.suse.de/job/libzypp-testsuite-SLE12SP1/ws/rpm/rpmbuildroot>
++ rm -rf
<http://river.suse.de/job/libzypp-testsuite-SLE12SP1/33/artifact/.artifacts>
++ rm -rf <http://river.suse.de/job/libzypp-testsuite-SLE12SP1/ws/OBS>
++ rm -rf
'<http://river.suse.de/job/libzypp-testsuite-SLE12SP1/ws/copy-to-slave*.dir'>
++ [[ 1 == 1 ]]
++ echo 'Using autotools for building'
Using autotools for building
++ export
BUILDDIR=<http://river.suse.de/job/libzypp-testsuite-SLE12SP1/ws/checkout>
++ BUILDDIR=<http://river.suse.de/job/libzypp-testsuite-SLE12SP1/ws/checkout>
++ export
PACKAGEDIR=<http://river.suse.de/job/libzypp-testsuite-SLE12SP1/ws/checkout/package>
++
PACKAGEDIR=<http://river.suse.de/job/libzypp-testsuite-SLE12SP1/ws/checkout/package>
++ mkdir -p <http://river.suse.de/job/libzypp-testsuite-SLE12SP1/ws/rpm>
++ mkdir -p <http://river.suse.de/job/libzypp-testsuite-SLE12SP1/ws/rpm/rpms>
++ mkdir -p
<http://river.suse.de/job/libzypp-testsuite-SLE12SP1/ws/rpm/rpmbuild>
++ mkdir -p
<http://river.suse.de/job/libzypp-testsuite-SLE12SP1/ws/rpm/rpmbuildroot>
++ mkdir -p
<http://river.suse.de/job/libzypp-testsuite-SLE12SP1/33/artifact/.artifacts>
++ mkdir -p <http://river.suse.de/job/libzypp-testsuite-SLE12SP1/ws/OBS>
++ cat
+ build_make
+ echo '==> Building (legacy make)'
==> Building (legacy make)
+ echo '--> Running make, make install and make package-local'
--> Running make, make install and make package-local
+ pushd <http://river.suse.de/job/libzypp-testsuite-SLE12SP1/ws/checkout>
~/hudson/workspace/libzypp-testsuite-SLE12SP1/checkout
~/hudson/workspace/libzypp-testsuite-SLE12SP1
+ '[' -f Makefile.cvs ']'
+ make -f Makefile.cvs
rm -rf autom4te.cache
autoreconf --force --install --symlink --verbose
autoreconf: Entering directory `.'
autoreconf: configure.ac: not using Gettext
autoreconf: running: aclocal --force
autoreconf: configure.ac: tracing
autoreconf: running: libtoolize --force
libtoolize: putting auxiliary files in `.'.
libtoolize: linking file `./ltmain.sh'
libtoolize: Consider adding `AC_CONFIG_MACRO_DIR([m4])' to configure.ac and
libtoolize: rerunning libtoolize, to keep the correct libtool macros in-tree.
libtoolize: Consider adding `-I m4' to ACLOCAL_AMFLAGS in Makefile.am.
autoreconf: running: /usr/bin/autoconf --force
autoreconf: running: /usr/bin/autoheader --force
autoreconf: running: automake --add-missing --force-missing
autoreconf: Leaving directory `.'
./configure --prefix=/usr --libdir=/usr/lib64 \
--disable-static \
--with-qt-dir=/usr/lib/qt4 \
--with-qt-libdir=/usr/lib64 \

configure: WARNING: unrecognized options: --with-qt-dir, --with-qt-libdir
checking build system type... x86_64-suse-linux-gnu
checking host system type... x86_64-suse-linux-gnu
checking target system type... x86_64-suse-linux-gnu
checking for a BSD-compatible install... /usr/bin/install -c
checking whether build environment is sane... yes
checking for a thread-safe mkdir -p... /usr/bin/mkdir -p
checking for gawk... gawk
checking whether make sets $(MAKE)... yes
checking whether make supports nested variables... yes
checking whether UID '0' is supported by ustar format... yes
checking whether GID '0' is supported by ustar format... yes
checking how to create a ustar tar archive... gnutar
checking for style of include used by make... GNU
checking for gcc... gcc
checking whether the C compiler works... yes
checking for C compiler default output file name... a.out
checking for suffix of executables...
checking whether we are cross compiling... no
checking for suffix of object files... o
checking whether we are using the GNU C compiler... yes
checking whether gcc accepts -g... yes
checking for gcc option to accept ISO C89... none needed
checking dependency style of gcc... gcc3
checking for special C compiler options needed for large files... no
checking for _FILE_OFFSET_BITS value needed for large files... no
checking whether we are using the GNU C++ compiler... yes
checking whether /usr/lib/icecc/bin/g++ accepts -g... yes
checking dependency style of /usr/lib/icecc/bin/g++... gcc3
checking whether we are using the GNU C++ compiler... (cached) yes
checking whether /usr/lib/icecc/bin/g++ accepts -g... (cached) yes
checking dependency style of /usr/lib/icecc/bin/g++... (cached) gcc3
checking how to run the C++ preprocessor... /usr/lib/icecc/bin/g++ -E
checking how to print strings... printf
checking for a sed that does not truncate output... /usr/bin/sed
checking for grep that handles long lines and -e... /usr/bin/grep
checking for egrep... /usr/bin/grep -E
checking for fgrep... /usr/bin/grep -F
checking for ld used by gcc... /usr/x86_64-suse-linux/bin/ld
checking if the linker (/usr/x86_64-suse-linux/bin/ld) is GNU ld... yes
checking for BSD- or MS-compatible name lister (nm)... /usr/bin/nm -B
checking the name lister (/usr/bin/nm -B) interface... BSD nm
checking whether ln -s works... yes
checking the maximum length of command line arguments... 1572864
checking whether the shell understands some XSI constructs... yes
checking whether the shell understands "+="... yes
checking how to convert x86_64-suse-linux-gnu file names to
x86_64-suse-linux-gnu format... func_convert_file_noop
checking how to convert x86_64-suse-linux-gnu file names to toolchain format...
func_convert_file_noop
checking for /usr/x86_64-suse-linux/bin/ld option to reload object files... -r
checking for objdump... objdump
checking how to recognize dependent libraries... pass_all
checking for dlltool... no
checking how to associate runtime and link libraries... printf %s\n
checking for ar... ar
checking for archiver @FILE support... @
checking for strip... strip
checking for ranlib... ranlib
checking command to parse /usr/bin/nm -B output from gcc object... ok
checking for sysroot... no
checking for mt... mt
checking if mt is a manifest tool... no
checking how to run the C preprocessor... gcc -E
checking for ANSI C header files... yes
checking for sys/types.h... yes
checking for sys/stat.h... yes
checking for stdlib.h... yes
checking for string.h... yes
checking for memory.h... yes
checking for strings.h... yes
checking for inttypes.h... yes
checking for stdint.h... yes
checking for unistd.h... yes
checking for dlfcn.h... yes
checking for objdir... .libs
checking if gcc supports -fno-rtti -fno-exceptions... no
checking for gcc option to produce PIC... -fPIC -DPIC
checking if gcc PIC flag -fPIC -DPIC works... yes
checking if gcc static flag -static works... no
checking if gcc supports -c -o file.o... yes
checking if gcc supports -c -o file.o... (cached) yes
checking whether the gcc linker (/usr/x86_64-suse-linux/bin/ld -m elf_x86_64)
supports shared libraries... yes
checking whether -lc should be explicitly linked in... no
checking dynamic linker characteristics... GNU/Linux ld.so
checking how to hardcode library paths into programs... immediate
checking whether stripping libraries is possible... yes
checking if libtool supports shared libraries... yes
checking whether to build shared libraries... yes
checking whether to build static libraries... no
checking how to run the C++ preprocessor... /usr/lib/icecc/bin/g++ -E
checking for ld used by /usr/lib/icecc/bin/g++... /usr/x86_64-suse-linux/bin/ld
-m elf_x86_64
checking if the linker (/usr/x86_64-suse-linux/bin/ld -m elf_x86_64) is GNU
ld... yes
checking whether the /usr/lib/icecc/bin/g++ linker
(/usr/x86_64-suse-linux/bin/ld -m elf_x86_64) supports shared libraries... yes
checking for /usr/lib/icecc/bin/g++ option to produce PIC... -fPIC -DPIC
checking if /usr/lib/icecc/bin/g++ PIC flag -fPIC -DPIC works... no
checking if /usr/lib/icecc/bin/g++ static flag -static works... no
checking if /usr/lib/icecc/bin/g++ supports -c -o file.o... no
checking if /usr/lib/icecc/bin/g++ supports -c -o file.o... (cached) no
checking whether the /usr/lib/icecc/bin/g++ linker
(/usr/x86_64-suse-linux/bin/ld -m elf_x86_64) supports shared libraries... yes
checking dynamic linker characteristics... (cached) GNU/Linux ld.so
checking how to hardcode library paths into programs... immediate
checking for Enhances in librpm... no
checking that generated files are newer than configure... done
configure: creating ./config.status
config.status: creating Makefile
config.status: creating libzypp-testsuite-tools.spec
config.status: creating libzypp-testsuite-tools.pc
config.status: creating src/Makefile
config.status: creating config.h
config.status: config.h is unchanged
config.status: executing depfiles commands
config.status: executing libtool commands
configure: WARNING: unrecognized options: --with-qt-dir, --with-qt-libdir

Configuration:

PACKAGE: zypp-testsuite-tools
VERSION: 5.0.1

LIBZYPPTESTSUITE_VERSION_INFO:

COMPILER: /usr/lib/icecc/bin/g++
CXXFLAGS: -DFAKE -g -O3 -Wall -Wformat -Woverloaded-virtual
-std=c++11 -D_LARGE_FILES=

PREFIX: /usr
LIBDIR: /usr/lib64



+ make -j 4
make all-recursive
make[1]: Entering directory
'<http://river.suse.de/job/libzypp-testsuite-SLE12SP1/ws/checkout'>
Making all in src
make[2]: Entering directory
'<http://river.suse.de/job/libzypp-testsuite-SLE12SP1/ws/checkout/src'>
/usr/lib/icecc/bin/g++ -DHAVE_CONFIG_H -I. -I..
-DZYPP_BASE_LOGGER_LOGGROUP=\"testsuite\" -DNOUI -DFAKE -g -O3 -Wall -Wformat
-Woverloaded-virtual -std=c++11 -D_LARGE_FILES= -MT
deptestomatic-deptestomatic.o -MD -MP -MF .deps/deptestomatic-deptestomatic.Tpo
-c -o deptestomatic-deptestomatic.o `test -f 'deptestomatic.cc' || echo
'./'`deptestomatic.cc
ICECC[15173] 14:13:56: no server found behind given hostname 10.162.166.9:10245
ICECC[15173] 14:13:56: got exception 2 (10.162.166.9)
deptestomatic.cc:73:44: fatal error: zypp/solver/detail/ItemCapKind.h: No such
file or directory
#include "zypp/solver/detail/ItemCapKind.h"
^
compilation terminated.
Makefile:433: recipe for target 'deptestomatic-deptestomatic.o' failed
make[2]: *** [deptestomatic-deptestomatic.o] Error 1
make[2]: Leaving directory
'<http://river.suse.de/job/libzypp-testsuite-SLE12SP1/ws/checkout/src'>
Makefile:404: recipe for target 'all-recursive' failed
make[1]: *** [all-recursive] Error 1
make[1]: Leaving directory
'<http://river.suse.de/job/libzypp-testsuite-SLE12SP1/ws/checkout'>
Makefile:331: recipe for target 'all' failed
make: *** [all] Error 2
Build step 'Execute shell' marked build as failure
Archiving artifacts

< Previous Next >
This Thread
Follow Ups
References