Mailinglist Archive: zypp-commit (36 mails)

< Previous Next >
[zypp-commit] Build failed in Jenkins: zypper-HEAD #1631
  • From: hudson@xxxxxxx
  • Date: Fri, 3 Jul 2015 08:37:56 +0200 (CEST)
  • Message-id: <966135787.122.1435905476586.JavaMail.jenkins@river>
See <http://river.suse.de/job/zypper-HEAD/1631/changes>

Changes:

[Michael Andres] make gcc happy

[Michael Andres] info: Respect arguments explicitly specifying 'kind:name'

[Michael Andres] BuildRequires: libzypp-devel >= 15.7.0

[Michael Andres] patch: highlight security and critical in tables

[Michael Andres] patch: add column showing required interactive actions
(reboot,license,message)

[Michael Andres] Replace NULL, nullres, etc. with nullptr

[Michael Andres] fix name class member (Summary::_multiInstalled)

[Michael Andres] summary: show patches requiring reboot (FATE#317872)

[Michael Andres] changes 1.12.7

------------------------------------------
Started by an SCM change
Building remotely on node-zyppHEAD in workspace
<http://river.suse.de/job/zypper-HEAD/ws/>
Checkout:zypper-HEAD / <http://river.suse.de/job/zypper-HEAD/ws/> -
hudson.remoting.Channel@5a0d4694:node-zyppHEAD
Using strategy: Default
Last Built Revision: Revision 78c899b6e9264ca6251b00131351673b9d98026e
(origin/master)
Checkout:checkout / <http://river.suse.de/job/zypper-HEAD/ws/checkout> -
hudson.remoting.LocalChannel@176bd487
Fetching changes from the remote Git repository
Fetching upstream changes from git://github.com/openSUSE/zypper.git
Commencing build of Revision 568fab032fc93d177e429df457861bcaddafa1b8
(origin/master)
Checking out Revision 568fab032fc93d177e429df457861bcaddafa1b8 (origin/master)
[copy-to-slave] Copying '.hudson-scripts/**', excluding nothing, from
'file:/var/lib/jenkins/userContent/' on the master to
'<http://river.suse.de/job/zypper-HEAD/ws/'> on 'node-zyppHEAD'.
[zypper-HEAD] $ /bin/sh -xe /tmp/hudson5082809532173627192.sh
+ echo '### BUILD ###'
### BUILD ###
+ echo '==> Reading build configuration'
==> Reading build configuration
+ . .hudson-scripts/base-functions
++ . .hudson-scripts/ascii_art
++ trap 'error_exit $?' ERR
++ echo 'Job running as user: root'
Job running as user: root
+++ date '+%F %T'
++ echo 'Started at: 2015-07-03 08:35:56'
Started at: 2015-07-03 08:35:56
+++ hostname --fqdn
++ export SITENAME=host-44-0-0-74.openstack.local.p2.cloud.suse.de
++ SITENAME=host-44-0-0-74.openstack.local.p2.cloud.suse.de
++ export TARGET_DIST=HEAD
++ TARGET_DIST=HEAD
++ export PROJECT=zypper
++ PROJECT=zypper
+ . .hudson-scripts/build-functions
+ . .hudson-scripts/obs-functions
++ trap 'error_exit $?' ERR
++ export ALLOW_OBS_SUBMIT=yes
++ ALLOW_OBS_SUBMIT=yes
+ sed -i 's/^ *rm -rf \${BUILDDIR}/#/' .hudson-scripts/setup-buildenvironment
+ . .hudson-scripts/setup-buildenvironment
++ export RUNTESTS=1
++ RUNTESTS=1
++ export ICEJOBS=4
++ ICEJOBS=4
++ export CMAKE_INSTALL_PREFIX=/usr
++ CMAKE_INSTALL_PREFIX=/usr
+++ uname -m
+++ hostname -f
++ export 'CMAKEPARAS=-DBUILDNAME=x86_64
-DSITE=host-44-0-0-74.openstack.local.p2.cloud.suse.de
-DCMAKE_INSTALL_PREFIX=/usr'
++ CMAKEPARAS='-DBUILDNAME=x86_64
-DSITE=host-44-0-0-74.openstack.local.p2.cloud.suse.de
-DCMAKE_INSTALL_PREFIX=/usr'
++ export ICECCDIR=<http://river.suse.de/job/zypper-HEAD/ws/ICECC>
++ ICECCDIR=<http://river.suse.de/job/zypper-HEAD/ws/ICECC>
++ echo 'Configuring cmake for Icecream ...'
Configuring cmake for Icecream ...
++ rm -rf <http://river.suse.de/job/zypper-HEAD/ws/ICECC>
++ mkdir -p <http://river.suse.de/job/zypper-HEAD/ws/ICECC>
++ pushd <http://river.suse.de/job/zypper-HEAD/ws/ICECC>
~/hudson/workspace/zypper-HEAD/ICECC /home/hudson/workspace/zypper-HEAD
+++ sed -e 's/creating //'
+++ tail -1
+++ grep .tar.gz
+++ icecc --build-native
++ export ICECC_ENV=72cd333b62d87e3c818395b185884946.tar.gz
++ ICECC_ENV=72cd333b62d87e3c818395b185884946.tar.gz
++ export ICECC_ENV=72cd333b62d87e3c818395b185884946.tar.gz
++ ICECC_ENV=72cd333b62d87e3c818395b185884946.tar.gz
++ export
ICECC_VERSION=<http://river.suse.de/job/zypper-HEAD/ws/ICECC/72cd333b62d87e3c818395b185884946.tar.gz>
++
ICECC_VERSION=<http://river.suse.de/job/zypper-HEAD/ws/ICECC/72cd333b62d87e3c818395b185884946.tar.gz>
++ popd
/home/hudson/workspace/zypper-HEAD
++ pushd <http://river.suse.de/job/zypper-HEAD/ws/>
~/hudson/workspace/zypper-HEAD /home/hudson/workspace/zypper-HEAD
++ export ICECREAM_BIN=/opt/icecream/bin
++ ICECREAM_BIN=/opt/icecream/bin
++ test -d /usr/lib/icecc/bin
++ ICECREAM_BIN=/usr/lib/icecc/bin
++ export ICECREAM=-DCMAKE_CXX_COMPILER=/usr/lib/icecc/bin/g++
++ ICECREAM=-DCMAKE_CXX_COMPILER=/usr/lib/icecc/bin/g++
++ export CXX=/usr/lib/icecc/bin/g++
++ CXX=/usr/lib/icecc/bin/g++
++ export 'MAKECMD=make -j 4'
++ MAKECMD='make -j 4'
++ export MAKEBIN=make
++ MAKEBIN=make
++ export
PATH=/usr/lib/icecc/bin:/sbin:/usr/sbin:/usr/local/sbin:/root/bin:/usr/local/bin:/usr/bin:/bin:/usr/games
++
PATH=/usr/lib/icecc/bin:/sbin:/usr/sbin:/usr/local/sbin:/root/bin:/usr/local/bin:/usr/bin:/bin:/usr/games
++ popd
/home/hudson/workspace/zypper-HEAD
++ export CHECKOUTDIR=<http://river.suse.de/job/zypper-HEAD/ws/checkout>
++ CHECKOUTDIR=<http://river.suse.de/job/zypper-HEAD/ws/checkout>
++ export BUILDDIR=<http://river.suse.de/job/zypper-HEAD/ws/build>
++ BUILDDIR=<http://river.suse.de/job/zypper-HEAD/ws/build>
++ export PACKAGEDIR=<http://river.suse.de/job/zypper-HEAD/ws/build/package>
++ PACKAGEDIR=<http://river.suse.de/job/zypper-HEAD/ws/build/package>
++ export
ARTIFACTS=<http://river.suse.de/job/zypper-HEAD/1631/artifact/.artifacts>
++ ARTIFACTS=<http://river.suse.de/job/zypper-HEAD/1631/artifact/.artifacts>
++ export OBSDIR=<http://river.suse.de/job/zypper-HEAD/ws/OBS>
++ OBSDIR=<http://river.suse.de/job/zypper-HEAD/ws/OBS>
++ export RPMTOPDIR=<http://river.suse.de/job/zypper-HEAD/ws/rpm>
++ RPMTOPDIR=<http://river.suse.de/job/zypper-HEAD/ws/rpm>
++ export RPMOUT=<http://river.suse.de/job/zypper-HEAD/ws/rpm/rpms>
++ RPMOUT=<http://river.suse.de/job/zypper-HEAD/ws/rpm/rpms>
++ export RPMBUILDDIR=<http://river.suse.de/job/zypper-HEAD/ws/rpm/rpmbuild>
++ RPMBUILDDIR=<http://river.suse.de/job/zypper-HEAD/ws/rpm/rpmbuild>
++ export
RPMBUILDROOT=<http://river.suse.de/job/zypper-HEAD/ws/rpm/rpmbuildroot>
++ RPMBUILDROOT=<http://river.suse.de/job/zypper-HEAD/ws/rpm/rpmbuildroot>
++ rm -rf <http://river.suse.de/job/zypper-HEAD/ws/rpm/rpms>
++ rm -rf <http://river.suse.de/job/zypper-HEAD/ws/rpm/rpmbuild>
++ rm -rf <http://river.suse.de/job/zypper-HEAD/ws/rpm/rpmbuildroot>
++ rm -rf <http://river.suse.de/job/zypper-HEAD/1631/artifact/.artifacts>
++ rm -rf <http://river.suse.de/job/zypper-HEAD/ws/OBS>
++ rm -rf '<http://river.suse.de/job/zypper-HEAD/ws/copy-to-slave*.dir'>
++ [[ '' == 1 ]]
++ mkdir -p <http://river.suse.de/job/zypper-HEAD/ws/build>
++ mkdir -p <http://river.suse.de/job/zypper-HEAD/ws/rpm>
++ mkdir -p <http://river.suse.de/job/zypper-HEAD/ws/rpm/rpms>
++ mkdir -p <http://river.suse.de/job/zypper-HEAD/ws/rpm/rpmbuild>
++ mkdir -p <http://river.suse.de/job/zypper-HEAD/ws/rpm/rpmbuildroot>
++ mkdir -p <http://river.suse.de/job/zypper-HEAD/1631/artifact/.artifacts>
++ mkdir -p <http://river.suse.de/job/zypper-HEAD/ws/OBS>
++ cat
+ build_cmake
+ echo '==> Building'
==> Building
+ pushd <http://river.suse.de/job/zypper-HEAD/ws/build>
~/hudson/workspace/zypper-HEAD/build /home/hudson/workspace/zypper-HEAD
+ cmake -DBUILDNAME=x86_64
-DSITE=host-44-0-0-74.openstack.local.p2.cloud.suse.de
-DCMAKE_INSTALL_PREFIX=/usr -DCMAKE_CXX_COMPILER=/usr/lib/icecc/bin/g++
<http://river.suse.de/job/zypper-HEAD/ws/checkout>
-- Libraries will be installed in /usr/lib64
-- Header files will be installed in /usr/include
-- Config files will be installed in /etc
** Manual files will be installed in /usr/share/man
-- Writing spec file...
-- I hate you rpm-lint...!!!
-- ZYpp path not set. Looking for it.
-- ZYpp found: includes in /usr/include, library in /usr/lib64/libzypp.so
-- readline found: includes in /usr/include, library in
/usr/lib64/libreadline.so
-- augeas found: includes in /usr/include, library in /usr/lib64/libaugeas.so
** Locale dir is /usr/share/locale
** ZYpper binary will be installed in /usr/bin
-- Translation set: zypper-po.tar.bz2
-- Translations:
af.po;ar.po;be.po;bg.po;bn.po;bs.po;ca.po;cs.po;cy.po;da.po;de.po;el.po;en_GB.po;en_US.po;eo.po;es.po;et.po;eu.po;fa.po;fi.po;fr.po;gl.po;gu.po;he.po;hi.po;hr.po;hu.po;id.po;it.po;ja.po;ka.po;km.po;ko.po;ku.po;lo.po;lt.po;mk.po;mr.po;nb.po;nds.po;nl.po;nn.po;pa.po;pl.po;pt.po;pt_BR.po;ro.po;ru.po;si.po;sk.po;sl.po;sr.po;sv.po;ta.po;tg.po;th.po;tr.po;uk.po;vi.po;wa.po;xh.po;zh_CN.po;zh_TW.po;zu.po;
-- Configuring done
-- Generating done
-- Build files have been written to:
<http://river.suse.de/job/zypper-HEAD/ws/build>
+ make -j 4
Scanning dependencies of target man
Scanning dependencies of target zypp-refresh
Scanning dependencies of target translations
[ 1%] [ 2%] Building CXX object
src/CMakeFiles/zypp-refresh.dir/zypp-refresh.cc.o
Forgott to fix manpage after changing ascidoc? Install a2x for automated
creation or 'touch zypper.8'
[ 2%] [ 3%] Generating af.po, ar.po, be.po, bg.po, bn.po, bs.po, ca.po,
cs.po, cy.po, da.po, de.po, el.po, en_GB.po, en_US.po, eo.po, es.po, et.po,
eu.po, fa.po, fi.po, fr.po, gl.po, gu.po, he.po, hi.po, hr.po, hu.po, id.po,
it.po, ja.po, ka.po, km.po, ko.po, ku.po, lo.po, lt.po, mk.po, mr.po, nb.po,
nds.po, nl.po, nn.po, pa.po, pl.po, pt.po, pt_BR.po, ro.po, ru.po, si.po,
sk.po, sl.po, sr.po, sv.po, ta.po, tg.po, th.po, tr.po, uk.po, vi.po, wa.po,
xh.po, zh_CN.po, zh_TW.po, zu.po
Forgott to fix manpage after changing ascidoc? Install a2x for automated
creation or 'touch zypper-log.8'
[ 4%] Forgott to fix manpage after changing ascidoc? Install a2x for
automated creation or 'touch zypp-refresh.8'
[ 4%] Scanning dependencies of target zypper_lib
Built target man
[ 5%] [ 6%] Building CXX object src/CMakeFiles/zypper_lib.dir/Command.cc.o
Building CXX object src/CMakeFiles/zypper_lib.dir/Zypper.cc.o
[ 68%] Built target translations
[ 69%] Building CXX object src/CMakeFiles/zypper_lib.dir/Config.cc.o
In file included from
<http://river.suse.de/job/zypper-HEAD/ws/checkout/src/Zypper.cc>:26:0:
/usr/include/zypp/zypp_detail/ZYppReadOnlyHack.h:15:2: warning: #warning
ZYPP_ZYPP_DETAIL_ZYPPREADONLYHACK_H [-Wcpp]
#warning ZYPP_ZYPP_DETAIL_ZYPPREADONLYHACK_H
^
[ 70%] Building CXX object src/CMakeFiles/zypper_lib.dir/repos.cc.o
Linking CXX executable zypp-refresh
ICECC[26273] 08:36:12: no server found behind given hostname 10.162.166.22:10245
ICECC[26273] 08:36:12: got exception 2 (10.162.166.22)
[ 70%] Built target zypp-refresh
[ 71%] Building CXX object src/CMakeFiles/zypper_lib.dir/misc.cc.o
ICECC[26305] 08:36:15: no server found behind given hostname 10.162.166.22:10245
ICECC[26305] 08:36:15: got exception 2 (10.162.166.22)
[ 72%] Building CXX object src/CMakeFiles/zypper_lib.dir/search.cc.o
<http://river.suse.de/job/zypper-HEAD/ws/checkout/src/Zypper.cc>: In member
function 'void Zypper::doCommand()':
<http://river.suse.de/job/zypper-HEAD/ws/checkout/src/Zypper.cc>:2985:24:
warning: 'void zypp::zypp_readonly_hack::IWantIt()' is deprecated (declared at
/usr/include/zypp/zypp_detail/ZYppReadOnlyHack.h:26) [-Wdeprecated-declarations]
<http://river.suse.de/job/zypper-HEAD/ws/checkout/src/Zypper.cc>:2985:33:
warning: 'void zypp::zypp_readonly_hack::IWantIt()' is deprecated (declared at
/usr/include/zypp/zypp_detail/ZYppReadOnlyHack.h:26) [-Wdeprecated-declarations]
<http://river.suse.de/job/zypper-HEAD/ws/checkout/src/Zypper.cc>:2990:24:
warning: 'void zypp::zypp_readonly_hack::IWantIt()' is deprecated (declared at
/usr/include/zypp/zypp_detail/ZYppReadOnlyHack.h:26) [-Wdeprecated-declarations]
<http://river.suse.de/job/zypper-HEAD/ws/checkout/src/Zypper.cc>:2990:33:
warning: 'void zypp::zypp_readonly_hack::IWantIt()' is deprecated (declared at
/usr/include/zypp/zypp_detail/ZYppReadOnlyHack.h:26) [-Wdeprecated-declarations]
[ 73%] Building CXX object src/CMakeFiles/zypper_lib.dir/info.cc.o
[ 74%] Building CXX object src/CMakeFiles/zypper_lib.dir/Table.cc.o
[ 75%] Building CXX object src/CMakeFiles/zypper_lib.dir/locks.cc.o
[ 76%] Building CXX object src/CMakeFiles/zypper_lib.dir/update.cc.o
[ 77%] Building CXX object src/CMakeFiles/zypper_lib.dir/download.cc.o
[ 78%] Building CXX object src/CMakeFiles/zypper_lib.dir/source-download.cc.o
[ 79%] Building CXX object src/CMakeFiles/zypper_lib.dir/subcommand.cc.o
[ 80%] Building CXX object src/CMakeFiles/zypper_lib.dir/configtest.cc.o
[ 81%] Building CXX object src/CMakeFiles/zypper_lib.dir/solve-commit.cc.o
[ 81%] Building CXX object src/CMakeFiles/zypper_lib.dir/PackageArgs.cc.o
[ 82%] Building CXX object src/CMakeFiles/zypper_lib.dir/RequestFeedback.cc.o
[ 83%] Building CXX object src/CMakeFiles/zypper_lib.dir/SolverRequester.cc.o
[ 84%] Building CXX object src/CMakeFiles/zypper_lib.dir/Summary.cc.o
[ 85%] Building CXX object src/CMakeFiles/zypper_lib.dir/callbacks/media.cc.o
ICECC[26417] 08:36:50: no server found behind given hostname 10.162.166.22:10245
ICECC[26417] 08:36:50: got exception 2 (10.162.166.22)
[ 86%] Building CXX object src/CMakeFiles/zypper_lib.dir/output/Out.cc.o
<http://river.suse.de/job/zypper-HEAD/ws/checkout/src/SolverRequester.cc>:510:2:
warning: #warning TODO handle pseudoinstalled objects [-Wcpp]
#warning TODO handle pseudoinstalled objects
^
[ 87%] Building CXX object src/CMakeFiles/zypper_lib.dir/output/OutNormal.cc.o
<http://river.suse.de/job/zypper-HEAD/ws/checkout/src/Summary.cc>: In member
function 'void Summary::writeRebootNeeded(std::ostream&)':
<http://river.suse.de/job/zypper-HEAD/ws/checkout/src/Summary.cc>:1228:32:
warning: format '%d' expects argument of type 'int', but argument 2 has type
'std::set<std::pair<boost::intrusive_ptr<const zypp::ResObject>,
boost::intrusive_ptr<const zypp::ResObject> >,
Summary::ResPairNameCompare>::size_type {aka long unsigned int}' [-Wformat=]
[ 88%] Building CXX object src/CMakeFiles/zypper_lib.dir/output/OutXML.cc.o
[ 89%] Building CXX object src/CMakeFiles/zypper_lib.dir/utils/Augeas.cc.o
[ 90%] Building CXX object src/CMakeFiles/zypper_lib.dir/utils/colors.cc.o
[ 91%] Building CXX object src/CMakeFiles/zypper_lib.dir/utils/console.cc.o
[ 92%] [ 93%] Building CXX object
src/CMakeFiles/zypper_lib.dir/utils/getopt.cc.o
Building CXX object src/CMakeFiles/zypper_lib.dir/utils/messages.cc.o
[ 94%] Building CXX object src/CMakeFiles/zypper_lib.dir/utils/misc.cc.o
[ 95%] Building CXX object src/CMakeFiles/zypper_lib.dir/utils/pager.cc.o
[ 96%] Building CXX object src/CMakeFiles/zypper_lib.dir/utils/prompt.cc.o
[ 97%] Building CXX object src/CMakeFiles/zypper_lib.dir/utils/richtext.cc.o
[ 98%] Building CXX object src/CMakeFiles/zypper_lib.dir/utils/text.cc.o
Linking CXX static library libzypper_lib.a
/usr/bin/ranlib: libzypper_lib.a: No space left on device
src/CMakeFiles/zypper_lib.dir/build.make:885: recipe for target
'src/libzypper_lib.a' failed
make[2]: *** [src/libzypper_lib.a] Error 1
CMakeFiles/Makefile2:1110: recipe for target
'src/CMakeFiles/zypper_lib.dir/all' failed
make[1]: *** [src/CMakeFiles/zypper_lib.dir/all] Error 2
Makefile:146: recipe for target 'all' failed
make: *** [all] Error 2
Build step 'Execute shell' marked build as failure
Archiving artifacts

< Previous Next >
This Thread
Follow Ups