Mailinglist Archive: zypp-commit (36 mails)

< Previous Next >
[zypp-commit] Build failed in Jenkins: libzypp-bindings-SLE12SP1 #17
  • From: hudson@xxxxxxx
  • Date: Thu, 2 Jul 2015 01:19:07 +0200 (CEST)
  • Message-id: <1443883827.62.1435792747150.JavaMail.jenkins@river>
See <http://river.suse.de/job/libzypp-bindings-SLE12SP1/17/>

------------------------------------------
Started by upstream project "submit-zypp-to-SLE12SP1" build number 13
Building remotely on node-zypp-SLE12SP1 in workspace
<http://river.suse.de/job/libzypp-bindings-SLE12SP1/ws/>
Checkout:libzypp-bindings-SLE12SP1 /
<http://river.suse.de/job/libzypp-bindings-SLE12SP1/ws/> -
hudson.remoting.Channel@3bc581d7:node-zypp-SLE12SP1
Using strategy: Default
Last Built Revision: Revision 8d5470592f326cb0cb798d49d4b7e7c777e52d39
(origin/master)
Checkout:checkout /
<http://river.suse.de/job/libzypp-bindings-SLE12SP1/ws/checkout> -
hudson.remoting.LocalChannel@4095268b
Fetching changes from the remote Git repository
Fetching upstream changes from git://github.com/openSUSE/libzypp-bindings.git
Commencing build of Revision 8d5470592f326cb0cb798d49d4b7e7c777e52d39
(origin/master)
Checking out Revision 8d5470592f326cb0cb798d49d4b7e7c777e52d39 (origin/master)
[copy-to-slave] Copying '.hudson-scripts/**', excluding nothing, from
'file:/var/lib/jenkins/userContent/' on the master to
'<http://river.suse.de/job/libzypp-bindings-SLE12SP1/ws/'> on
'node-zypp-SLE12SP1'.
[libzypp-bindings-SLE12SP1] $ /bin/sh -xe /tmp/hudson3840645240168053414.sh
+ echo '### BUILD ###'
### BUILD ###
+ echo '==> Reading build configuration'
==> Reading build configuration
+ . .hudson-scripts/base-functions
++ . .hudson-scripts/ascii_art
++ trap 'error_exit $?' ERR
++ echo 'Job running as user: root'
Job running as user: root
+++ date '+%F %T'
++ echo 'Started at: 2015-07-02 01:19:00'
Started at: 2015-07-02 01:19:00
+++ hostname --fqdn
++ export SITENAME=zypp-jenkins-s12sp1
++ SITENAME=zypp-jenkins-s12sp1
++ export TARGET_DIST=SLE12SP1
++ TARGET_DIST=SLE12SP1
++ export PROJECT=libzypp-bindings
++ PROJECT=libzypp-bindings
+ . .hudson-scripts/build-functions
+ . .hudson-scripts/obs-functions
++ trap 'error_exit $?' ERR
++ export ALLOW_OBS_SUBMIT=yes
++ ALLOW_OBS_SUBMIT=yes
+ . .hudson-scripts/setup-buildenvironment
++ export RUNTESTS=1
++ RUNTESTS=1
++ export ICEJOBS=4
++ ICEJOBS=4
++ export CMAKE_INSTALL_PREFIX=/usr
++ CMAKE_INSTALL_PREFIX=/usr
+++ uname -m
+++ hostname -f
++ export 'CMAKEPARAS=-DBUILDNAME=x86_64 -DSITE=zypp-jenkins-s12sp1
-DCMAKE_INSTALL_PREFIX=/usr'
++ CMAKEPARAS='-DBUILDNAME=x86_64 -DSITE=zypp-jenkins-s12sp1
-DCMAKE_INSTALL_PREFIX=/usr'
++ export ICECCDIR=<http://river.suse.de/job/libzypp-bindings-SLE12SP1/ws/ICECC>
++ ICECCDIR=<http://river.suse.de/job/libzypp-bindings-SLE12SP1/ws/ICECC>
++ echo 'Configuring cmake for Icecream ...'
Configuring cmake for Icecream ...
++ rm -rf <http://river.suse.de/job/libzypp-bindings-SLE12SP1/ws/ICECC>
++ mkdir -p <http://river.suse.de/job/libzypp-bindings-SLE12SP1/ws/ICECC>
++ pushd <http://river.suse.de/job/libzypp-bindings-SLE12SP1/ws/ICECC>
~/hudson/workspace/libzypp-bindings-SLE12SP1/ICECC
~/hudson/workspace/libzypp-bindings-SLE12SP1
+++ grep .tar.gz
+++ tail -1
+++ sed -e 's/creating //'
+++ icecc --build-native
++ export ICECC_ENV=4084f6f9a671b53f58017abe8deebcb9.tar.gz
++ ICECC_ENV=4084f6f9a671b53f58017abe8deebcb9.tar.gz
++ export ICECC_ENV=4084f6f9a671b53f58017abe8deebcb9.tar.gz
++ ICECC_ENV=4084f6f9a671b53f58017abe8deebcb9.tar.gz
++ export
ICECC_VERSION=<http://river.suse.de/job/libzypp-bindings-SLE12SP1/ws/ICECC/4084f6f9a671b53f58017abe8deebcb9.tar.gz>
++
ICECC_VERSION=<http://river.suse.de/job/libzypp-bindings-SLE12SP1/ws/ICECC/4084f6f9a671b53f58017abe8deebcb9.tar.gz>
++ popd
~/hudson/workspace/libzypp-bindings-SLE12SP1
++ pushd <http://river.suse.de/job/libzypp-bindings-SLE12SP1/ws/>
~/hudson/workspace/libzypp-bindings-SLE12SP1
~/hudson/workspace/libzypp-bindings-SLE12SP1
++ export ICECREAM_BIN=/opt/icecream/bin
++ ICECREAM_BIN=/opt/icecream/bin
++ test -d /usr/lib/icecc/bin
++ ICECREAM_BIN=/usr/lib/icecc/bin
++ export ICECREAM=-DCMAKE_CXX_COMPILER=/usr/lib/icecc/bin/g++
++ ICECREAM=-DCMAKE_CXX_COMPILER=/usr/lib/icecc/bin/g++
++ export CXX=/usr/lib/icecc/bin/g++
++ CXX=/usr/lib/icecc/bin/g++
++ export 'MAKECMD=make -j 4'
++ MAKECMD='make -j 4'
++ export MAKEBIN=make
++ MAKEBIN=make
++ export
PATH=/usr/lib/icecc/bin:/sbin:/usr/sbin:/usr/local/sbin:/root/bin:/usr/local/bin:/usr/bin:/bin:/usr/games
++
PATH=/usr/lib/icecc/bin:/sbin:/usr/sbin:/usr/local/sbin:/root/bin:/usr/local/bin:/usr/bin:/bin:/usr/games
++ popd
~/hudson/workspace/libzypp-bindings-SLE12SP1
++ export
CHECKOUTDIR=<http://river.suse.de/job/libzypp-bindings-SLE12SP1/ws/checkout>
++ CHECKOUTDIR=<http://river.suse.de/job/libzypp-bindings-SLE12SP1/ws/checkout>
++ export BUILDDIR=<http://river.suse.de/job/libzypp-bindings-SLE12SP1/ws/build>
++ BUILDDIR=<http://river.suse.de/job/libzypp-bindings-SLE12SP1/ws/build>
++ export
PACKAGEDIR=<http://river.suse.de/job/libzypp-bindings-SLE12SP1/ws/build/package>
++
PACKAGEDIR=<http://river.suse.de/job/libzypp-bindings-SLE12SP1/ws/build/package>
++ export
ARTIFACTS=<http://river.suse.de/job/libzypp-bindings-SLE12SP1/17/artifact/.artifacts>
++
ARTIFACTS=<http://river.suse.de/job/libzypp-bindings-SLE12SP1/17/artifact/.artifacts>
++ export OBSDIR=<http://river.suse.de/job/libzypp-bindings-SLE12SP1/ws/OBS>
++ OBSDIR=<http://river.suse.de/job/libzypp-bindings-SLE12SP1/ws/OBS>
++ export RPMTOPDIR=<http://river.suse.de/job/libzypp-bindings-SLE12SP1/ws/rpm>
++ RPMTOPDIR=<http://river.suse.de/job/libzypp-bindings-SLE12SP1/ws/rpm>
++ export
RPMOUT=<http://river.suse.de/job/libzypp-bindings-SLE12SP1/ws/rpm/rpms>
++ RPMOUT=<http://river.suse.de/job/libzypp-bindings-SLE12SP1/ws/rpm/rpms>
++ export
RPMBUILDDIR=<http://river.suse.de/job/libzypp-bindings-SLE12SP1/ws/rpm/rpmbuild>
++
RPMBUILDDIR=<http://river.suse.de/job/libzypp-bindings-SLE12SP1/ws/rpm/rpmbuild>
++ export
RPMBUILDROOT=<http://river.suse.de/job/libzypp-bindings-SLE12SP1/ws/rpm/rpmbuildroot>
++
RPMBUILDROOT=<http://river.suse.de/job/libzypp-bindings-SLE12SP1/ws/rpm/rpmbuildroot>
++ rm -rf <http://river.suse.de/job/libzypp-bindings-SLE12SP1/ws/rpm/rpms>
++ rm -rf <http://river.suse.de/job/libzypp-bindings-SLE12SP1/ws/rpm/rpmbuild>
++ rm -rf
<http://river.suse.de/job/libzypp-bindings-SLE12SP1/ws/rpm/rpmbuildroot>
++ rm -rf
<http://river.suse.de/job/libzypp-bindings-SLE12SP1/17/artifact/.artifacts>
++ rm -rf <http://river.suse.de/job/libzypp-bindings-SLE12SP1/ws/OBS>
++ rm -rf
'<http://river.suse.de/job/libzypp-bindings-SLE12SP1/ws/copy-to-slave*.dir'>
++ [[ '' == 1 ]]
++ rm -rf <http://river.suse.de/job/libzypp-bindings-SLE12SP1/ws/build>
++ mkdir -p <http://river.suse.de/job/libzypp-bindings-SLE12SP1/ws/build>
++ mkdir -p <http://river.suse.de/job/libzypp-bindings-SLE12SP1/ws/rpm>
++ mkdir -p <http://river.suse.de/job/libzypp-bindings-SLE12SP1/ws/rpm/rpms>
++ mkdir -p <http://river.suse.de/job/libzypp-bindings-SLE12SP1/ws/rpm/rpmbuild>
++ mkdir -p
<http://river.suse.de/job/libzypp-bindings-SLE12SP1/ws/rpm/rpmbuildroot>
++ mkdir -p
<http://river.suse.de/job/libzypp-bindings-SLE12SP1/17/artifact/.artifacts>
++ mkdir -p <http://river.suse.de/job/libzypp-bindings-SLE12SP1/ws/OBS>
++ cat
+ build_cmake
+ echo '==> Building'
==> Building
+ pushd <http://river.suse.de/job/libzypp-bindings-SLE12SP1/ws/build>
~/hudson/workspace/libzypp-bindings-SLE12SP1/build
~/hudson/workspace/libzypp-bindings-SLE12SP1
+ cmake -DBUILDNAME=x86_64 -DSITE=zypp-jenkins-s12sp1
-DCMAKE_INSTALL_PREFIX=/usr -DCMAKE_CXX_COMPILER=/usr/lib/icecc/bin/g++
<http://river.suse.de/job/libzypp-bindings-SLE12SP1/ws/checkout>
-- The C compiler identification is GNU 4.8.3
-- The CXX compiler identification is GNU 4.8.3
-- Check for working C compiler: /usr/lib/icecc/bin/cc
-- Check for working C compiler: /usr/lib/icecc/bin/cc -- works
-- Detecting C compiler ABI info
-- Detecting C compiler ABI info - done
-- Check for working CXX compiler: /usr/lib/icecc/bin/g++
-- Check for working CXX compiler: /usr/lib/icecc/bin/g++ -- works
-- Detecting CXX compiler ABI info
-- Detecting CXX compiler ABI info - done
-- Libraries will be installed in /usr/lib64
-- Header files will be installed in /usr/include
-- Config files will be installed in /etc
** Manual files will be installed in /usr/share/man
CMake Warning (dev) at /usr/share/cmake/Modules/CPack.cmake:306 (include):
File /usr/share/cmake/Modules/CPack.cmake includes
/usr/share/cmake/Modules/CPackComponent.cmake (found via CMAKE_MODULE_PATH)
which shadows /usr/share/cmake/Modules/CPackComponent.cmake. This may
cause errors later on .

Policy CMP0017 is not set: Prefer files from the CMake module directory
when including from there. Run "cmake --help-policy CMP0017" for policy
details. Use the cmake_policy command to set the policy and suppress this
warning.
Call Stack (most recent call first):
/usr/share/cmake/Modules/ZyppCommon.cmake:122 (INCLUDE)
CMakeLists.txt:31 (GENERATE_PACKAGING)
This warning is for project developers. Use -Wno-dev to suppress it.

-- Writing spec file...
-- I hate you rpm-lint...!!!
CMake Warning at /usr/share/cmake/Modules/CPack.cmake:289 (message):
CPack.cmake has already been included!!
Call Stack (most recent call first):
CMakeLists.txt:32 (INCLUDE)


CMake Warning (dev) at /usr/share/cmake/Modules/CPack.cmake:306 (include):
File /usr/share/cmake/Modules/CPack.cmake includes
/usr/share/cmake/Modules/CPackComponent.cmake (found via CMAKE_MODULE_PATH)
which shadows /usr/share/cmake/Modules/CPackComponent.cmake. This may
cause errors later on .

Policy CMP0017 is not set: Prefer files from the CMake module directory
when including from there. Run "cmake --help-policy CMP0017" for policy
details. Use the cmake_policy command to set the policy and suppress this
warning.
Call Stack (most recent call first):
CMakeLists.txt:32 (INCLUDE)
This warning is for project developers. Use -Wno-dev to suppress it.

-- Looking modules in
/usr/share/cmake/Modules;<http://river.suse.de/job/libzypp-bindings-SLE12SP1/ws/checkout/cmake/modules>
-- Found SWIG: /usr/bin/swig (found version "2.0.12")
-- ZYpp path not set. Looking for it.
-- ZYpp found: includes in /usr/include, library in /usr/lib64/libzypp.so
-- Zypp so library version 1505
-- Could NOT find Ruby (missing: RUBY_INCLUDE_DIR RUBY_LIBRARY
RUBY_CONFIG_INCLUDE_DIR) (found version "2.1.0")
-- Could NOT find PythonLibs (missing: PYTHON_LIBRARIES PYTHON_INCLUDE_DIRS)
(Required is at least version "2.7")
-- Found Perl: /usr/bin/perl (found version "5.18.2")
-- Perl executable: /usr/bin/perl
-- Perl core dir: /usr/lib/perl5/5.18.2/x86_64-linux-thread-multi/CORE
-- Perl vendor arch dir:
-- Configuring done
-- Generating done
CMake Warning:
Manually-specified variables were not used by the project:

BUILDNAME
SITE


-- Build files have been written to:
<http://river.suse.de/job/libzypp-bindings-SLE12SP1/ws/build>
+ make -j 4
[ 50%] Generating libzypp_perl.cc
Creating wrapper code for
perl.../usr/include/boost/smart_ptr/shared_ptr.hpp:509: Warning 362: operator=
ignored
/usr/include/boost/smart_ptr/shared_ptr.hpp:518: Warning 362: operator= ignored
/usr/include/boost/smart_ptr/shared_ptr.hpp:529: Warning 362: operator= ignored
/usr/include/boost/smart_ptr/shared_ptr.hpp:547: Warning 362: operator= ignored
/usr/include/boost/smart_ptr/shared_ptr.hpp:613: Warning 362: operator= ignored
/usr/include/boost/smart_ptr/shared_ptr.hpp:664: Warning 389: operator[]
ignored (consider using %extend)
/usr/include/boost/smart_ptr/weak_ptr.hpp:150: Warning 362: operator= ignored
/usr/include/boost/smart_ptr/weak_ptr.hpp:172: Warning 362: operator= ignored
/usr/include/boost/smart_ptr/intrusive_ptr.hpp:106: Warning 362: operator=
ignored
/usr/include/boost/smart_ptr/intrusive_ptr.hpp:131: Warning 362: operator=
ignored
/usr/include/boost/smart_ptr/intrusive_ptr.hpp:137: Warning 362: operator=
ignored
/usr/include/zypp/base/PtrTypes.h:307: Warning 362: operator= ignored
/usr/include/zypp/base/PtrTypes.h:480: Warning 362: operator= ignored
/usr/include/zypp/base/Flags.h:69: Warning 371: operator&= ignored
/usr/include/zypp/base/Flags.h:70: Warning 371: operator&= ignored
/usr/include/zypp/base/Flags.h:72: Warning 372: operator|= ignored
/usr/include/zypp/base/Flags.h:73: Warning 372: operator|= ignored
/usr/include/zypp/base/Flags.h:75: Warning 370: operator^= ignored
/usr/include/zypp/base/Flags.h:76: Warning 370: operator^= ignored
/usr/include/zypp/base/Flags.h:123: Error: Syntax error in input(1).
swig/perl5/CMakeFiles/zypp_perl.dir/build.make:58: recipe for target
'swig/perl5/libzypp_perl.cc' failed
make[2]: *** [swig/perl5/libzypp_perl.cc] Error 1
CMakeFiles/Makefile2:188: recipe for target
'swig/perl5/CMakeFiles/zypp_perl.dir/all' failed
make[1]: *** [swig/perl5/CMakeFiles/zypp_perl.dir/all] Error 2
Makefile:146: recipe for target 'all' failed
make: *** [all] Error 2
Build step 'Execute shell' marked build as failure
Archiving artifacts

< Previous Next >
List Navigation
This Thread
Follow Ups
References