Mailinglist Archive: zypp-commit (44 mails)

< Previous Next >
[zypp-commit] Build failed in Jenkins: libzypp-bindings-HEAD #1509
  • From: hudson@xxxxxxx
  • Date: Sat, 27 Jun 2015 17:25:21 +0200 (CEST)
  • Message-id: <544240938.171.1435418721537.JavaMail.jenkins@river>
See <http://river.suse.de/job/libzypp-bindings-HEAD/1509/>

------------------------------------------
[...truncated 1093 lines...]
from /usr/include/c++/4.8/stdexcept:39,
from
<http://river.suse.de/job/libzypp-bindings-HEAD/ws/build/swig/perl5/libzypp_perl.cc>:1904:
/usr/include/c++/4.8/bits/range_access.h:97:5: note: template<class _Tp, long
unsigned int _Nm> _Tp* std::end(_Tp (&)[_Nm])
/usr/include/c++/4.8/bits/range_access.h:97:5: note: template argument
deduction/substitution failed:
In file included from /usr/include/zypp/ResObjects.h:16:0,
from
<http://river.suse.de/job/libzypp-bindings-HEAD/ws/build/swig/perl5/libzypp_perl.cc>:2048:
/usr/include/zypp/Patch.h:146:2: note: mismatched types '_Tp [_Nm]' and
'const SwigValueWrapper<zypp::base::Flags<zypp::Patch::SeverityFlag> >'
In file included from /usr/include/c++/4.8/string:51:0,
from /usr/include/c++/4.8/stdexcept:39,
from
<http://river.suse.de/job/libzypp-bindings-HEAD/ws/build/swig/perl5/libzypp_perl.cc>:1904:
/usr/include/c++/4.8/bits/range_access.h:78:5: note: template<class _Container>
decltype (__cont.end()) std::end(const _Container&)
/usr/include/c++/4.8/bits/range_access.h:78:5: note: template argument
deduction/substitution failed:
/usr/include/c++/4.8/bits/range_access.h: In substitution of 'template<class
_Container> decltype (__cont.end()) std::end(const _Container&) [with
_Container = SwigValueWrapper<zypp::base::Flags<zypp::Patch::SeverityFlag> >]':
/usr/include/zypp/Patch.h:146:2: required from 'bool
zypp::Patch::isSeverity(const _Container&) const [with _Container =
SwigValueWrapper<zypp::base::Flags<zypp::Patch::SeverityFlag> >]'
<http://river.suse.de/job/libzypp-bindings-HEAD/ws/build/swig/perl5/libzypp_perl.cc>:56702:44:
required from here
/usr/include/c++/4.8/bits/range_access.h:78:5: error: 'const class
SwigValueWrapper<zypp::base::Flags<zypp::Patch::SeverityFlag> >' has no member
named 'end'
/usr/include/zypp/Patch.h: In instantiation of 'bool
zypp::Patch::isSeverity(const _Container&) const [with _Container =
SwigValueWrapper<zypp::base::Flags<zypp::Patch::SeverityFlag> >]':
<http://river.suse.de/job/libzypp-bindings-HEAD/ws/build/swig/perl5/libzypp_perl.cc>:56702:44:
required from here
/usr/include/c++/4.8/bits/range_access.h:68:5: note: template<class _Container>
decltype (__cont.end()) std::end(_Container&)
/usr/include/c++/4.8/bits/range_access.h:68:5: note: template argument
deduction/substitution failed:
/usr/include/c++/4.8/bits/range_access.h: In substitution of 'template<class
_Container> decltype (__cont.end()) std::end(_Container&) [with _Container =
const SwigValueWrapper<zypp::base::Flags<zypp::Patch::SeverityFlag> >]':
/usr/include/zypp/Patch.h:146:2: required from 'bool
zypp::Patch::isSeverity(const _Container&) const [with _Container =
SwigValueWrapper<zypp::base::Flags<zypp::Patch::SeverityFlag> >]'
<http://river.suse.de/job/libzypp-bindings-HEAD/ws/build/swig/perl5/libzypp_perl.cc>:56702:44:
required from here
/usr/include/c++/4.8/bits/range_access.h:68:5: error: 'const class
SwigValueWrapper<zypp::base::Flags<zypp::Patch::SeverityFlag> >' has no member
named 'end'
ICECC[30290] 17:24:48: Compiled on 10.161.8.141
swig/perl5/CMakeFiles/zypp_perl.dir/build.make:63: recipe for target
'swig/perl5/CMakeFiles/zypp_perl.dir/libzypp_perl.cc.o' failed
make[2]: *** [swig/perl5/CMakeFiles/zypp_perl.dir/libzypp_perl.cc.o] Error 1
CMakeFiles/Makefile2:325: recipe for target
'swig/perl5/CMakeFiles/zypp_perl.dir/all' failed
make[1]: *** [swig/perl5/CMakeFiles/zypp_perl.dir/all] Error 2
In file included from
<http://river.suse.de/job/libzypp-bindings-HEAD/ws/build/swig/python/libzypp_python.cc>:3553:0:
<http://river.suse.de/job/libzypp-bindings-HEAD/ws/checkout/swig/legacy/GetResolvablesToInsDel.h>:88:94:
warning: 'GetResolvablesToInsDel' is deprecated [-Wdeprecated-declarations]
<http://river.suse.de/job/libzypp-bindings-HEAD/ws/build/swig/python/libzypp_python.cc>:6127:119:
warning: 'GetResolvablesToInsDel' is deprecated (declared at
<http://river.suse.de/job/libzypp-bindings-HEAD/ws/checkout/swig/legacy/GetResolvablesToInsDel.h>:41)
[-Wdeprecated-declarations]
<http://river.suse.de/job/libzypp-bindings-HEAD/ws/build/swig/python/libzypp_python.cc>:
In function 'PyObject* _wrap_KeyRing_Ptr_setDefaultAccept(PyObject*,
PyObject*)':
<http://river.suse.de/job/libzypp-bindings-HEAD/ws/build/swig/python/libzypp_python.cc>:113631:41:
warning: variable 'arg1' set but not used [-Wunused-but-set-variable]
<http://river.suse.de/job/libzypp-bindings-HEAD/ws/build/swig/python/libzypp_python.cc>:
In function 'PyObject* _wrap_KeyRing_Ptr_defaultAccept(PyObject*, PyObject*)':
<http://river.suse.de/job/libzypp-bindings-HEAD/ws/build/swig/python/libzypp_python.cc>:113670:41:
warning: variable 'arg1' set but not used [-Wunused-but-set-variable]
<http://river.suse.de/job/libzypp-bindings-HEAD/ws/build/swig/python/libzypp_python.cc>:
In function 'PyObject* _wrap_ResPool_getTransaction(PyObject*, PyObject*)':
<http://river.suse.de/job/libzypp-bindings-HEAD/ws/build/swig/python/libzypp_python.cc>:128790:33:
warning: 'GetResolvablesToInsDel' is deprecated (declared at
<http://river.suse.de/job/libzypp-bindings-HEAD/ws/checkout/swig/legacy/GetResolvablesToInsDel.h>:41)
[-Wdeprecated-declarations]
<http://river.suse.de/job/libzypp-bindings-HEAD/ws/build/swig/python/libzypp_python.cc>:128808:66:
warning: 'GetResolvablesToInsDel' is deprecated (declared at
<http://river.suse.de/job/libzypp-bindings-HEAD/ws/checkout/swig/legacy/GetResolvablesToInsDel.h>:41)
[-Wdeprecated-declarations]
<http://river.suse.de/job/libzypp-bindings-HEAD/ws/build/swig/python/libzypp_python.cc>:128808:142:
warning: 'GetResolvablesToInsDel' is deprecated (declared at
<http://river.suse.de/job/libzypp-bindings-HEAD/ws/checkout/swig/legacy/GetResolvablesToInsDel.h>:41)
[-Wdeprecated-declarations]
<http://river.suse.de/job/libzypp-bindings-HEAD/ws/build/swig/python/libzypp_python.cc>:
In function 'PyObject* _wrap_new_GetResolvablesToInsDel__SWIG_0(PyObject*,
PyObject*)':
<http://river.suse.de/job/libzypp-bindings-HEAD/ws/build/swig/python/libzypp_python.cc>:128989:39:
warning: 'GetResolvablesToInsDel' is deprecated (declared at
<http://river.suse.de/job/libzypp-bindings-HEAD/ws/checkout/swig/legacy/GetResolvablesToInsDel.h>:41)
[-Wdeprecated-declarations]
<http://river.suse.de/job/libzypp-bindings-HEAD/ws/build/swig/python/libzypp_python.cc>:129012:52:
warning: 'GetResolvablesToInsDel' is deprecated (declared at
<http://river.suse.de/job/libzypp-bindings-HEAD/ws/checkout/swig/legacy/GetResolvablesToInsDel.h>:41)
[-Wdeprecated-declarations]
<http://river.suse.de/job/libzypp-bindings-HEAD/ws/build/swig/python/libzypp_python.cc>:129012:70:
warning: 'GetResolvablesToInsDel' is deprecated (declared at
<http://river.suse.de/job/libzypp-bindings-HEAD/ws/checkout/swig/legacy/GetResolvablesToInsDel.h>:41)
[-Wdeprecated-declarations]
<http://river.suse.de/job/libzypp-bindings-HEAD/ws/build/swig/python/libzypp_python.cc>:
In function 'PyObject* _wrap_new_GetResolvablesToInsDel__SWIG_1(PyObject*,
PyObject*)':
<http://river.suse.de/job/libzypp-bindings-HEAD/ws/build/swig/python/libzypp_python.cc>:129033:39:
warning: 'GetResolvablesToInsDel' is deprecated (declared at
<http://river.suse.de/job/libzypp-bindings-HEAD/ws/checkout/swig/legacy/GetResolvablesToInsDel.h>:41)
[-Wdeprecated-declarations]
<http://river.suse.de/job/libzypp-bindings-HEAD/ws/build/swig/python/libzypp_python.cc>:129051:52:
warning: 'GetResolvablesToInsDel' is deprecated (declared at
<http://river.suse.de/job/libzypp-bindings-HEAD/ws/checkout/swig/legacy/GetResolvablesToInsDel.h>:41)
[-Wdeprecated-declarations]
<http://river.suse.de/job/libzypp-bindings-HEAD/ws/build/swig/python/libzypp_python.cc>:129051:70:
warning: 'GetResolvablesToInsDel' is deprecated (declared at
<http://river.suse.de/job/libzypp-bindings-HEAD/ws/checkout/swig/legacy/GetResolvablesToInsDel.h>:41)
[-Wdeprecated-declarations]
<http://river.suse.de/job/libzypp-bindings-HEAD/ws/build/swig/python/libzypp_python.cc>:
In function 'PyObject* _wrap_GetResolvablesToInsDel__toDelete_set(PyObject*,
PyObject*)':
<http://river.suse.de/job/libzypp-bindings-HEAD/ws/build/swig/python/libzypp_python.cc>:129110:39:
warning: 'GetResolvablesToInsDel' is deprecated (declared at
<http://river.suse.de/job/libzypp-bindings-HEAD/ws/checkout/swig/legacy/GetResolvablesToInsDel.h>:41)
[-Wdeprecated-declarations]
<http://river.suse.de/job/libzypp-bindings-HEAD/ws/build/swig/python/libzypp_python.cc>:129110:82:
warning: 'GetResolvablesToInsDel' is deprecated (declared at
<http://river.suse.de/job/libzypp-bindings-HEAD/ws/checkout/swig/legacy/GetResolvablesToInsDel.h>:41)
[-Wdeprecated-declarations]
<http://river.suse.de/job/libzypp-bindings-HEAD/ws/build/swig/python/libzypp_python.cc>:129124:63:
warning: 'GetResolvablesToInsDel' is deprecated (declared at
<http://river.suse.de/job/libzypp-bindings-HEAD/ws/checkout/swig/legacy/GetResolvablesToInsDel.h>:41)
[-Wdeprecated-declarations]
<http://river.suse.de/job/libzypp-bindings-HEAD/ws/build/swig/python/libzypp_python.cc>:
In function 'PyObject* _wrap_GetResolvablesToInsDel__toDelete_get(PyObject*,
PyObject*)':
<http://river.suse.de/job/libzypp-bindings-HEAD/ws/build/swig/python/libzypp_python.cc>:129140:39:
warning: 'GetResolvablesToInsDel' is deprecated (declared at
<http://river.suse.de/job/libzypp-bindings-HEAD/ws/checkout/swig/legacy/GetResolvablesToInsDel.h>:41)
[-Wdeprecated-declarations]
<http://river.suse.de/job/libzypp-bindings-HEAD/ws/build/swig/python/libzypp_python.cc>:129140:82:
warning: 'GetResolvablesToInsDel' is deprecated (declared at
<http://river.suse.de/job/libzypp-bindings-HEAD/ws/checkout/swig/legacy/GetResolvablesToInsDel.h>:41)
[-Wdeprecated-declarations]
<http://river.suse.de/job/libzypp-bindings-HEAD/ws/build/swig/python/libzypp_python.cc>:129151:63:
warning: 'GetResolvablesToInsDel' is deprecated (declared at
<http://river.suse.de/job/libzypp-bindings-HEAD/ws/checkout/swig/legacy/GetResolvablesToInsDel.h>:41)
[-Wdeprecated-declarations]
<http://river.suse.de/job/libzypp-bindings-HEAD/ws/build/swig/python/libzypp_python.cc>:
In function 'PyObject* _wrap_GetResolvablesToInsDel__toInstall_set(PyObject*,
PyObject*)':
<http://river.suse.de/job/libzypp-bindings-HEAD/ws/build/swig/python/libzypp_python.cc>:129162:39:
warning: 'GetResolvablesToInsDel' is deprecated (declared at
<http://river.suse.de/job/libzypp-bindings-HEAD/ws/checkout/swig/legacy/GetResolvablesToInsDel.h>:41)
[-Wdeprecated-declarations]
<http://river.suse.de/job/libzypp-bindings-HEAD/ws/build/swig/python/libzypp_python.cc>:129162:82:
warning: 'GetResolvablesToInsDel' is deprecated (declared at
<http://river.suse.de/job/libzypp-bindings-HEAD/ws/checkout/swig/legacy/GetResolvablesToInsDel.h>:41)
[-Wdeprecated-declarations]
<http://river.suse.de/job/libzypp-bindings-HEAD/ws/build/swig/python/libzypp_python.cc>:129176:63:
warning: 'GetResolvablesToInsDel' is deprecated (declared at
<http://river.suse.de/job/libzypp-bindings-HEAD/ws/checkout/swig/legacy/GetResolvablesToInsDel.h>:41)
[-Wdeprecated-declarations]
<http://river.suse.de/job/libzypp-bindings-HEAD/ws/build/swig/python/libzypp_python.cc>:
In function 'PyObject* _wrap_GetResolvablesToInsDel__toInstall_get(PyObject*,
PyObject*)':
<http://river.suse.de/job/libzypp-bindings-HEAD/ws/build/swig/python/libzypp_python.cc>:129192:39:
warning: 'GetResolvablesToInsDel' is deprecated (declared at
<http://river.suse.de/job/libzypp-bindings-HEAD/ws/checkout/swig/legacy/GetResolvablesToInsDel.h>:41)
[-Wdeprecated-declarations]
<http://river.suse.de/job/libzypp-bindings-HEAD/ws/build/swig/python/libzypp_python.cc>:129192:82:
warning: 'GetResolvablesToInsDel' is deprecated (declared at
<http://river.suse.de/job/libzypp-bindings-HEAD/ws/checkout/swig/legacy/GetResolvablesToInsDel.h>:41)
[-Wdeprecated-declarations]
<http://river.suse.de/job/libzypp-bindings-HEAD/ws/build/swig/python/libzypp_python.cc>:129203:63:
warning: 'GetResolvablesToInsDel' is deprecated (declared at
<http://river.suse.de/job/libzypp-bindings-HEAD/ws/checkout/swig/legacy/GetResolvablesToInsDel.h>:41)
[-Wdeprecated-declarations]
<http://river.suse.de/job/libzypp-bindings-HEAD/ws/build/swig/python/libzypp_python.cc>:
In function 'PyObject*
_wrap_GetResolvablesToInsDel__toSrcinstall_set(PyObject*, PyObject*)':
<http://river.suse.de/job/libzypp-bindings-HEAD/ws/build/swig/python/libzypp_python.cc>:129214:39:
warning: 'GetResolvablesToInsDel' is deprecated (declared at
<http://river.suse.de/job/libzypp-bindings-HEAD/ws/checkout/swig/legacy/GetResolvablesToInsDel.h>:41)
[-Wdeprecated-declarations]
<http://river.suse.de/job/libzypp-bindings-HEAD/ws/build/swig/python/libzypp_python.cc>:129214:82:
warning: 'GetResolvablesToInsDel' is deprecated (declared at
<http://river.suse.de/job/libzypp-bindings-HEAD/ws/checkout/swig/legacy/GetResolvablesToInsDel.h>:41)
[-Wdeprecated-declarations]
<http://river.suse.de/job/libzypp-bindings-HEAD/ws/build/swig/python/libzypp_python.cc>:129228:63:
warning: 'GetResolvablesToInsDel' is deprecated (declared at
<http://river.suse.de/job/libzypp-bindings-HEAD/ws/checkout/swig/legacy/GetResolvablesToInsDel.h>:41)
[-Wdeprecated-declarations]
<http://river.suse.de/job/libzypp-bindings-HEAD/ws/build/swig/python/libzypp_python.cc>:
In function 'PyObject*
_wrap_GetResolvablesToInsDel__toSrcinstall_get(PyObject*, PyObject*)':
<http://river.suse.de/job/libzypp-bindings-HEAD/ws/build/swig/python/libzypp_python.cc>:129244:39:
warning: 'GetResolvablesToInsDel' is deprecated (declared at
<http://river.suse.de/job/libzypp-bindings-HEAD/ws/checkout/swig/legacy/GetResolvablesToInsDel.h>:41)
[-Wdeprecated-declarations]
<http://river.suse.de/job/libzypp-bindings-HEAD/ws/build/swig/python/libzypp_python.cc>:129244:82:
warning: 'GetResolvablesToInsDel' is deprecated (declared at
<http://river.suse.de/job/libzypp-bindings-HEAD/ws/checkout/swig/legacy/GetResolvablesToInsDel.h>:41)
[-Wdeprecated-declarations]
<http://river.suse.de/job/libzypp-bindings-HEAD/ws/build/swig/python/libzypp_python.cc>:129255:63:
warning: 'GetResolvablesToInsDel' is deprecated (declared at
<http://river.suse.de/job/libzypp-bindings-HEAD/ws/checkout/swig/legacy/GetResolvablesToInsDel.h>:41)
[-Wdeprecated-declarations]
<http://river.suse.de/job/libzypp-bindings-HEAD/ws/build/swig/python/libzypp_python.cc>:
In function 'PyObject* _wrap_delete_GetResolvablesToInsDel(PyObject*,
PyObject*)':
<http://river.suse.de/job/libzypp-bindings-HEAD/ws/build/swig/python/libzypp_python.cc>:129266:39:
warning: 'GetResolvablesToInsDel' is deprecated (declared at
<http://river.suse.de/job/libzypp-bindings-HEAD/ws/checkout/swig/legacy/GetResolvablesToInsDel.h>:41)
[-Wdeprecated-declarations]
<http://river.suse.de/job/libzypp-bindings-HEAD/ws/build/swig/python/libzypp_python.cc>:129266:82:
warning: 'GetResolvablesToInsDel' is deprecated (declared at
<http://river.suse.de/job/libzypp-bindings-HEAD/ws/checkout/swig/legacy/GetResolvablesToInsDel.h>:41)
[-Wdeprecated-declarations]
<http://river.suse.de/job/libzypp-bindings-HEAD/ws/build/swig/python/libzypp_python.cc>:129276:63:
warning: 'GetResolvablesToInsDel' is deprecated (declared at
<http://river.suse.de/job/libzypp-bindings-HEAD/ws/checkout/swig/legacy/GetResolvablesToInsDel.h>:41)
[-Wdeprecated-declarations]
In file included from /usr/include/zypp/ResObjects.h:16:0,
from
<http://river.suse.de/job/libzypp-bindings-HEAD/ws/build/swig/python/libzypp_python.cc>:3540:
/usr/include/zypp/Patch.h: In instantiation of 'bool
zypp::Patch::isCategory(const _Container&) const [with _Container =
SwigValueWrapper<zypp::base::Flags<zypp::Patch::Category> >]':
<http://river.suse.de/job/libzypp-bindings-HEAD/ws/build/swig/python/libzypp_python.cc>:65512:46:
required from here
/usr/include/zypp/Patch.h:113:2: error: no matching function for call to
'begin(const SwigValueWrapper<zypp::base::Flags<zypp::Patch::Category> >&)'
/usr/include/zypp/Patch.h:113:2: note: candidates are:
In file included from /usr/include/c++/4.8/bits/basic_string.h:42:0,
from /usr/include/c++/4.8/string:52,
from /usr/include/c++/4.8/stdexcept:39,
from
<http://river.suse.de/job/libzypp-bindings-HEAD/ws/build/swig/python/libzypp_python.cc>:3359:
/usr/include/c++/4.8/initializer_list:89:5: note: template<class _Tp> constexpr
const _Tp* std::begin(std::initializer_list<_Tp>)
/usr/include/c++/4.8/initializer_list:89:5: note: template argument
deduction/substitution failed:
In file included from /usr/include/zypp/ResObjects.h:16:0,
from
<http://river.suse.de/job/libzypp-bindings-HEAD/ws/build/swig/python/libzypp_python.cc>:3540:
/usr/include/zypp/Patch.h:113:2: note:
'SwigValueWrapper<zypp::base::Flags<zypp::Patch::Category> >' is not derived
from 'std::initializer_list<_Tp>'
In file included from /usr/include/c++/4.8/string:51:0,
from /usr/include/c++/4.8/stdexcept:39,
from
<http://river.suse.de/job/libzypp-bindings-HEAD/ws/build/swig/python/libzypp_python.cc>:3359:
/usr/include/c++/4.8/bits/range_access.h:87:5: note: template<class _Tp, long
unsigned int _Nm> _Tp* std::begin(_Tp (&)[_Nm])
/usr/include/c++/4.8/bits/range_access.h:87:5: note: template argument
deduction/substitution failed:
In file included from /usr/include/zypp/ResObjects.h:16:0,
from
<http://river.suse.de/job/libzypp-bindings-HEAD/ws/build/swig/python/libzypp_python.cc>:3540:
/usr/include/zypp/Patch.h:113:2: note: mismatched types '_Tp [_Nm]' and
'const SwigValueWrapper<zypp::base::Flags<zypp::Patch::Category> >'
In file included from /usr/include/c++/4.8/string:51:0,
from /usr/include/c++/4.8/stdexcept:39,
from
<http://river.suse.de/job/libzypp-bindings-HEAD/ws/build/swig/python/libzypp_python.cc>:3359:
/usr/include/c++/4.8/bits/range_access.h:58:5: note: template<class _Container>
decltype (__cont.begin()) std::begin(const _Container&)
/usr/include/c++/4.8/bits/range_access.h:58:5: note: template argument
deduction/substitution failed:
/usr/include/c++/4.8/bits/range_access.h: In substitution of 'template<class
_Container> decltype (__cont.begin()) std::begin(const _Container&) [with
_Container = SwigValueWrapper<zypp::base::Flags<zypp::Patch::Category> >]':
/usr/include/zypp/Patch.h:113:2: required from 'bool
zypp::Patch::isCategory(const _Container&) const [with _Container =
SwigValueWrapper<zypp::base::Flags<zypp::Patch::Category> >]'
<http://river.suse.de/job/libzypp-bindings-HEAD/ws/build/swig/python/libzypp_python.cc>:65512:46:
required from here
/usr/include/c++/4.8/bits/range_access.h:58:5: error: 'const class
SwigValueWrapper<zypp::base::Flags<zypp::Patch::Category> >' has no member
named 'begin'
/usr/include/zypp/Patch.h: In instantiation of 'bool
zypp::Patch::isCategory(const _Container&) const [with _Container =
SwigValueWrapper<zypp::base::Flags<zypp::Patch::Category> >]':
<http://river.suse.de/job/libzypp-bindings-HEAD/ws/build/swig/python/libzypp_python.cc>:65512:46:
required from here
/usr/include/c++/4.8/bits/range_access.h:48:5: note: template<class _Container>
decltype (__cont.begin()) std::begin(_Container&)
/usr/include/c++/4.8/bits/range_access.h:48:5: note: template argument
deduction/substitution failed:
/usr/include/c++/4.8/bits/range_access.h: In substitution of 'template<class
_Container> decltype (__cont.begin()) std::begin(_Container&) [with _Container
= const SwigValueWrapper<zypp::base::Flags<zypp::Patch::Category> >]':
/usr/include/zypp/Patch.h:113:2: required from 'bool
zypp::Patch::isCategory(const _Container&) const [with _Container =
SwigValueWrapper<zypp::base::Flags<zypp::Patch::Category> >]'
<http://river.suse.de/job/libzypp-bindings-HEAD/ws/build/swig/python/libzypp_python.cc>:65512:46:
required from here
/usr/include/c++/4.8/bits/range_access.h:48:5: error: 'const class
SwigValueWrapper<zypp::base::Flags<zypp::Patch::Category> >' has no member
named 'begin'
In file included from /usr/include/zypp/ResObjects.h:16:0,
from
<http://river.suse.de/job/libzypp-bindings-HEAD/ws/build/swig/python/libzypp_python.cc>:3540:
/usr/include/zypp/Patch.h: In instantiation of 'bool
zypp::Patch::isCategory(const _Container&) const [with _Container =
SwigValueWrapper<zypp::base::Flags<zypp::Patch::Category> >]':
<http://river.suse.de/job/libzypp-bindings-HEAD/ws/build/swig/python/libzypp_python.cc>:65512:46:
required from here
/usr/include/zypp/Patch.h:113:2: error: no matching function for call to
'end(const SwigValueWrapper<zypp::base::Flags<zypp::Patch::Category> >&)'
/usr/include/zypp/Patch.h:113:2: note: candidates are:
In file included from /usr/include/c++/4.8/bits/basic_string.h:42:0,
from /usr/include/c++/4.8/string:52,
from /usr/include/c++/4.8/stdexcept:39,
from
<http://river.suse.de/job/libzypp-bindings-HEAD/ws/build/swig/python/libzypp_python.cc>:3359:
/usr/include/c++/4.8/initializer_list:99:5: note: template<class _Tp> constexpr
const _Tp* std::end(std::initializer_list<_Tp>)
/usr/include/c++/4.8/initializer_list:99:5: note: template argument
deduction/substitution failed:
In file included from /usr/include/zypp/ResObjects.h:16:0,
from
<http://river.suse.de/job/libzypp-bindings-HEAD/ws/build/swig/python/libzypp_python.cc>:3540:
/usr/include/zypp/Patch.h:113:2: note:
'SwigValueWrapper<zypp::base::Flags<zypp::Patch::Category> >' is not derived
from 'std::initializer_list<_Tp>'
In file included from /usr/include/c++/4.8/string:51:0,
from /usr/include/c++/4.8/stdexcept:39,
from
<http://river.suse.de/job/libzypp-bindings-HEAD/ws/build/swig/python/libzypp_python.cc>:3359:
/usr/include/c++/4.8/bits/range_access.h:97:5: note: template<class _Tp, long
unsigned int _Nm> _Tp* std::end(_Tp (&)[_Nm])
/usr/include/c++/4.8/bits/range_access.h:97:5: note: template argument
deduction/substitution failed:
In file included from /usr/include/zypp/ResObjects.h:16:0,
from
<http://river.suse.de/job/libzypp-bindings-HEAD/ws/build/swig/python/libzypp_python.cc>:3540:
/usr/include/zypp/Patch.h:113:2: note: mismatched types '_Tp [_Nm]' and
'const SwigValueWrapper<zypp::base::Flags<zypp::Patch::Category> >'
In file included from /usr/include/c++/4.8/string:51:0,
from /usr/include/c++/4.8/stdexcept:39,
from
<http://river.suse.de/job/libzypp-bindings-HEAD/ws/build/swig/python/libzypp_python.cc>:3359:
/usr/include/c++/4.8/bits/range_access.h:78:5: note: template<class _Container>
decltype (__cont.end()) std::end(const _Container&)
/usr/include/c++/4.8/bits/range_access.h:78:5: note: template argument
deduction/substitution failed:
/usr/include/c++/4.8/bits/range_access.h: In substitution of 'template<class
_Container> decltype (__cont.end()) std::end(const _Container&) [with
_Container = SwigValueWrapper<zypp::base::Flags<zypp::Patch::Category> >]':
/usr/include/zypp/Patch.h:113:2: required from 'bool
zypp::Patch::isCategory(const _Container&) const [with _Container =
SwigValueWrapper<zypp::base::Flags<zypp::Patch::Category> >]'
<http://river.suse.de/job/libzypp-bindings-HEAD/ws/build/swig/python/libzypp_python.cc>:65512:46:
required from here
/usr/include/c++/4.8/bits/range_access.h:78:5: error: 'const class
SwigValueWrapper<zypp::base::Flags<zypp::Patch::Category> >' has no member
named 'end'
/usr/include/zypp/Patch.h: In instantiation of 'bool
zypp::Patch::isCategory(const _Container&) const [with _Container =
SwigValueWrapper<zypp::base::Flags<zypp::Patch::Category> >]':
<http://river.suse.de/job/libzypp-bindings-HEAD/ws/build/swig/python/libzypp_python.cc>:65512:46:
required from here
/usr/include/c++/4.8/bits/range_access.h:68:5: note: template<class _Container>
decltype (__cont.end()) std::end(_Container&)
/usr/include/c++/4.8/bits/range_access.h:68:5: note: template argument
deduction/substitution failed:
/usr/include/c++/4.8/bits/range_access.h: In substitution of 'template<class
_Container> decltype (__cont.end()) std::end(_Container&) [with _Container =
const SwigValueWrapper<zypp::base::Flags<zypp::Patch::Category> >]':
/usr/include/zypp/Patch.h:113:2: required from 'bool
zypp::Patch::isCategory(const _Container&) const [with _Container =
SwigValueWrapper<zypp::base::Flags<zypp::Patch::Category> >]'
<http://river.suse.de/job/libzypp-bindings-HEAD/ws/build/swig/python/libzypp_python.cc>:65512:46:
required from here
/usr/include/c++/4.8/bits/range_access.h:68:5: error: 'const class
SwigValueWrapper<zypp::base::Flags<zypp::Patch::Category> >' has no member
named 'end'
In file included from /usr/include/zypp/ResObjects.h:16:0,
from
<http://river.suse.de/job/libzypp-bindings-HEAD/ws/build/swig/python/libzypp_python.cc>:3540:
/usr/include/zypp/Patch.h: In instantiation of 'bool
zypp::Patch::isSeverity(const _Container&) const [with _Container =
SwigValueWrapper<zypp::base::Flags<zypp::Patch::SeverityFlag> >]':
<http://river.suse.de/job/libzypp-bindings-HEAD/ws/build/swig/python/libzypp_python.cc>:65715:46:
required from here
/usr/include/zypp/Patch.h:146:2: error: no matching function for call to
'begin(const SwigValueWrapper<zypp::base::Flags<zypp::Patch::SeverityFlag> >&)'
/usr/include/zypp/Patch.h:146:2: note: candidates are:
In file included from /usr/include/c++/4.8/bits/basic_string.h:42:0,
from /usr/include/c++/4.8/string:52,
from /usr/include/c++/4.8/stdexcept:39,
from
<http://river.suse.de/job/libzypp-bindings-HEAD/ws/build/swig/python/libzypp_python.cc>:3359:
/usr/include/c++/4.8/initializer_list:89:5: note: template<class _Tp> constexpr
const _Tp* std::begin(std::initializer_list<_Tp>)
/usr/include/c++/4.8/initializer_list:89:5: note: template argument
deduction/substitution failed:
In file included from /usr/include/zypp/ResObjects.h:16:0,
from
<http://river.suse.de/job/libzypp-bindings-HEAD/ws/build/swig/python/libzypp_python.cc>:3540:
/usr/include/zypp/Patch.h:146:2: note:
'SwigValueWrapper<zypp::base::Flags<zypp::Patch::SeverityFlag> >' is not
derived from 'std::initializer_list<_Tp>'
In file included from /usr/include/c++/4.8/string:51:0,
from /usr/include/c++/4.8/stdexcept:39,
from
<http://river.suse.de/job/libzypp-bindings-HEAD/ws/build/swig/python/libzypp_python.cc>:3359:
/usr/include/c++/4.8/bits/range_access.h:87:5: note: template<class _Tp, long
unsigned int _Nm> _Tp* std::begin(_Tp (&)[_Nm])
/usr/include/c++/4.8/bits/range_access.h:87:5: note: template argument
deduction/substitution failed:
In file included from /usr/include/zypp/ResObjects.h:16:0,
from
<http://river.suse.de/job/libzypp-bindings-HEAD/ws/build/swig/python/libzypp_python.cc>:3540:
/usr/include/zypp/Patch.h:146:2: note: mismatched types '_Tp [_Nm]' and
'const SwigValueWrapper<zypp::base::Flags<zypp::Patch::SeverityFlag> >'
In file included from /usr/include/c++/4.8/string:51:0,
from /usr/include/c++/4.8/stdexcept:39,
from
<http://river.suse.de/job/libzypp-bindings-HEAD/ws/build/swig/python/libzypp_python.cc>:3359:
/usr/include/c++/4.8/bits/range_access.h:58:5: note: template<class _Container>
decltype (__cont.begin()) std::begin(const _Container&)
/usr/include/c++/4.8/bits/range_access.h:58:5: note: template argument
deduction/substitution failed:
/usr/include/c++/4.8/bits/range_access.h: In substitution of 'template<class
_Container> decltype (__cont.begin()) std::begin(const _Container&) [with
_Container = SwigValueWrapper<zypp::base::Flags<zypp::Patch::SeverityFlag> >]':
/usr/include/zypp/Patch.h:146:2: required from 'bool
zypp::Patch::isSeverity(const _Container&) const [with _Container =
SwigValueWrapper<zypp::base::Flags<zypp::Patch::SeverityFlag> >]'
<http://river.suse.de/job/libzypp-bindings-HEAD/ws/build/swig/python/libzypp_python.cc>:65715:46:
required from here
/usr/include/c++/4.8/bits/range_access.h:58:5: error: 'const class
SwigValueWrapper<zypp::base::Flags<zypp::Patch::SeverityFlag> >' has no member
named 'begin'
/usr/include/zypp/Patch.h: In instantiation of 'bool
zypp::Patch::isSeverity(const _Container&) const [with _Container =
SwigValueWrapper<zypp::base::Flags<zypp::Patch::SeverityFlag> >]':
<http://river.suse.de/job/libzypp-bindings-HEAD/ws/build/swig/python/libzypp_python.cc>:65715:46:
required from here
/usr/include/c++/4.8/bits/range_access.h:48:5: note: template<class _Container>
decltype (__cont.begin()) std::begin(_Container&)
/usr/include/c++/4.8/bits/range_access.h:48:5: note: template argument
deduction/substitution failed:
/usr/include/c++/4.8/bits/range_access.h: In substitution of 'template<class
_Container> decltype (__cont.begin()) std::begin(_Container&) [with _Container
= const SwigValueWrapper<zypp::base::Flags<zypp::Patch::SeverityFlag> >]':
/usr/include/zypp/Patch.h:146:2: required from 'bool
zypp::Patch::isSeverity(const _Container&) const [with _Container =
SwigValueWrapper<zypp::base::Flags<zypp::Patch::SeverityFlag> >]'
<http://river.suse.de/job/libzypp-bindings-HEAD/ws/build/swig/python/libzypp_python.cc>:65715:46:
required from here
/usr/include/c++/4.8/bits/range_access.h:48:5: error: 'const class
SwigValueWrapper<zypp::base::Flags<zypp::Patch::SeverityFlag> >' has no member
named 'begin'
In file included from /usr/include/zypp/ResObjects.h:16:0,
from
<http://river.suse.de/job/libzypp-bindings-HEAD/ws/build/swig/python/libzypp_python.cc>:3540:
/usr/include/zypp/Patch.h: In instantiation of 'bool
zypp::Patch::isSeverity(const _Container&) const [with _Container =
SwigValueWrapper<zypp::base::Flags<zypp::Patch::SeverityFlag> >]':
<http://river.suse.de/job/libzypp-bindings-HEAD/ws/build/swig/python/libzypp_python.cc>:65715:46:
required from here
/usr/include/zypp/Patch.h:146:2: error: no matching function for call to
'end(const SwigValueWrapper<zypp::base::Flags<zypp::Patch::SeverityFlag> >&)'
/usr/include/zypp/Patch.h:146:2: note: candidates are:
In file included from /usr/include/c++/4.8/bits/basic_string.h:42:0,
from /usr/include/c++/4.8/string:52,
from /usr/include/c++/4.8/stdexcept:39,
from
<http://river.suse.de/job/libzypp-bindings-HEAD/ws/build/swig/python/libzypp_python.cc>:3359:
/usr/include/c++/4.8/initializer_list:99:5: note: template<class _Tp> constexpr
const _Tp* std::end(std::initializer_list<_Tp>)
/usr/include/c++/4.8/initializer_list:99:5: note: template argument
deduction/substitution failed:
In file included from /usr/include/zypp/ResObjects.h:16:0,
from
<http://river.suse.de/job/libzypp-bindings-HEAD/ws/build/swig/python/libzypp_python.cc>:3540:
/usr/include/zypp/Patch.h:146:2: note:
'SwigValueWrapper<zypp::base::Flags<zypp::Patch::SeverityFlag> >' is not
derived from 'std::initializer_list<_Tp>'
In file included from /usr/include/c++/4.8/string:51:0,
from /usr/include/c++/4.8/stdexcept:39,
from
<http://river.suse.de/job/libzypp-bindings-HEAD/ws/build/swig/python/libzypp_python.cc>:3359:
/usr/include/c++/4.8/bits/range_access.h:97:5: note: template<class _Tp, long
unsigned int _Nm> _Tp* std::end(_Tp (&)[_Nm])
/usr/include/c++/4.8/bits/range_access.h:97:5: note: template argument
deduction/substitution failed:
In file included from /usr/include/zypp/ResObjects.h:16:0,
from
<http://river.suse.de/job/libzypp-bindings-HEAD/ws/build/swig/python/libzypp_python.cc>:3540:
/usr/include/zypp/Patch.h:146:2: note: mismatched types '_Tp [_Nm]' and
'const SwigValueWrapper<zypp::base::Flags<zypp::Patch::SeverityFlag> >'
In file included from /usr/include/c++/4.8/string:51:0,
from /usr/include/c++/4.8/stdexcept:39,
from
<http://river.suse.de/job/libzypp-bindings-HEAD/ws/build/swig/python/libzypp_python.cc>:3359:
/usr/include/c++/4.8/bits/range_access.h:78:5: note: template<class _Container>
decltype (__cont.end()) std::end(const _Container&)
/usr/include/c++/4.8/bits/range_access.h:78:5: note: template argument
deduction/substitution failed:
/usr/include/c++/4.8/bits/range_access.h: In substitution of 'template<class
_Container> decltype (__cont.end()) std::end(const _Container&) [with
_Container = SwigValueWrapper<zypp::base::Flags<zypp::Patch::SeverityFlag> >]':
/usr/include/zypp/Patch.h:146:2: required from 'bool
zypp::Patch::isSeverity(const _Container&) const [with _Container =
SwigValueWrapper<zypp::base::Flags<zypp::Patch::SeverityFlag> >]'
<http://river.suse.de/job/libzypp-bindings-HEAD/ws/build/swig/python/libzypp_python.cc>:65715:46:
required from here
/usr/include/c++/4.8/bits/range_access.h:78:5: error: 'const class
SwigValueWrapper<zypp::base::Flags<zypp::Patch::SeverityFlag> >' has no member
named 'end'
/usr/include/zypp/Patch.h: In instantiation of 'bool
zypp::Patch::isSeverity(const _Container&) const [with _Container =
SwigValueWrapper<zypp::base::Flags<zypp::Patch::SeverityFlag> >]':
<http://river.suse.de/job/libzypp-bindings-HEAD/ws/build/swig/python/libzypp_python.cc>:65715:46:
required from here
/usr/include/c++/4.8/bits/range_access.h:68:5: note: template<class _Container>
decltype (__cont.end()) std::end(_Container&)
/usr/include/c++/4.8/bits/range_access.h:68:5: note: template argument
deduction/substitution failed:
/usr/include/c++/4.8/bits/range_access.h: In substitution of 'template<class
_Container> decltype (__cont.end()) std::end(_Container&) [with _Container =
const SwigValueWrapper<zypp::base::Flags<zypp::Patch::SeverityFlag> >]':
/usr/include/zypp/Patch.h:146:2: required from 'bool
zypp::Patch::isSeverity(const _Container&) const [with _Container =
SwigValueWrapper<zypp::base::Flags<zypp::Patch::SeverityFlag> >]'
<http://river.suse.de/job/libzypp-bindings-HEAD/ws/build/swig/python/libzypp_python.cc>:65715:46:
required from here
/usr/include/c++/4.8/bits/range_access.h:68:5: error: 'const class
SwigValueWrapper<zypp::base::Flags<zypp::Patch::SeverityFlag> >' has no member
named 'end'
<http://river.suse.de/job/libzypp-bindings-HEAD/ws/build/swig/python/libzypp_python.cc>:
At global scope:
<http://river.suse.de/job/libzypp-bindings-HEAD/ws/build/swig/python/libzypp_python.cc>:6778:18:
warning: 'PyObject* action_abort()' defined but not used [-Wunused-function]
<http://river.suse.de/job/libzypp-bindings-HEAD/ws/build/swig/python/libzypp_python.cc>:6791:18:
warning: 'PyObject* action_retry()' defined but not used [-Wunused-function]
<http://river.suse.de/job/libzypp-bindings-HEAD/ws/build/swig/python/libzypp_python.cc>:6804:18:
warning: 'PyObject* action_ignore()' defined but not used [-Wunused-function]
ICECC[30315] 17:24:51: Compiled on 10.161.8.235
swig/python/CMakeFiles/zypp_python.dir/build.make:63: recipe for target
'swig/python/CMakeFiles/zypp_python.dir/libzypp_python.cc.o' failed
make[2]: *** [swig/python/CMakeFiles/zypp_python.dir/libzypp_python.cc.o] Error
1
CMakeFiles/Makefile2:258: recipe for target
'swig/python/CMakeFiles/zypp_python.dir/all' failed
make[1]: *** [swig/python/CMakeFiles/zypp_python.dir/all] Error 2
Makefile:146: recipe for target 'all' failed
make: *** [all] Error 2
Build step 'Execute shell' marked build as failure
Archiving artifacts

< Previous Next >
List Navigation
Follow Ups
References