Mailinglist Archive: zypp-commit (44 mails)

< Previous Next >
[zypp-commit] Build failed in Jenkins: libzypp-bindings-SLE12SP1 #7
  • From: hudson@xxxxxxx
  • Date: Fri, 26 Jun 2015 09:08:15 +0200 (CEST)
  • Message-id: <1523943346.146.1435302495121.JavaMail.jenkins@river>
See <http://river.suse.de/job/libzypp-bindings-SLE12SP1/7/>

------------------------------------------
[...truncated 511 lines...]
zypp::pool::GetResolvablesToInsDel *arg1 =
(zypp::pool::GetResolvablesToInsDel *) 0 ;

^
<http://river.suse.de/job/libzypp-bindings-SLE12SP1/ws/build/swig/perl5/libzypp_perl.cc>:119048:65:
warning: ‘GetResolvablesToInsDel’ is deprecated (declared at
<http://river.suse.de/job/libzypp-bindings-SLE12SP1/ws/checkout/swig/legacy/GetResolvablesToInsDel.h>:41)
[-Wdeprecated-declarations]
arg1 = reinterpret_cast< zypp::pool::GetResolvablesToInsDel * >(argp1);
^
<http://river.suse.de/job/libzypp-bindings-SLE12SP1/ws/build/swig/perl5/libzypp_perl.cc>:
In function ‘void
_wrap_GetResolvablesToInsDel__toSrcinstall_get(PerlInterpreter*, CV*)’:
<http://river.suse.de/job/libzypp-bindings-SLE12SP1/ws/build/swig/perl5/libzypp_perl.cc>:119069:41:
warning: ‘GetResolvablesToInsDel’ is deprecated (declared at
<http://river.suse.de/job/libzypp-bindings-SLE12SP1/ws/checkout/swig/legacy/GetResolvablesToInsDel.h>:41)
[-Wdeprecated-declarations]
zypp::pool::GetResolvablesToInsDel *arg1 =
(zypp::pool::GetResolvablesToInsDel *) 0 ;
^
<http://river.suse.de/job/libzypp-bindings-SLE12SP1/ws/build/swig/perl5/libzypp_perl.cc>:119069:84:
warning: ‘GetResolvablesToInsDel’ is deprecated (declared at
<http://river.suse.de/job/libzypp-bindings-SLE12SP1/ws/checkout/swig/legacy/GetResolvablesToInsDel.h>:41)
[-Wdeprecated-declarations]
zypp::pool::GetResolvablesToInsDel *arg1 =
(zypp::pool::GetResolvablesToInsDel *) 0 ;

^
<http://river.suse.de/job/libzypp-bindings-SLE12SP1/ws/build/swig/perl5/libzypp_perl.cc>:119083:65:
warning: ‘GetResolvablesToInsDel’ is deprecated (declared at
<http://river.suse.de/job/libzypp-bindings-SLE12SP1/ws/checkout/swig/legacy/GetResolvablesToInsDel.h>:41)
[-Wdeprecated-declarations]
arg1 = reinterpret_cast< zypp::pool::GetResolvablesToInsDel * >(argp1);
^
<http://river.suse.de/job/libzypp-bindings-SLE12SP1/ws/build/swig/perl5/libzypp_perl.cc>:
In function ‘void _wrap_delete_GetResolvablesToInsDel(PerlInterpreter*, CV*)’:
<http://river.suse.de/job/libzypp-bindings-SLE12SP1/ws/build/swig/perl5/libzypp_perl.cc>:119097:41:
warning: ‘GetResolvablesToInsDel’ is deprecated (declared at
<http://river.suse.de/job/libzypp-bindings-SLE12SP1/ws/checkout/swig/legacy/GetResolvablesToInsDel.h>:41)
[-Wdeprecated-declarations]
zypp::pool::GetResolvablesToInsDel *arg1 =
(zypp::pool::GetResolvablesToInsDel *) 0 ;
^
<http://river.suse.de/job/libzypp-bindings-SLE12SP1/ws/build/swig/perl5/libzypp_perl.cc>:119097:84:
warning: ‘GetResolvablesToInsDel’ is deprecated (declared at
<http://river.suse.de/job/libzypp-bindings-SLE12SP1/ws/checkout/swig/legacy/GetResolvablesToInsDel.h>:41)
[-Wdeprecated-declarations]
zypp::pool::GetResolvablesToInsDel *arg1 =
(zypp::pool::GetResolvablesToInsDel *) 0 ;

^
<http://river.suse.de/job/libzypp-bindings-SLE12SP1/ws/build/swig/perl5/libzypp_perl.cc>:119110:65:
warning: ‘GetResolvablesToInsDel’ is deprecated (declared at
<http://river.suse.de/job/libzypp-bindings-SLE12SP1/ws/checkout/swig/legacy/GetResolvablesToInsDel.h>:41)
[-Wdeprecated-declarations]
arg1 = reinterpret_cast< zypp::pool::GetResolvablesToInsDel * >(argp1);
^
In file included from /usr/include/zypp/ResObjects.h:16:0,
from
<http://river.suse.de/job/libzypp-bindings-SLE12SP1/ws/build/swig/perl5/libzypp_perl.cc>:2046:
/usr/include/zypp/Patch.h: In instantiation of ‘bool
zypp::Patch::isCategory(const _Container&) const [with _Container =
SwigValueWrapper<zypp::base::Flags<zypp::Patch::Category> >]’:
<http://river.suse.de/job/libzypp-bindings-SLE12SP1/ws/build/swig/perl5/libzypp_perl.cc>:55899:44:
required from here
/usr/include/zypp/Patch.h:113:2: error: no matching function for call to
‘begin(const SwigValueWrapper<zypp::base::Flags<zypp::Patch::Category> >&)’
for ( const std::string & el : categories_r )
^
/usr/include/zypp/Patch.h:113:2: note: candidates are:
In file included from /usr/include/c++/4.8/bits/basic_string.h:42:0,
from /usr/include/c++/4.8/string:52,
from /usr/include/c++/4.8/stdexcept:39,
from
<http://river.suse.de/job/libzypp-bindings-SLE12SP1/ws/build/swig/perl5/libzypp_perl.cc>:1902:
/usr/include/c++/4.8/initializer_list:89:5: note: template<class _Tp> constexpr
const _Tp* std::begin(std::initializer_list<_Tp>)
begin(initializer_list<_Tp> __ils) noexcept
^
/usr/include/c++/4.8/initializer_list:89:5: note: template argument
deduction/substitution failed:
In file included from /usr/include/zypp/ResObjects.h:16:0,
from
<http://river.suse.de/job/libzypp-bindings-SLE12SP1/ws/build/swig/perl5/libzypp_perl.cc>:2046:
/usr/include/zypp/Patch.h:113:2: note:
‘SwigValueWrapper<zypp::base::Flags<zypp::Patch::Category> >’ is not derived
from ‘std::initializer_list<_Tp>’
for ( const std::string & el : categories_r )
^
In file included from /usr/include/c++/4.8/string:51:0,
from /usr/include/c++/4.8/stdexcept:39,
from
<http://river.suse.de/job/libzypp-bindings-SLE12SP1/ws/build/swig/perl5/libzypp_perl.cc>:1902:
/usr/include/c++/4.8/bits/range_access.h:87:5: note: template<class _Tp, long
unsigned int _Nm> _Tp* std::begin(_Tp (&)[_Nm])
begin(_Tp (&__arr)[_Nm])
^
/usr/include/c++/4.8/bits/range_access.h:87:5: note: template argument
deduction/substitution failed:
In file included from /usr/include/zypp/ResObjects.h:16:0,
from
<http://river.suse.de/job/libzypp-bindings-SLE12SP1/ws/build/swig/perl5/libzypp_perl.cc>:2046:
/usr/include/zypp/Patch.h:113:2: note: mismatched types ‘_Tp [_Nm]’ and
‘const SwigValueWrapper<zypp::base::Flags<zypp::Patch::Category> >’
for ( const std::string & el : categories_r )
^
In file included from /usr/include/c++/4.8/string:51:0,
from /usr/include/c++/4.8/stdexcept:39,
from
<http://river.suse.de/job/libzypp-bindings-SLE12SP1/ws/build/swig/perl5/libzypp_perl.cc>:1902:
/usr/include/c++/4.8/bits/range_access.h:58:5: note: template<class _Container>
decltype (__cont.begin()) std::begin(const _Container&)
begin(const _Container& __cont) -> decltype(__cont.begin())
^
/usr/include/c++/4.8/bits/range_access.h:58:5: note: template argument
deduction/substitution failed:
/usr/include/c++/4.8/bits/range_access.h: In substitution of ‘template<class
_Container> decltype (__cont.begin()) std::begin(const _Container&) [with
_Container = SwigValueWrapper<zypp::base::Flags<zypp::Patch::Category> >]’:
/usr/include/zypp/Patch.h:113:2: required from ‘bool
zypp::Patch::isCategory(const _Container&) const [with _Container =
SwigValueWrapper<zypp::base::Flags<zypp::Patch::Category> >]’
<http://river.suse.de/job/libzypp-bindings-SLE12SP1/ws/build/swig/perl5/libzypp_perl.cc>:55899:44:
required from here
/usr/include/c++/4.8/bits/range_access.h:58:5: error: ‘const class
SwigValueWrapper<zypp::base::Flags<zypp::Patch::Category> >’ has no member
named ‘begin’
/usr/include/zypp/Patch.h: In instantiation of ‘bool
zypp::Patch::isCategory(const _Container&) const [with _Container =
SwigValueWrapper<zypp::base::Flags<zypp::Patch::Category> >]’:
<http://river.suse.de/job/libzypp-bindings-SLE12SP1/ws/build/swig/perl5/libzypp_perl.cc>:55899:44:
required from here
/usr/include/c++/4.8/bits/range_access.h:48:5: note: template<class _Container>
decltype (__cont.begin()) std::begin(_Container&)
begin(_Container& __cont) -> decltype(__cont.begin())
^
/usr/include/c++/4.8/bits/range_access.h:48:5: note: template argument
deduction/substitution failed:
/usr/include/c++/4.8/bits/range_access.h: In substitution of ‘template<class
_Container> decltype (__cont.begin()) std::begin(_Container&) [with _Container
= const SwigValueWrapper<zypp::base::Flags<zypp::Patch::Category> >]’:
/usr/include/zypp/Patch.h:113:2: required from ‘bool
zypp::Patch::isCategory(const _Container&) const [with _Container =
SwigValueWrapper<zypp::base::Flags<zypp::Patch::Category> >]’
<http://river.suse.de/job/libzypp-bindings-SLE12SP1/ws/build/swig/perl5/libzypp_perl.cc>:55899:44:
required from here
/usr/include/c++/4.8/bits/range_access.h:48:5: error: ‘const class
SwigValueWrapper<zypp::base::Flags<zypp::Patch::Category> >’ has no member
named ‘begin’
In file included from /usr/include/zypp/ResObjects.h:16:0,
from
<http://river.suse.de/job/libzypp-bindings-SLE12SP1/ws/build/swig/perl5/libzypp_perl.cc>:2046:
/usr/include/zypp/Patch.h: In instantiation of ‘bool
zypp::Patch::isCategory(const _Container&) const [with _Container =
SwigValueWrapper<zypp::base::Flags<zypp::Patch::Category> >]’:
<http://river.suse.de/job/libzypp-bindings-SLE12SP1/ws/build/swig/perl5/libzypp_perl.cc>:55899:44:
required from here
/usr/include/zypp/Patch.h:113:2: error: no matching function for call to
‘end(const SwigValueWrapper<zypp::base::Flags<zypp::Patch::Category> >&)’
for ( const std::string & el : categories_r )
^
/usr/include/zypp/Patch.h:113:2: note: candidates are:
In file included from /usr/include/c++/4.8/bits/basic_string.h:42:0,
from /usr/include/c++/4.8/string:52,
from /usr/include/c++/4.8/stdexcept:39,
from
<http://river.suse.de/job/libzypp-bindings-SLE12SP1/ws/build/swig/perl5/libzypp_perl.cc>:1902:
/usr/include/c++/4.8/initializer_list:99:5: note: template<class _Tp> constexpr
const _Tp* std::end(std::initializer_list<_Tp>)
end(initializer_list<_Tp> __ils) noexcept
^
/usr/include/c++/4.8/initializer_list:99:5: note: template argument
deduction/substitution failed:
In file included from /usr/include/zypp/ResObjects.h:16:0,
from
<http://river.suse.de/job/libzypp-bindings-SLE12SP1/ws/build/swig/perl5/libzypp_perl.cc>:2046:
/usr/include/zypp/Patch.h:113:2: note:
‘SwigValueWrapper<zypp::base::Flags<zypp::Patch::Category> >’ is not derived
from ‘std::initializer_list<_Tp>’
for ( const std::string & el : categories_r )
^
In file included from /usr/include/c++/4.8/string:51:0,
from /usr/include/c++/4.8/stdexcept:39,
from
<http://river.suse.de/job/libzypp-bindings-SLE12SP1/ws/build/swig/perl5/libzypp_perl.cc>:1902:
/usr/include/c++/4.8/bits/range_access.h:97:5: note: template<class _Tp, long
unsigned int _Nm> _Tp* std::end(_Tp (&)[_Nm])
end(_Tp (&__arr)[_Nm])
^
/usr/include/c++/4.8/bits/range_access.h:97:5: note: template argument
deduction/substitution failed:
In file included from /usr/include/zypp/ResObjects.h:16:0,
from
<http://river.suse.de/job/libzypp-bindings-SLE12SP1/ws/build/swig/perl5/libzypp_perl.cc>:2046:
/usr/include/zypp/Patch.h:113:2: note: mismatched types ‘_Tp [_Nm]’ and
‘const SwigValueWrapper<zypp::base::Flags<zypp::Patch::Category> >’
for ( const std::string & el : categories_r )
^
In file included from /usr/include/c++/4.8/string:51:0,
from /usr/include/c++/4.8/stdexcept:39,
from
<http://river.suse.de/job/libzypp-bindings-SLE12SP1/ws/build/swig/perl5/libzypp_perl.cc>:1902:
/usr/include/c++/4.8/bits/range_access.h:78:5: note: template<class _Container>
decltype (__cont.end()) std::end(const _Container&)
end(const _Container& __cont) -> decltype(__cont.end())
^
/usr/include/c++/4.8/bits/range_access.h:78:5: note: template argument
deduction/substitution failed:
/usr/include/c++/4.8/bits/range_access.h: In substitution of ‘template<class
_Container> decltype (__cont.end()) std::end(const _Container&) [with
_Container = SwigValueWrapper<zypp::base::Flags<zypp::Patch::Category> >]’:
/usr/include/zypp/Patch.h:113:2: required from ‘bool
zypp::Patch::isCategory(const _Container&) const [with _Container =
SwigValueWrapper<zypp::base::Flags<zypp::Patch::Category> >]’
<http://river.suse.de/job/libzypp-bindings-SLE12SP1/ws/build/swig/perl5/libzypp_perl.cc>:55899:44:
required from here
/usr/include/c++/4.8/bits/range_access.h:78:5: error: ‘const class
SwigValueWrapper<zypp::base::Flags<zypp::Patch::Category> >’ has no member
named ‘end’
/usr/include/zypp/Patch.h: In instantiation of ‘bool
zypp::Patch::isCategory(const _Container&) const [with _Container =
SwigValueWrapper<zypp::base::Flags<zypp::Patch::Category> >]’:
<http://river.suse.de/job/libzypp-bindings-SLE12SP1/ws/build/swig/perl5/libzypp_perl.cc>:55899:44:
required from here
/usr/include/c++/4.8/bits/range_access.h:68:5: note: template<class _Container>
decltype (__cont.end()) std::end(_Container&)
end(_Container& __cont) -> decltype(__cont.end())
^
/usr/include/c++/4.8/bits/range_access.h:68:5: note: template argument
deduction/substitution failed:
/usr/include/c++/4.8/bits/range_access.h: In substitution of ‘template<class
_Container> decltype (__cont.end()) std::end(_Container&) [with _Container =
const SwigValueWrapper<zypp::base::Flags<zypp::Patch::Category> >]’:
/usr/include/zypp/Patch.h:113:2: required from ‘bool
zypp::Patch::isCategory(const _Container&) const [with _Container =
SwigValueWrapper<zypp::base::Flags<zypp::Patch::Category> >]’
<http://river.suse.de/job/libzypp-bindings-SLE12SP1/ws/build/swig/perl5/libzypp_perl.cc>:55899:44:
required from here
/usr/include/c++/4.8/bits/range_access.h:68:5: error: ‘const class
SwigValueWrapper<zypp::base::Flags<zypp::Patch::Category> >’ has no member
named ‘end’
In file included from /usr/include/zypp/ResObjects.h:16:0,
from
<http://river.suse.de/job/libzypp-bindings-SLE12SP1/ws/build/swig/perl5/libzypp_perl.cc>:2046:
/usr/include/zypp/Patch.h: In instantiation of ‘bool
zypp::Patch::isSeverity(const _Container&) const [with _Container =
SwigValueWrapper<zypp::base::Flags<zypp::Patch::SeverityFlag> >]’:
<http://river.suse.de/job/libzypp-bindings-SLE12SP1/ws/build/swig/perl5/libzypp_perl.cc>:56119:44:
required from here
/usr/include/zypp/Patch.h:146:2: error: no matching function for call to
‘begin(const SwigValueWrapper<zypp::base::Flags<zypp::Patch::SeverityFlag> >&)’
for ( const std::string & el : severities_r )
^
/usr/include/zypp/Patch.h:146:2: note: candidates are:
In file included from /usr/include/c++/4.8/bits/basic_string.h:42:0,
from /usr/include/c++/4.8/string:52,
from /usr/include/c++/4.8/stdexcept:39,
from
<http://river.suse.de/job/libzypp-bindings-SLE12SP1/ws/build/swig/perl5/libzypp_perl.cc>:1902:
/usr/include/c++/4.8/initializer_list:89:5: note: template<class _Tp> constexpr
const _Tp* std::begin(std::initializer_list<_Tp>)
begin(initializer_list<_Tp> __ils) noexcept
^
/usr/include/c++/4.8/initializer_list:89:5: note: template argument
deduction/substitution failed:
In file included from /usr/include/zypp/ResObjects.h:16:0,
from
<http://river.suse.de/job/libzypp-bindings-SLE12SP1/ws/build/swig/perl5/libzypp_perl.cc>:2046:
/usr/include/zypp/Patch.h:146:2: note:
‘SwigValueWrapper<zypp::base::Flags<zypp::Patch::SeverityFlag> >’ is not
derived from ‘std::initializer_list<_Tp>’
for ( const std::string & el : severities_r )
^
In file included from /usr/include/c++/4.8/string:51:0,
from /usr/include/c++/4.8/stdexcept:39,
from
<http://river.suse.de/job/libzypp-bindings-SLE12SP1/ws/build/swig/perl5/libzypp_perl.cc>:1902:
/usr/include/c++/4.8/bits/range_access.h:87:5: note: template<class _Tp, long
unsigned int _Nm> _Tp* std::begin(_Tp (&)[_Nm])
begin(_Tp (&__arr)[_Nm])
^
/usr/include/c++/4.8/bits/range_access.h:87:5: note: template argument
deduction/substitution failed:
In file included from /usr/include/zypp/ResObjects.h:16:0,
from
<http://river.suse.de/job/libzypp-bindings-SLE12SP1/ws/build/swig/perl5/libzypp_perl.cc>:2046:
/usr/include/zypp/Patch.h:146:2: note: mismatched types ‘_Tp [_Nm]’ and
‘const SwigValueWrapper<zypp::base::Flags<zypp::Patch::SeverityFlag> >’
for ( const std::string & el : severities_r )
^
In file included from /usr/include/c++/4.8/string:51:0,
from /usr/include/c++/4.8/stdexcept:39,
from
<http://river.suse.de/job/libzypp-bindings-SLE12SP1/ws/build/swig/perl5/libzypp_perl.cc>:1902:
/usr/include/c++/4.8/bits/range_access.h:58:5: note: template<class _Container>
decltype (__cont.begin()) std::begin(const _Container&)
begin(const _Container& __cont) -> decltype(__cont.begin())
^
/usr/include/c++/4.8/bits/range_access.h:58:5: note: template argument
deduction/substitution failed:
/usr/include/c++/4.8/bits/range_access.h: In substitution of ‘template<class
_Container> decltype (__cont.begin()) std::begin(const _Container&) [with
_Container = SwigValueWrapper<zypp::base::Flags<zypp::Patch::SeverityFlag> >]’:
/usr/include/zypp/Patch.h:146:2: required from ‘bool
zypp::Patch::isSeverity(const _Container&) const [with _Container =
SwigValueWrapper<zypp::base::Flags<zypp::Patch::SeverityFlag> >]’
<http://river.suse.de/job/libzypp-bindings-SLE12SP1/ws/build/swig/perl5/libzypp_perl.cc>:56119:44:
required from here
/usr/include/c++/4.8/bits/range_access.h:58:5: error: ‘const class
SwigValueWrapper<zypp::base::Flags<zypp::Patch::SeverityFlag> >’ has no member
named ‘begin’
/usr/include/zypp/Patch.h: In instantiation of ‘bool
zypp::Patch::isSeverity(const _Container&) const [with _Container =
SwigValueWrapper<zypp::base::Flags<zypp::Patch::SeverityFlag> >]’:
<http://river.suse.de/job/libzypp-bindings-SLE12SP1/ws/build/swig/perl5/libzypp_perl.cc>:56119:44:
required from here
/usr/include/c++/4.8/bits/range_access.h:48:5: note: template<class _Container>
decltype (__cont.begin()) std::begin(_Container&)
begin(_Container& __cont) -> decltype(__cont.begin())
^
/usr/include/c++/4.8/bits/range_access.h:48:5: note: template argument
deduction/substitution failed:
/usr/include/c++/4.8/bits/range_access.h: In substitution of ‘template<class
_Container> decltype (__cont.begin()) std::begin(_Container&) [with _Container
= const SwigValueWrapper<zypp::base::Flags<zypp::Patch::SeverityFlag> >]’:
/usr/include/zypp/Patch.h:146:2: required from ‘bool
zypp::Patch::isSeverity(const _Container&) const [with _Container =
SwigValueWrapper<zypp::base::Flags<zypp::Patch::SeverityFlag> >]’
<http://river.suse.de/job/libzypp-bindings-SLE12SP1/ws/build/swig/perl5/libzypp_perl.cc>:56119:44:
required from here
/usr/include/c++/4.8/bits/range_access.h:48:5: error: ‘const class
SwigValueWrapper<zypp::base::Flags<zypp::Patch::SeverityFlag> >’ has no member
named ‘begin’
In file included from /usr/include/zypp/ResObjects.h:16:0,
from
<http://river.suse.de/job/libzypp-bindings-SLE12SP1/ws/build/swig/perl5/libzypp_perl.cc>:2046:
/usr/include/zypp/Patch.h: In instantiation of ‘bool
zypp::Patch::isSeverity(const _Container&) const [with _Container =
SwigValueWrapper<zypp::base::Flags<zypp::Patch::SeverityFlag> >]’:
<http://river.suse.de/job/libzypp-bindings-SLE12SP1/ws/build/swig/perl5/libzypp_perl.cc>:56119:44:
required from here
/usr/include/zypp/Patch.h:146:2: error: no matching function for call to
‘end(const SwigValueWrapper<zypp::base::Flags<zypp::Patch::SeverityFlag> >&)’
for ( const std::string & el : severities_r )
^
/usr/include/zypp/Patch.h:146:2: note: candidates are:
In file included from /usr/include/c++/4.8/bits/basic_string.h:42:0,
from /usr/include/c++/4.8/string:52,
from /usr/include/c++/4.8/stdexcept:39,
from
<http://river.suse.de/job/libzypp-bindings-SLE12SP1/ws/build/swig/perl5/libzypp_perl.cc>:1902:
/usr/include/c++/4.8/initializer_list:99:5: note: template<class _Tp> constexpr
const _Tp* std::end(std::initializer_list<_Tp>)
end(initializer_list<_Tp> __ils) noexcept
^
/usr/include/c++/4.8/initializer_list:99:5: note: template argument
deduction/substitution failed:
In file included from /usr/include/zypp/ResObjects.h:16:0,
from
<http://river.suse.de/job/libzypp-bindings-SLE12SP1/ws/build/swig/perl5/libzypp_perl.cc>:2046:
/usr/include/zypp/Patch.h:146:2: note:
‘SwigValueWrapper<zypp::base::Flags<zypp::Patch::SeverityFlag> >’ is not
derived from ‘std::initializer_list<_Tp>’
for ( const std::string & el : severities_r )
^
In file included from /usr/include/c++/4.8/string:51:0,
from /usr/include/c++/4.8/stdexcept:39,
from
<http://river.suse.de/job/libzypp-bindings-SLE12SP1/ws/build/swig/perl5/libzypp_perl.cc>:1902:
/usr/include/c++/4.8/bits/range_access.h:97:5: note: template<class _Tp, long
unsigned int _Nm> _Tp* std::end(_Tp (&)[_Nm])
end(_Tp (&__arr)[_Nm])
^
/usr/include/c++/4.8/bits/range_access.h:97:5: note: template argument
deduction/substitution failed:
In file included from /usr/include/zypp/ResObjects.h:16:0,
from
<http://river.suse.de/job/libzypp-bindings-SLE12SP1/ws/build/swig/perl5/libzypp_perl.cc>:2046:
/usr/include/zypp/Patch.h:146:2: note: mismatched types ‘_Tp [_Nm]’ and
‘const SwigValueWrapper<zypp::base::Flags<zypp::Patch::SeverityFlag> >’
for ( const std::string & el : severities_r )
^
In file included from /usr/include/c++/4.8/string:51:0,
from /usr/include/c++/4.8/stdexcept:39,
from
<http://river.suse.de/job/libzypp-bindings-SLE12SP1/ws/build/swig/perl5/libzypp_perl.cc>:1902:
/usr/include/c++/4.8/bits/range_access.h:78:5: note: template<class _Container>
decltype (__cont.end()) std::end(const _Container&)
end(const _Container& __cont) -> decltype(__cont.end())
^
/usr/include/c++/4.8/bits/range_access.h:78:5: note: template argument
deduction/substitution failed:
/usr/include/c++/4.8/bits/range_access.h: In substitution of ‘template<class
_Container> decltype (__cont.end()) std::end(const _Container&) [with
_Container = SwigValueWrapper<zypp::base::Flags<zypp::Patch::SeverityFlag> >]’:
/usr/include/zypp/Patch.h:146:2: required from ‘bool
zypp::Patch::isSeverity(const _Container&) const [with _Container =
SwigValueWrapper<zypp::base::Flags<zypp::Patch::SeverityFlag> >]’
<http://river.suse.de/job/libzypp-bindings-SLE12SP1/ws/build/swig/perl5/libzypp_perl.cc>:56119:44:
required from here
/usr/include/c++/4.8/bits/range_access.h:78:5: error: ‘const class
SwigValueWrapper<zypp::base::Flags<zypp::Patch::SeverityFlag> >’ has no member
named ‘end’
/usr/include/zypp/Patch.h: In instantiation of ‘bool
zypp::Patch::isSeverity(const _Container&) const [with _Container =
SwigValueWrapper<zypp::base::Flags<zypp::Patch::SeverityFlag> >]’:
<http://river.suse.de/job/libzypp-bindings-SLE12SP1/ws/build/swig/perl5/libzypp_perl.cc>:56119:44:
required from here
/usr/include/c++/4.8/bits/range_access.h:68:5: note: template<class _Container>
decltype (__cont.end()) std::end(_Container&)
end(_Container& __cont) -> decltype(__cont.end())
^
/usr/include/c++/4.8/bits/range_access.h:68:5: note: template argument
deduction/substitution failed:
/usr/include/c++/4.8/bits/range_access.h: In substitution of ‘template<class
_Container> decltype (__cont.end()) std::end(_Container&) [with _Container =
const SwigValueWrapper<zypp::base::Flags<zypp::Patch::SeverityFlag> >]’:
/usr/include/zypp/Patch.h:146:2: required from ‘bool
zypp::Patch::isSeverity(const _Container&) const [with _Container =
SwigValueWrapper<zypp::base::Flags<zypp::Patch::SeverityFlag> >]’
<http://river.suse.de/job/libzypp-bindings-SLE12SP1/ws/build/swig/perl5/libzypp_perl.cc>:56119:44:
required from here
/usr/include/c++/4.8/bits/range_access.h:68:5: error: ‘const class
SwigValueWrapper<zypp::base::Flags<zypp::Patch::SeverityFlag> >’ has no member
named ‘end’
swig/perl5/CMakeFiles/zypp_perl.dir/build.make:66: recipe for target
'swig/perl5/CMakeFiles/zypp_perl.dir/libzypp_perl.cc.o' failed
make[2]: *** [swig/perl5/CMakeFiles/zypp_perl.dir/libzypp_perl.cc.o] Error 1
CMakeFiles/Makefile2:188: recipe for target
'swig/perl5/CMakeFiles/zypp_perl.dir/all' failed
make[1]: *** [swig/perl5/CMakeFiles/zypp_perl.dir/all] Error 2
Makefile:146: recipe for target 'all' failed
make: *** [all] Error 2
Build step 'Execute shell' marked build as failure
Archiving artifacts

< Previous Next >
Follow Ups