Mailinglist Archive: zypp-commit (44 mails)

< Previous Next >
[zypp-commit] Build failed in Jenkins: libsolv-SLE12SP1 #2
  • From: hudson@xxxxxxx
  • Date: Mon, 22 Jun 2015 16:05:11 +0200 (CEST)
  • Message-id: <340620072.1216.1434981911478.JavaMail.jenkins@river>
See <http://river.suse.de/job/libsolv-SLE12SP1/2/>

------------------------------------------
Started by an SCM change
Started by an SCM change
Started by an SCM change
Started by an SCM change
Started by an SCM change
Started by an SCM change
Started by an SCM change
Started by an SCM change
Started by an SCM change
Started by an SCM change
Started by an SCM change
Started by an SCM change
Started by an SCM change
Started by an SCM change
Started by an SCM change
Started by an SCM change
Started by an SCM change
Started by an SCM change
Started by an SCM change
Building remotely on node-zypp-SLE12SP1 in workspace
<http://river.suse.de/job/libsolv-SLE12SP1/ws/>
Checkout:libsolv-SLE12SP1 / <http://river.suse.de/job/libsolv-SLE12SP1/ws/> -
hudson.remoting.Channel@644b4621:node-zypp-SLE12SP1
Using strategy: Default
Last Built Revision: Revision c5dc5c985e1ba243b0934f6f239a57357e9890f3
(origin/master)
Checkout:checkout / <http://river.suse.de/job/libsolv-SLE12SP1/ws/checkout> -
hudson.remoting.LocalChannel@7dfde44e
Cloning the remote Git repository
Cloning repository origin
Fetching upstream changes from git://github.com/openSUSE/libsolv.git
Cleaning workspace
Commencing build of Revision c5dc5c985e1ba243b0934f6f239a57357e9890f3
(origin/master)
Checking out Revision c5dc5c985e1ba243b0934f6f239a57357e9890f3 (origin/master)
Cleaning workspace
FATAL: Could not apply tag jenkins-libsolv-SLE12SP1-2
hudson.plugins.git.GitException: Could not apply tag jenkins-libsolv-SLE12SP1-2
at hudson.plugins.git.GitAPI.tag(GitAPI.java:696)
at hudson.plugins.git.GitSCM$4.invoke(GitSCM.java:1172)
at hudson.plugins.git.GitSCM$4.invoke(GitSCM.java:1120)
at hudson.FilePath$FileCallableWrapper.call(FilePath.java:2154)
at hudson.remoting.UserRequest.perform(UserRequest.java:118)
at hudson.remoting.UserRequest.perform(UserRequest.java:48)
at hudson.remoting.Request$2.run(Request.java:287)
at
hudson.remoting.InterceptingExecutorService$1.call(InterceptingExecutorService.java:72)
at java.util.concurrent.FutureTask$Sync.innerRun(FutureTask.java:303)
at java.util.concurrent.FutureTask.run(FutureTask.java:138)
at
java.util.concurrent.ThreadPoolExecutor$Worker.runTask(ThreadPoolExecutor.java:886)
at
java.util.concurrent.ThreadPoolExecutor$Worker.run(ThreadPoolExecutor.java:908)
at java.lang.Thread.run(Thread.java:619)
Caused by: hudson.plugins.git.GitException: Error performing command: git tag
-a -f -m Jenkins Build #2 jenkins-libsolv-SLE12SP1-2
Command "git tag -a -f -m Jenkins Build #2 jenkins-libsolv-SLE12SP1-2" returned
status code 128:
*** Please tell me who you are.

Run

git config --global user.email "you@xxxxxxxxxxx"
git config --global user.name "Your Name"

to set your account's default identity.
Omit --global to set the identity only in this repository.

fatal: unable to auto-detect email address (got
'root@zypp-jenkins-s12sp1.(none)')

at hudson.plugins.git.GitAPI.launchCommandIn(GitAPI.java:742)
at hudson.plugins.git.GitAPI.launchCommand(GitAPI.java:707)
at hudson.plugins.git.GitAPI.launchCommand(GitAPI.java:717)
at hudson.plugins.git.GitAPI.tag(GitAPI.java:694)
... 12 more
Caused by: hudson.plugins.git.GitException: Command "git tag -a -f -m Jenkins
Build #2 jenkins-libsolv-SLE12SP1-2" returned status code 128:
*** Please tell me who you are.

Run

git config --global user.email "you@xxxxxxxxxxx"
git config --global user.name "Your Name"

to set your account's default identity.
Omit --global to set the identity only in this repository.

fatal: unable to auto-detect email address (got
'root@zypp-jenkins-s12sp1.(none)')

at hudson.plugins.git.GitAPI.launchCommandIn(GitAPI.java:737)
... 15 more

< Previous Next >
This Thread
Follow Ups