Mailinglist Archive: zypp-commit (14 mails)

< Previous Next >
[zypp-commit] Build failed in Jenkins: libzypp-bindings-HEAD #1391
  • From: hudson@xxxxxxx
  • Date: Tue, 24 Feb 2015 14:40:03 +0100 (CET)
  • Message-id: <1604257291.1934.1424785203243.JavaMail.jenkins@river>
See <http://river.suse.de/job/libzypp-bindings-HEAD/1391/>

------------------------------------------
[...truncated 640 lines...]
/usr/include/zypp/PoolItem.h:52: Warning 503: Can't wrap 'operator <<' unless
renamed to a valid identifier.
/usr/include/zypp/PoolItem.h:132: Warning 503: Can't wrap 'operator
ResObject::constPtr' unless renamed to a valid identifier.
/usr/include/zypp/Resolver.h:383: Warning 503: Can't wrap 'operator <<' unless
renamed to a valid identifier.
Scanning dependencies of target zypp_ruby
/usr/include/zypp/ResPool.h:50: Warning 503: Can't wrap 'operator <<' unless
renamed to a valid identifier.
[ 66%] Building CXX object swig/ruby/CMakeFiles/zypp_ruby.dir/libzypp_ruby.cc.o
/usr/include/zypp/repo/DeltaCandidates.h:38: Warning 503: Can't wrap 'operator
<<' unless renamed to a valid identifier.
/usr/include/zypp/ZYppFactory.h:45: Warning 503: Can't wrap 'operator <<'
unless renamed to a valid identifier.
Done.
/usr/include/zypp/TmpPath.h:75: Warning 503: Can't wrap 'operator Pathname'
unless renamed to a valid identifier.
/usr/include/zypp/ResolverProblem.h:58: Warning 503: Can't wrap 'operator <<'
unless renamed to a valid identifier.
/usr/include/zypp/ProblemSolution.h:74: Warning 503: Can't wrap 'operator <<'
unless renamed to a valid identifier.
/usr/include/zypp/ProblemSolution.h:75: Warning 503: Can't wrap 'operator <<'
unless renamed to a valid identifier.
/usr/include/zypp/ProblemSolution.h:76: Warning 503: Can't wrap 'operator <<'
unless renamed to a valid identifier.
/usr/include/zypp/Resolver.h:383: Warning 503: Can't wrap 'operator <<' unless
renamed to a valid identifier.
Scanning dependencies of target zypp_perl
[ 83%] Building CXX object swig/perl5/CMakeFiles/zypp_perl.dir/libzypp_perl.cc.o
In file included from
/usr/lib/perl5/5.18.0/x86_64-linux-thread-multi/CORE/perl.h:3476:0,
from
<http://river.suse.de/job/libzypp-bindings-HEAD/ws/build/swig/perl5/libzypp_perl.cc>:744:
/usr/lib/perl5/5.18.0/x86_64-linux-thread-multi/CORE/pad.h:146:19: warning:
invalid suffix on literal; C++11 requires a space between literal and
identifier [-Wliteral-suffix]
Perl_croak(aTHX_ "panic: illegal pad in %s: 0x%"UVxf"[0x%"UVxf"]",\
^
/usr/lib/perl5/5.18.0/x86_64-linux-thread-multi/CORE/pad.h:146:54: warning:
invalid suffix on literal; C++11 requires a space between literal and
identifier [-Wliteral-suffix]
Perl_croak(aTHX_ "panic: illegal pad in %s: 0x%"UVxf"[0x%"UVxf"]",\
^
/usr/lib/perl5/5.18.0/x86_64-linux-thread-multi/CORE/pad.h:153:19: warning:
invalid suffix on literal; C++11 requires a space between literal and
identifier [-Wliteral-suffix]
Perl_croak(aTHX_ "panic: invalid pad in %s: 0x%"UVxf"[0x%"UVxf"]",\
^
/usr/lib/perl5/5.18.0/x86_64-linux-thread-multi/CORE/pad.h:153:54: warning:
invalid suffix on literal; C++11 requires a space between literal and
identifier [-Wliteral-suffix]
Perl_croak(aTHX_ "panic: invalid pad in %s: 0x%"UVxf"[0x%"UVxf"]",\
^
/usr/lib/perl5/5.18.0/x86_64-linux-thread-multi/CORE/pad.h:323:8: warning:
invalid suffix on literal; C++11 requires a space between literal and
identifier [-Wliteral-suffix]
"Pad 0x%"UVxf"[0x%"UVxf"] set_cur depth=%d\n", \
^
/usr/lib/perl5/5.18.0/x86_64-linux-thread-multi/CORE/pad.h:323:21: warning:
invalid suffix on literal; C++11 requires a space between literal and
identifier [-Wliteral-suffix]
"Pad 0x%"UVxf"[0x%"UVxf"] set_cur depth=%d\n", \
^
/usr/lib/perl5/5.18.0/x86_64-linux-thread-multi/CORE/pad.h:341:8: warning:
invalid suffix on literal; C++11 requires a space between literal and
identifier [-Wliteral-suffix]
"Pad 0x%"UVxf"[0x%"UVxf"] save_local\n", \
^
/usr/lib/perl5/5.18.0/x86_64-linux-thread-multi/CORE/pad.h:341:21: warning:
invalid suffix on literal; C++11 requires a space between literal and
identifier [-Wliteral-suffix]
"Pad 0x%"UVxf"[0x%"UVxf"] save_local\n", \
^
/usr/lib/perl5/5.18.0/x86_64-linux-thread-multi/CORE/pad.h:349:8: warning:
invalid suffix on literal; C++11 requires a space between literal and
identifier [-Wliteral-suffix]
"Pad 0x%"UVxf"[0x%"UVxf"] restore_local\n", \
^
/usr/lib/perl5/5.18.0/x86_64-linux-thread-multi/CORE/pad.h:349:21: warning:
invalid suffix on literal; C++11 requires a space between literal and
identifier [-Wliteral-suffix]
"Pad 0x%"UVxf"[0x%"UVxf"] restore_local\n", \
^
In file included from
<http://river.suse.de/job/libzypp-bindings-HEAD/ws/build/swig/perl5/libzypp_perl.cc>:744:0:
/usr/lib/perl5/5.18.0/x86_64-linux-thread-multi/CORE/perl.h:4257:8: warning:
invalid suffix on literal; C++11 requires a space between literal and
identifier [-Wliteral-suffix]
INIT("Use of uninitialized value%"SVf"%s%s");
^
/usr/lib/perl5/5.18.0/x86_64-linux-thread-multi/CORE/perl.h:4277:8: warning:
invalid suffix on literal; C++11 requires a space between literal and
identifier [-Wliteral-suffix]
INIT("Modification of non-creatable hash value attempted, subscript
\"%"SVf"\"");
^
/usr/include/zypp/repo/DeltaCandidates.h:38: Warning 503: Can't wrap 'operator
<<' unless renamed to a valid identifier.
/usr/include/zypp/ZYppFactory.h:45: Warning 503: Can't wrap 'operator <<'
unless renamed to a valid identifier.
Processing types...
C++ analysis...
Processing nested classes...
Generating wrappers...
Done.
Scanning dependencies of target zypp_python
[100%] Building CXX object
swig/python/CMakeFiles/zypp_python.dir/libzypp_python.cc.o
In file included from
<http://river.suse.de/job/libzypp-bindings-HEAD/ws/build/swig/ruby/libzypp_ruby.cc>:2314:0:
<http://river.suse.de/job/libzypp-bindings-HEAD/ws/checkout/swig/legacy/GetResolvablesToInsDel.h>:88:94:
warning: 'GetResolvablesToInsDel' is deprecated [-Wdeprecated-declarations]
<http://river.suse.de/job/libzypp-bindings-HEAD/ws/build/swig/ruby/libzypp_ruby.cc>:3394:119:
warning: 'GetResolvablesToInsDel' is deprecated (declared at
<http://river.suse.de/job/libzypp-bindings-HEAD/ws/checkout/swig/legacy/GetResolvablesToInsDel.h>:41)
[-Wdeprecated-declarations]
<http://river.suse.de/job/libzypp-bindings-HEAD/ws/build/swig/ruby/libzypp_ruby.cc>:
In member function 'virtual void PatchScriptReportReceiver::start(const
constPtr&, const zypp::filesystem::Pathname&)':
<http://river.suse.de/job/libzypp-bindings-HEAD/ws/build/swig/ruby/libzypp_ruby.cc>:3854:11:
warning: unused variable 'result' [-Wunused-variable]
<http://river.suse.de/job/libzypp-bindings-HEAD/ws/build/swig/ruby/libzypp_ruby.cc>:
In member function 'virtual void PatchScriptReportReceiver::finish()':
<http://river.suse.de/job/libzypp-bindings-HEAD/ws/build/swig/ruby/libzypp_ruby.cc>:3922:11:
warning: unused variable 'res' [-Wunused-variable]
<http://river.suse.de/job/libzypp-bindings-HEAD/ws/build/swig/ruby/libzypp_ruby.cc>:
In member function 'virtual void
RemoveResolvableReportReceiver::start(zypp::Resolvable::constPtr)':
<http://river.suse.de/job/libzypp-bindings-HEAD/ws/build/swig/ruby/libzypp_ruby.cc>:3944:11:
warning: unused variable 'result' [-Wunused-variable]
<http://river.suse.de/job/libzypp-bindings-HEAD/ws/build/swig/ruby/libzypp_ruby.cc>:
In member function 'virtual void
RemoveResolvableReportReceiver::finish(zypp::Resolvable::constPtr,
zypp::target::rpm::RemoveResolvableReport::Error, const string&)':
<http://river.suse.de/job/libzypp-bindings-HEAD/ws/build/swig/ruby/libzypp_ruby.cc>:3995:11:
warning: unused variable 'res' [-Wunused-variable]
<http://river.suse.de/job/libzypp-bindings-HEAD/ws/build/swig/ruby/libzypp_ruby.cc>:
In member function 'virtual void
InstallResolvableReportReceiver::start(zypp::Resolvable::constPtr)':
<http://river.suse.de/job/libzypp-bindings-HEAD/ws/build/swig/ruby/libzypp_ruby.cc>:4020:11:
warning: unused variable 'result' [-Wunused-variable]
<http://river.suse.de/job/libzypp-bindings-HEAD/ws/build/swig/ruby/libzypp_ruby.cc>:
In member function 'virtual void
InstallResolvableReportReceiver::finish(zypp::Resolvable::constPtr,
zypp::target::rpm::InstallResolvableReport::Error, const string&,
zypp::target::rpm::InstallResolvableReport::RpmLevel)':
<http://river.suse.de/job/libzypp-bindings-HEAD/ws/build/swig/ruby/libzypp_ruby.cc>:4071:11:
warning: unused variable 'res' [-Wunused-variable]
<http://river.suse.de/job/libzypp-bindings-HEAD/ws/build/swig/ruby/libzypp_ruby.cc>:
In function 'VALUE _wrap_RepoInfo_rawBaseUrls(int, VALUE*, VALUE)':
<http://river.suse.de/job/libzypp-bindings-HEAD/ws/build/swig/ruby/libzypp_ruby.cc>:35882:48:
error: 'const class zypp::RepoInfo' has no member named 'rawBaseUrls'
<http://river.suse.de/job/libzypp-bindings-HEAD/ws/build/swig/ruby/libzypp_ruby.cc>:
In function 'VALUE _wrap_RepoInfo_rawGpgKeyUrl(int, VALUE*, VALUE)':
<http://river.suse.de/job/libzypp-bindings-HEAD/ws/build/swig/ruby/libzypp_ruby.cc>:36540:48:
error: 'const class zypp::RepoInfo' has no member named 'rawGpgKeyUrl'
<http://river.suse.de/job/libzypp-bindings-HEAD/ws/build/swig/ruby/libzypp_ruby.cc>:
In function 'VALUE _wrap_ServiceInfo_rawUrl(int, VALUE*, VALUE)':
<http://river.suse.de/job/libzypp-bindings-HEAD/ws/build/swig/ruby/libzypp_ruby.cc>:40172:51:
error: 'const class zypp::ServiceInfo' has no member named 'rawUrl'
<http://river.suse.de/job/libzypp-bindings-HEAD/ws/build/swig/ruby/libzypp_ruby.cc>:
In function 'VALUE _wrap_ResPool_getTransaction(int, VALUE*, VALUE)':
<http://river.suse.de/job/libzypp-bindings-HEAD/ws/build/swig/ruby/libzypp_ruby.cc>:111971:33:
warning: 'GetResolvablesToInsDel' is deprecated (declared at
<http://river.suse.de/job/libzypp-bindings-HEAD/ws/checkout/swig/legacy/GetResolvablesToInsDel.h>:41)
[-Wdeprecated-declarations]
<http://river.suse.de/job/libzypp-bindings-HEAD/ws/build/swig/ruby/libzypp_ruby.cc>:111991:54:
warning: 'GetResolvablesToInsDel' is deprecated (declared at
<http://river.suse.de/job/libzypp-bindings-HEAD/ws/checkout/swig/legacy/GetResolvablesToInsDel.h>:41)
[-Wdeprecated-declarations]
<http://river.suse.de/job/libzypp-bindings-HEAD/ws/build/swig/ruby/libzypp_ruby.cc>:111991:130:
warning: 'GetResolvablesToInsDel' is deprecated (declared at
<http://river.suse.de/job/libzypp-bindings-HEAD/ws/checkout/swig/legacy/GetResolvablesToInsDel.h>:41)
[-Wdeprecated-declarations]
<http://river.suse.de/job/libzypp-bindings-HEAD/ws/build/swig/ruby/libzypp_ruby.cc>:
In function 'VALUE _wrap_new_GetResolvablesToInsDel__SWIG_0(int, VALUE*,
VALUE)':
<http://river.suse.de/job/libzypp-bindings-HEAD/ws/build/swig/ruby/libzypp_ruby.cc>:112176:39:
warning: 'GetResolvablesToInsDel' is deprecated (declared at
<http://river.suse.de/job/libzypp-bindings-HEAD/ws/checkout/swig/legacy/GetResolvablesToInsDel.h>:41)
[-Wdeprecated-declarations]
<http://river.suse.de/job/libzypp-bindings-HEAD/ws/build/swig/ruby/libzypp_ruby.cc>:112199:52:
warning: 'GetResolvablesToInsDel' is deprecated (declared at
<http://river.suse.de/job/libzypp-bindings-HEAD/ws/checkout/swig/legacy/GetResolvablesToInsDel.h>:41)
[-Wdeprecated-declarations]
<http://river.suse.de/job/libzypp-bindings-HEAD/ws/build/swig/ruby/libzypp_ruby.cc>:112199:70:
warning: 'GetResolvablesToInsDel' is deprecated (declared at
<http://river.suse.de/job/libzypp-bindings-HEAD/ws/checkout/swig/legacy/GetResolvablesToInsDel.h>:41)
[-Wdeprecated-declarations]
<http://river.suse.de/job/libzypp-bindings-HEAD/ws/build/swig/ruby/libzypp_ruby.cc>:
In function 'VALUE _wrap_new_GetResolvablesToInsDel__SWIG_1(int, VALUE*,
VALUE)':
<http://river.suse.de/job/libzypp-bindings-HEAD/ws/build/swig/ruby/libzypp_ruby.cc>:112235:39:
warning: 'GetResolvablesToInsDel' is deprecated (declared at
<http://river.suse.de/job/libzypp-bindings-HEAD/ws/checkout/swig/legacy/GetResolvablesToInsDel.h>:41)
[-Wdeprecated-declarations]
<http://river.suse.de/job/libzypp-bindings-HEAD/ws/build/swig/ruby/libzypp_ruby.cc>:112253:52:
warning: 'GetResolvablesToInsDel' is deprecated (declared at
<http://river.suse.de/job/libzypp-bindings-HEAD/ws/checkout/swig/legacy/GetResolvablesToInsDel.h>:41)
[-Wdeprecated-declarations]
<http://river.suse.de/job/libzypp-bindings-HEAD/ws/build/swig/ruby/libzypp_ruby.cc>:112253:70:
warning: 'GetResolvablesToInsDel' is deprecated (declared at
<http://river.suse.de/job/libzypp-bindings-HEAD/ws/checkout/swig/legacy/GetResolvablesToInsDel.h>:41)
[-Wdeprecated-declarations]
<http://river.suse.de/job/libzypp-bindings-HEAD/ws/build/swig/ruby/libzypp_ruby.cc>:
In function 'VALUE _wrap_GetResolvablesToInsDel__toDelete_set(int, VALUE*,
VALUE)':
<http://river.suse.de/job/libzypp-bindings-HEAD/ws/build/swig/ruby/libzypp_ruby.cc>:112313:39:
warning: 'GetResolvablesToInsDel' is deprecated (declared at
<http://river.suse.de/job/libzypp-bindings-HEAD/ws/checkout/swig/legacy/GetResolvablesToInsDel.h>:41)
[-Wdeprecated-declarations]
<http://river.suse.de/job/libzypp-bindings-HEAD/ws/build/swig/ruby/libzypp_ruby.cc>:112313:82:
warning: 'GetResolvablesToInsDel' is deprecated (declared at
<http://river.suse.de/job/libzypp-bindings-HEAD/ws/checkout/swig/legacy/GetResolvablesToInsDel.h>:41)
[-Wdeprecated-declarations]
<http://river.suse.de/job/libzypp-bindings-HEAD/ws/build/swig/ruby/libzypp_ruby.cc>:112327:63:
warning: 'GetResolvablesToInsDel' is deprecated (declared at
<http://river.suse.de/job/libzypp-bindings-HEAD/ws/checkout/swig/legacy/GetResolvablesToInsDel.h>:41)
[-Wdeprecated-declarations]
<http://river.suse.de/job/libzypp-bindings-HEAD/ws/build/swig/ruby/libzypp_ruby.cc>:
In function 'VALUE _wrap_GetResolvablesToInsDel__toDelete_get(int, VALUE*,
VALUE)':
<http://river.suse.de/job/libzypp-bindings-HEAD/ws/build/swig/ruby/libzypp_ruby.cc>:112342:39:
warning: 'GetResolvablesToInsDel' is deprecated (declared at
<http://river.suse.de/job/libzypp-bindings-HEAD/ws/checkout/swig/legacy/GetResolvablesToInsDel.h>:41)
[-Wdeprecated-declarations]
<http://river.suse.de/job/libzypp-bindings-HEAD/ws/build/swig/ruby/libzypp_ruby.cc>:112342:82:
warning: 'GetResolvablesToInsDel' is deprecated (declared at
<http://river.suse.de/job/libzypp-bindings-HEAD/ws/checkout/swig/legacy/GetResolvablesToInsDel.h>:41)
[-Wdeprecated-declarations]
<http://river.suse.de/job/libzypp-bindings-HEAD/ws/build/swig/ruby/libzypp_ruby.cc>:112355:63:
warning: 'GetResolvablesToInsDel' is deprecated (declared at
<http://river.suse.de/job/libzypp-bindings-HEAD/ws/checkout/swig/legacy/GetResolvablesToInsDel.h>:41)
[-Wdeprecated-declarations]
<http://river.suse.de/job/libzypp-bindings-HEAD/ws/build/swig/ruby/libzypp_ruby.cc>:
In function 'VALUE _wrap_GetResolvablesToInsDel__toInstall_set(int, VALUE*,
VALUE)':
<http://river.suse.de/job/libzypp-bindings-HEAD/ws/build/swig/ruby/libzypp_ruby.cc>:112366:39:
warning: 'GetResolvablesToInsDel' is deprecated (declared at
<http://river.suse.de/job/libzypp-bindings-HEAD/ws/checkout/swig/legacy/GetResolvablesToInsDel.h>:41)
[-Wdeprecated-declarations]
<http://river.suse.de/job/libzypp-bindings-HEAD/ws/build/swig/ruby/libzypp_ruby.cc>:112366:82:
warning: 'GetResolvablesToInsDel' is deprecated (declared at
<http://river.suse.de/job/libzypp-bindings-HEAD/ws/checkout/swig/legacy/GetResolvablesToInsDel.h>:41)
[-Wdeprecated-declarations]
<http://river.suse.de/job/libzypp-bindings-HEAD/ws/build/swig/ruby/libzypp_ruby.cc>:112380:63:
warning: 'GetResolvablesToInsDel' is deprecated (declared at
<http://river.suse.de/job/libzypp-bindings-HEAD/ws/checkout/swig/legacy/GetResolvablesToInsDel.h>:41)
[-Wdeprecated-declarations]
<http://river.suse.de/job/libzypp-bindings-HEAD/ws/build/swig/ruby/libzypp_ruby.cc>:
In function 'VALUE _wrap_GetResolvablesToInsDel__toInstall_get(int, VALUE*,
VALUE)':
<http://river.suse.de/job/libzypp-bindings-HEAD/ws/build/swig/ruby/libzypp_ruby.cc>:112395:39:
warning: 'GetResolvablesToInsDel' is deprecated (declared at
<http://river.suse.de/job/libzypp-bindings-HEAD/ws/checkout/swig/legacy/GetResolvablesToInsDel.h>:41)
[-Wdeprecated-declarations]
<http://river.suse.de/job/libzypp-bindings-HEAD/ws/build/swig/ruby/libzypp_ruby.cc>:112395:82:
warning: 'GetResolvablesToInsDel' is deprecated (declared at
<http://river.suse.de/job/libzypp-bindings-HEAD/ws/checkout/swig/legacy/GetResolvablesToInsDel.h>:41)
[-Wdeprecated-declarations]
<http://river.suse.de/job/libzypp-bindings-HEAD/ws/build/swig/ruby/libzypp_ruby.cc>:112408:63:
warning: 'GetResolvablesToInsDel' is deprecated (declared at
<http://river.suse.de/job/libzypp-bindings-HEAD/ws/checkout/swig/legacy/GetResolvablesToInsDel.h>:41)
[-Wdeprecated-declarations]
<http://river.suse.de/job/libzypp-bindings-HEAD/ws/build/swig/ruby/libzypp_ruby.cc>:
In function 'VALUE _wrap_GetResolvablesToInsDel__toSrcinstall_set(int, VALUE*,
VALUE)':
<http://river.suse.de/job/libzypp-bindings-HEAD/ws/build/swig/ruby/libzypp_ruby.cc>:112419:39:
warning: 'GetResolvablesToInsDel' is deprecated (declared at
<http://river.suse.de/job/libzypp-bindings-HEAD/ws/checkout/swig/legacy/GetResolvablesToInsDel.h>:41)
[-Wdeprecated-declarations]
<http://river.suse.de/job/libzypp-bindings-HEAD/ws/build/swig/ruby/libzypp_ruby.cc>:112419:82:
warning: 'GetResolvablesToInsDel' is deprecated (declared at
<http://river.suse.de/job/libzypp-bindings-HEAD/ws/checkout/swig/legacy/GetResolvablesToInsDel.h>:41)
[-Wdeprecated-declarations]
<http://river.suse.de/job/libzypp-bindings-HEAD/ws/build/swig/ruby/libzypp_ruby.cc>:112433:63:
warning: 'GetResolvablesToInsDel' is deprecated (declared at
<http://river.suse.de/job/libzypp-bindings-HEAD/ws/checkout/swig/legacy/GetResolvablesToInsDel.h>:41)
[-Wdeprecated-declarations]
<http://river.suse.de/job/libzypp-bindings-HEAD/ws/build/swig/ruby/libzypp_ruby.cc>:
In function 'VALUE _wrap_GetResolvablesToInsDel__toSrcinstall_get(int, VALUE*,
VALUE)':
<http://river.suse.de/job/libzypp-bindings-HEAD/ws/build/swig/ruby/libzypp_ruby.cc>:112448:39:
warning: 'GetResolvablesToInsDel' is deprecated (declared at
<http://river.suse.de/job/libzypp-bindings-HEAD/ws/checkout/swig/legacy/GetResolvablesToInsDel.h>:41)
[-Wdeprecated-declarations]
<http://river.suse.de/job/libzypp-bindings-HEAD/ws/build/swig/ruby/libzypp_ruby.cc>:112448:82:
warning: 'GetResolvablesToInsDel' is deprecated (declared at
<http://river.suse.de/job/libzypp-bindings-HEAD/ws/checkout/swig/legacy/GetResolvablesToInsDel.h>:41)
[-Wdeprecated-declarations]
<http://river.suse.de/job/libzypp-bindings-HEAD/ws/build/swig/ruby/libzypp_ruby.cc>:112461:63:
warning: 'GetResolvablesToInsDel' is deprecated (declared at
<http://river.suse.de/job/libzypp-bindings-HEAD/ws/checkout/swig/legacy/GetResolvablesToInsDel.h>:41)
[-Wdeprecated-declarations]
<http://river.suse.de/job/libzypp-bindings-HEAD/ws/build/swig/ruby/libzypp_ruby.cc>:
At global scope:
<http://river.suse.de/job/libzypp-bindings-HEAD/ws/build/swig/ruby/libzypp_ruby.cc>:112471:79:
warning: 'GetResolvablesToInsDel' is deprecated (declared at
<http://river.suse.de/job/libzypp-bindings-HEAD/ws/checkout/swig/legacy/GetResolvablesToInsDel.h>:41)
[-Wdeprecated-declarations]
ICECC[2478] 14:39:58: Compiled on 10.160.4.3
swig/ruby/CMakeFiles/zypp_ruby.dir/build.make:63: recipe for target
'swig/ruby/CMakeFiles/zypp_ruby.dir/libzypp_ruby.cc.o' failed
make[2]: *** [swig/ruby/CMakeFiles/zypp_ruby.dir/libzypp_ruby.cc.o] Error 1
CMakeFiles/Makefile2:191: recipe for target
'swig/ruby/CMakeFiles/zypp_ruby.dir/all' failed
make[1]: *** [swig/ruby/CMakeFiles/zypp_ruby.dir/all] Error 2
make[1]: *** Waiting for unfinished jobs....
In file included from
<http://river.suse.de/job/libzypp-bindings-HEAD/ws/build/swig/perl5/libzypp_perl.cc>:2033:0:
<http://river.suse.de/job/libzypp-bindings-HEAD/ws/checkout/swig/legacy/GetResolvablesToInsDel.h>:88:94:
warning: 'GetResolvablesToInsDel' is deprecated [-Wdeprecated-declarations]
<http://river.suse.de/job/libzypp-bindings-HEAD/ws/build/swig/perl5/libzypp_perl.cc>:
In function 'int SWIG_AsVal_unsigned_SS_long(SV*, long unsigned int*)':
<http://river.suse.de/job/libzypp-bindings-HEAD/ws/build/swig/perl5/libzypp_perl.cc>:2374:57:
warning: comparison between signed and unsigned integer expressions
[-Wsign-compare]
<http://river.suse.de/job/libzypp-bindings-HEAD/ws/build/swig/perl5/libzypp_perl.cc>:
At global scope:
<http://river.suse.de/job/libzypp-bindings-HEAD/ws/build/swig/perl5/libzypp_perl.cc>:2609:119:
warning: 'GetResolvablesToInsDel' is deprecated (declared at
<http://river.suse.de/job/libzypp-bindings-HEAD/ws/checkout/swig/legacy/GetResolvablesToInsDel.h>:41)
[-Wdeprecated-declarations]
<http://river.suse.de/job/libzypp-bindings-HEAD/ws/build/swig/perl5/libzypp_perl.cc>:
In function 'void _wrap_RepoInfo_rawBaseUrls(PerlInterpreter*, CV*)':
<http://river.suse.de/job/libzypp-bindings-HEAD/ws/build/swig/perl5/libzypp_perl.cc>:36963:46:
error: 'const class zypp::RepoInfo' has no member named 'rawBaseUrls'
<http://river.suse.de/job/libzypp-bindings-HEAD/ws/build/swig/perl5/libzypp_perl.cc>:
In function 'void _wrap_RepoInfo_rawGpgKeyUrl(PerlInterpreter*, CV*)':
<http://river.suse.de/job/libzypp-bindings-HEAD/ws/build/swig/perl5/libzypp_perl.cc>:37572:46:
error: 'const class zypp::RepoInfo' has no member named 'rawGpgKeyUrl'
<http://river.suse.de/job/libzypp-bindings-HEAD/ws/build/swig/perl5/libzypp_perl.cc>:
In function 'void _wrap_ServiceInfo_rawUrl(PerlInterpreter*, CV*)':
<http://river.suse.de/job/libzypp-bindings-HEAD/ws/build/swig/perl5/libzypp_perl.cc>:41251:49:
error: 'const class zypp::ServiceInfo' has no member named 'rawUrl'
<http://river.suse.de/job/libzypp-bindings-HEAD/ws/build/swig/perl5/libzypp_perl.cc>:
In function 'void _wrap_ResPool_getTransaction(PerlInterpreter*, CV*)':
<http://river.suse.de/job/libzypp-bindings-HEAD/ws/build/swig/perl5/libzypp_perl.cc>:114896:35:
warning: 'GetResolvablesToInsDel' is deprecated (declared at
<http://river.suse.de/job/libzypp-bindings-HEAD/ws/checkout/swig/legacy/GetResolvablesToInsDel.h>:41)
[-Wdeprecated-declarations]
<http://river.suse.de/job/libzypp-bindings-HEAD/ws/build/swig/perl5/libzypp_perl.cc>:114908:131:
warning: 'GetResolvablesToInsDel' is deprecated (declared at
<http://river.suse.de/job/libzypp-bindings-HEAD/ws/checkout/swig/legacy/GetResolvablesToInsDel.h>:41)
[-Wdeprecated-declarations]
<http://river.suse.de/job/libzypp-bindings-HEAD/ws/build/swig/perl5/libzypp_perl.cc>:114908:207:
warning: 'GetResolvablesToInsDel' is deprecated (declared at
<http://river.suse.de/job/libzypp-bindings-HEAD/ws/checkout/swig/legacy/GetResolvablesToInsDel.h>:41)
[-Wdeprecated-declarations]
<http://river.suse.de/job/libzypp-bindings-HEAD/ws/build/swig/perl5/libzypp_perl.cc>:
In function 'void _wrap_new_GetResolvablesToInsDel__SWIG_0(PerlInterpreter*,
CV*)':
<http://river.suse.de/job/libzypp-bindings-HEAD/ws/build/swig/perl5/libzypp_perl.cc>:115184:41:
warning: 'GetResolvablesToInsDel' is deprecated (declared at
<http://river.suse.de/job/libzypp-bindings-HEAD/ws/checkout/swig/legacy/GetResolvablesToInsDel.h>:41)
[-Wdeprecated-declarations]
<http://river.suse.de/job/libzypp-bindings-HEAD/ws/build/swig/perl5/libzypp_perl.cc>:115206:50:
warning: 'GetResolvablesToInsDel' is deprecated (declared at
<http://river.suse.de/job/libzypp-bindings-HEAD/ws/checkout/swig/legacy/GetResolvablesToInsDel.h>:41)
[-Wdeprecated-declarations]
<http://river.suse.de/job/libzypp-bindings-HEAD/ws/build/swig/perl5/libzypp_perl.cc>:115206:68:
warning: 'GetResolvablesToInsDel' is deprecated (declared at
<http://river.suse.de/job/libzypp-bindings-HEAD/ws/checkout/swig/legacy/GetResolvablesToInsDel.h>:41)
[-Wdeprecated-declarations]
<http://river.suse.de/job/libzypp-bindings-HEAD/ws/build/swig/perl5/libzypp_perl.cc>:
In function 'void _wrap_new_GetResolvablesToInsDel__SWIG_1(PerlInterpreter*,
CV*)':
<http://river.suse.de/job/libzypp-bindings-HEAD/ws/build/swig/perl5/libzypp_perl.cc>:115223:41:
warning: 'GetResolvablesToInsDel' is deprecated (declared at
<http://river.suse.de/job/libzypp-bindings-HEAD/ws/checkout/swig/legacy/GetResolvablesToInsDel.h>:41)
[-Wdeprecated-declarations]
<http://river.suse.de/job/libzypp-bindings-HEAD/ws/build/swig/perl5/libzypp_perl.cc>:115240:50:
warning: 'GetResolvablesToInsDel' is deprecated (declared at
<http://river.suse.de/job/libzypp-bindings-HEAD/ws/checkout/swig/legacy/GetResolvablesToInsDel.h>:41)
[-Wdeprecated-declarations]
<http://river.suse.de/job/libzypp-bindings-HEAD/ws/build/swig/perl5/libzypp_perl.cc>:115240:68:
warning: 'GetResolvablesToInsDel' is deprecated (declared at
<http://river.suse.de/job/libzypp-bindings-HEAD/ws/checkout/swig/legacy/GetResolvablesToInsDel.h>:41)
[-Wdeprecated-declarations]
<http://river.suse.de/job/libzypp-bindings-HEAD/ws/build/swig/perl5/libzypp_perl.cc>:
In function 'void _wrap_GetResolvablesToInsDel__toDelete_set(PerlInterpreter*,
CV*)':
<http://river.suse.de/job/libzypp-bindings-HEAD/ws/build/swig/perl5/libzypp_perl.cc>:115323:41:
warning: 'GetResolvablesToInsDel' is deprecated (declared at
<http://river.suse.de/job/libzypp-bindings-HEAD/ws/checkout/swig/legacy/GetResolvablesToInsDel.h>:41)
[-Wdeprecated-declarations]
<http://river.suse.de/job/libzypp-bindings-HEAD/ws/build/swig/perl5/libzypp_perl.cc>:115323:84:
warning: 'GetResolvablesToInsDel' is deprecated (declared at
<http://river.suse.de/job/libzypp-bindings-HEAD/ws/checkout/swig/legacy/GetResolvablesToInsDel.h>:41)
[-Wdeprecated-declarations]
<http://river.suse.de/job/libzypp-bindings-HEAD/ws/build/swig/perl5/libzypp_perl.cc>:115339:65:
warning: 'GetResolvablesToInsDel' is deprecated (declared at
<http://river.suse.de/job/libzypp-bindings-HEAD/ws/checkout/swig/legacy/GetResolvablesToInsDel.h>:41)
[-Wdeprecated-declarations]
<http://river.suse.de/job/libzypp-bindings-HEAD/ws/build/swig/perl5/libzypp_perl.cc>:
In function 'void _wrap_GetResolvablesToInsDel__toDelete_get(PerlInterpreter*,
CV*)':
<http://river.suse.de/job/libzypp-bindings-HEAD/ws/build/swig/perl5/libzypp_perl.cc>:115360:41:
warning: 'GetResolvablesToInsDel' is deprecated (declared at
<http://river.suse.de/job/libzypp-bindings-HEAD/ws/checkout/swig/legacy/GetResolvablesToInsDel.h>:41)
[-Wdeprecated-declarations]
<http://river.suse.de/job/libzypp-bindings-HEAD/ws/build/swig/perl5/libzypp_perl.cc>:115360:84:
warning: 'GetResolvablesToInsDel' is deprecated (declared at
<http://river.suse.de/job/libzypp-bindings-HEAD/ws/checkout/swig/legacy/GetResolvablesToInsDel.h>:41)
[-Wdeprecated-declarations]
<http://river.suse.de/job/libzypp-bindings-HEAD/ws/build/swig/perl5/libzypp_perl.cc>:115374:65:
warning: 'GetResolvablesToInsDel' is deprecated (declared at
<http://river.suse.de/job/libzypp-bindings-HEAD/ws/checkout/swig/legacy/GetResolvablesToInsDel.h>:41)
[-Wdeprecated-declarations]
<http://river.suse.de/job/libzypp-bindings-HEAD/ws/build/swig/perl5/libzypp_perl.cc>:
In function 'void
_wrap_GetResolvablesToInsDel__toInstall_set(PerlInterpreter*, CV*)':
<http://river.suse.de/job/libzypp-bindings-HEAD/ws/build/swig/perl5/libzypp_perl.cc>:115388:41:
warning: 'GetResolvablesToInsDel' is deprecated (declared at
<http://river.suse.de/job/libzypp-bindings-HEAD/ws/checkout/swig/legacy/GetResolvablesToInsDel.h>:41)
[-Wdeprecated-declarations]
<http://river.suse.de/job/libzypp-bindings-HEAD/ws/build/swig/perl5/libzypp_perl.cc>:115388:84:
warning: 'GetResolvablesToInsDel' is deprecated (declared at
<http://river.suse.de/job/libzypp-bindings-HEAD/ws/checkout/swig/legacy/GetResolvablesToInsDel.h>:41)
[-Wdeprecated-declarations]
<http://river.suse.de/job/libzypp-bindings-HEAD/ws/build/swig/perl5/libzypp_perl.cc>:115404:65:
warning: 'GetResolvablesToInsDel' is deprecated (declared at
<http://river.suse.de/job/libzypp-bindings-HEAD/ws/checkout/swig/legacy/GetResolvablesToInsDel.h>:41)
[-Wdeprecated-declarations]
<http://river.suse.de/job/libzypp-bindings-HEAD/ws/build/swig/perl5/libzypp_perl.cc>:
In function 'void
_wrap_GetResolvablesToInsDel__toInstall_get(PerlInterpreter*, CV*)':
<http://river.suse.de/job/libzypp-bindings-HEAD/ws/build/swig/perl5/libzypp_perl.cc>:115425:41:
warning: 'GetResolvablesToInsDel' is deprecated (declared at
<http://river.suse.de/job/libzypp-bindings-HEAD/ws/checkout/swig/legacy/GetResolvablesToInsDel.h>:41)
[-Wdeprecated-declarations]
<http://river.suse.de/job/libzypp-bindings-HEAD/ws/build/swig/perl5/libzypp_perl.cc>:115425:84:
warning: 'GetResolvablesToInsDel' is deprecated (declared at
<http://river.suse.de/job/libzypp-bindings-HEAD/ws/checkout/swig/legacy/GetResolvablesToInsDel.h>:41)
[-Wdeprecated-declarations]
<http://river.suse.de/job/libzypp-bindings-HEAD/ws/build/swig/perl5/libzypp_perl.cc>:115439:65:
warning: 'GetResolvablesToInsDel' is deprecated (declared at
<http://river.suse.de/job/libzypp-bindings-HEAD/ws/checkout/swig/legacy/GetResolvablesToInsDel.h>:41)
[-Wdeprecated-declarations]
<http://river.suse.de/job/libzypp-bindings-HEAD/ws/build/swig/perl5/libzypp_perl.cc>:
In function 'void
_wrap_GetResolvablesToInsDel__toSrcinstall_set(PerlInterpreter*, CV*)':
<http://river.suse.de/job/libzypp-bindings-HEAD/ws/build/swig/perl5/libzypp_perl.cc>:115453:41:
warning: 'GetResolvablesToInsDel' is deprecated (declared at
<http://river.suse.de/job/libzypp-bindings-HEAD/ws/checkout/swig/legacy/GetResolvablesToInsDel.h>:41)
[-Wdeprecated-declarations]
<http://river.suse.de/job/libzypp-bindings-HEAD/ws/build/swig/perl5/libzypp_perl.cc>:115453:84:
warning: 'GetResolvablesToInsDel' is deprecated (declared at
<http://river.suse.de/job/libzypp-bindings-HEAD/ws/checkout/swig/legacy/GetResolvablesToInsDel.h>:41)
[-Wdeprecated-declarations]
<http://river.suse.de/job/libzypp-bindings-HEAD/ws/build/swig/perl5/libzypp_perl.cc>:115469:65:
warning: 'GetResolvablesToInsDel' is deprecated (declared at
<http://river.suse.de/job/libzypp-bindings-HEAD/ws/checkout/swig/legacy/GetResolvablesToInsDel.h>:41)
[-Wdeprecated-declarations]
<http://river.suse.de/job/libzypp-bindings-HEAD/ws/build/swig/perl5/libzypp_perl.cc>:
In function 'void
_wrap_GetResolvablesToInsDel__toSrcinstall_get(PerlInterpreter*, CV*)':
<http://river.suse.de/job/libzypp-bindings-HEAD/ws/build/swig/perl5/libzypp_perl.cc>:115490:41:
warning: 'GetResolvablesToInsDel' is deprecated (declared at
<http://river.suse.de/job/libzypp-bindings-HEAD/ws/checkout/swig/legacy/GetResolvablesToInsDel.h>:41)
[-Wdeprecated-declarations]
<http://river.suse.de/job/libzypp-bindings-HEAD/ws/build/swig/perl5/libzypp_perl.cc>:115490:84:
warning: 'GetResolvablesToInsDel' is deprecated (declared at
<http://river.suse.de/job/libzypp-bindings-HEAD/ws/checkout/swig/legacy/GetResolvablesToInsDel.h>:41)
[-Wdeprecated-declarations]
<http://river.suse.de/job/libzypp-bindings-HEAD/ws/build/swig/perl5/libzypp_perl.cc>:115504:65:
warning: 'GetResolvablesToInsDel' is deprecated (declared at
<http://river.suse.de/job/libzypp-bindings-HEAD/ws/checkout/swig/legacy/GetResolvablesToInsDel.h>:41)
[-Wdeprecated-declarations]
<http://river.suse.de/job/libzypp-bindings-HEAD/ws/build/swig/perl5/libzypp_perl.cc>:
In function 'void _wrap_delete_GetResolvablesToInsDel(PerlInterpreter*, CV*)':
<http://river.suse.de/job/libzypp-bindings-HEAD/ws/build/swig/perl5/libzypp_perl.cc>:115518:41:
warning: 'GetResolvablesToInsDel' is deprecated (declared at
<http://river.suse.de/job/libzypp-bindings-HEAD/ws/checkout/swig/legacy/GetResolvablesToInsDel.h>:41)
[-Wdeprecated-declarations]
<http://river.suse.de/job/libzypp-bindings-HEAD/ws/build/swig/perl5/libzypp_perl.cc>:115518:84:
warning: 'GetResolvablesToInsDel' is deprecated (declared at
<http://river.suse.de/job/libzypp-bindings-HEAD/ws/checkout/swig/legacy/GetResolvablesToInsDel.h>:41)
[-Wdeprecated-declarations]
<http://river.suse.de/job/libzypp-bindings-HEAD/ws/build/swig/perl5/libzypp_perl.cc>:115531:65:
warning: 'GetResolvablesToInsDel' is deprecated (declared at
<http://river.suse.de/job/libzypp-bindings-HEAD/ws/checkout/swig/legacy/GetResolvablesToInsDel.h>:41)
[-Wdeprecated-declarations]
ICECC[2489] 14:40:01: Compiled on 10.160.4.3
swig/perl5/CMakeFiles/zypp_perl.dir/build.make:63: recipe for target
'swig/perl5/CMakeFiles/zypp_perl.dir/libzypp_perl.cc.o' failed
make[2]: *** [swig/perl5/CMakeFiles/zypp_perl.dir/libzypp_perl.cc.o] Error 1
CMakeFiles/Makefile2:325: recipe for target
'swig/perl5/CMakeFiles/zypp_perl.dir/all' failed
make[1]: *** [swig/perl5/CMakeFiles/zypp_perl.dir/all] Error 2
In file included from
<http://river.suse.de/job/libzypp-bindings-HEAD/ws/build/swig/python/libzypp_python.cc>:3519:0:
<http://river.suse.de/job/libzypp-bindings-HEAD/ws/checkout/swig/legacy/GetResolvablesToInsDel.h>:88:94:
warning: 'GetResolvablesToInsDel' is deprecated [-Wdeprecated-declarations]
<http://river.suse.de/job/libzypp-bindings-HEAD/ws/build/swig/python/libzypp_python.cc>:5931:119:
warning: 'GetResolvablesToInsDel' is deprecated (declared at
<http://river.suse.de/job/libzypp-bindings-HEAD/ws/checkout/swig/legacy/GetResolvablesToInsDel.h>:41)
[-Wdeprecated-declarations]
<http://river.suse.de/job/libzypp-bindings-HEAD/ws/build/swig/python/libzypp_python.cc>:
In function 'PyObject* _wrap_RepoInfo_rawBaseUrls(PyObject*, PyObject*)':
<http://river.suse.de/job/libzypp-bindings-HEAD/ws/build/swig/python/libzypp_python.cc>:42439:48:
error: 'const class zypp::RepoInfo' has no member named 'rawBaseUrls'
<http://river.suse.de/job/libzypp-bindings-HEAD/ws/build/swig/python/libzypp_python.cc>:
In function 'PyObject* _wrap_RepoInfo_rawGpgKeyUrl(PyObject*, PyObject*)':
<http://river.suse.de/job/libzypp-bindings-HEAD/ws/build/swig/python/libzypp_python.cc>:43093:48:
error: 'const class zypp::RepoInfo' has no member named 'rawGpgKeyUrl'
<http://river.suse.de/job/libzypp-bindings-HEAD/ws/build/swig/python/libzypp_python.cc>:
In function 'PyObject* _wrap_ServiceInfo_rawUrl(PyObject*, PyObject*)':
<http://river.suse.de/job/libzypp-bindings-HEAD/ws/build/swig/python/libzypp_python.cc>:48601:51:
error: 'const class zypp::ServiceInfo' has no member named 'rawUrl'
<http://river.suse.de/job/libzypp-bindings-HEAD/ws/build/swig/python/libzypp_python.cc>:
In function 'PyObject* _wrap_ResPool_getTransaction(PyObject*, PyObject*)':
<http://river.suse.de/job/libzypp-bindings-HEAD/ws/build/swig/python/libzypp_python.cc>:122161:33:
warning: 'GetResolvablesToInsDel' is deprecated (declared at
<http://river.suse.de/job/libzypp-bindings-HEAD/ws/checkout/swig/legacy/GetResolvablesToInsDel.h>:41)
[-Wdeprecated-declarations]
<http://river.suse.de/job/libzypp-bindings-HEAD/ws/build/swig/python/libzypp_python.cc>:122179:66:
warning: 'GetResolvablesToInsDel' is deprecated (declared at
<http://river.suse.de/job/libzypp-bindings-HEAD/ws/checkout/swig/legacy/GetResolvablesToInsDel.h>:41)
[-Wdeprecated-declarations]
<http://river.suse.de/job/libzypp-bindings-HEAD/ws/build/swig/python/libzypp_python.cc>:122179:142:
warning: 'GetResolvablesToInsDel' is deprecated (declared at
<http://river.suse.de/job/libzypp-bindings-HEAD/ws/checkout/swig/legacy/GetResolvablesToInsDel.h>:41)
[-Wdeprecated-declarations]
<http://river.suse.de/job/libzypp-bindings-HEAD/ws/build/swig/python/libzypp_python.cc>:
In function 'PyObject* _wrap_new_GetResolvablesToInsDel__SWIG_0(PyObject*,
PyObject*)':
<http://river.suse.de/job/libzypp-bindings-HEAD/ws/build/swig/python/libzypp_python.cc>:122360:39:
warning: 'GetResolvablesToInsDel' is deprecated (declared at
<http://river.suse.de/job/libzypp-bindings-HEAD/ws/checkout/swig/legacy/GetResolvablesToInsDel.h>:41)
[-Wdeprecated-declarations]
<http://river.suse.de/job/libzypp-bindings-HEAD/ws/build/swig/python/libzypp_python.cc>:122383:52:
warning: 'GetResolvablesToInsDel' is deprecated (declared at
<http://river.suse.de/job/libzypp-bindings-HEAD/ws/checkout/swig/legacy/GetResolvablesToInsDel.h>:41)
[-Wdeprecated-declarations]
<http://river.suse.de/job/libzypp-bindings-HEAD/ws/build/swig/python/libzypp_python.cc>:122383:70:
warning: 'GetResolvablesToInsDel' is deprecated (declared at
<http://river.suse.de/job/libzypp-bindings-HEAD/ws/checkout/swig/legacy/GetResolvablesToInsDel.h>:41)
[-Wdeprecated-declarations]
<http://river.suse.de/job/libzypp-bindings-HEAD/ws/build/swig/python/libzypp_python.cc>:
In function 'PyObject* _wrap_new_GetResolvablesToInsDel__SWIG_1(PyObject*,
PyObject*)':
<http://river.suse.de/job/libzypp-bindings-HEAD/ws/build/swig/python/libzypp_python.cc>:122404:39:
warning: 'GetResolvablesToInsDel' is deprecated (declared at
<http://river.suse.de/job/libzypp-bindings-HEAD/ws/checkout/swig/legacy/GetResolvablesToInsDel.h>:41)
[-Wdeprecated-declarations]
<http://river.suse.de/job/libzypp-bindings-HEAD/ws/build/swig/python/libzypp_python.cc>:122422:52:
warning: 'GetResolvablesToInsDel' is deprecated (declared at
<http://river.suse.de/job/libzypp-bindings-HEAD/ws/checkout/swig/legacy/GetResolvablesToInsDel.h>:41)
[-Wdeprecated-declarations]
<http://river.suse.de/job/libzypp-bindings-HEAD/ws/build/swig/python/libzypp_python.cc>:122422:70:
warning: 'GetResolvablesToInsDel' is deprecated (declared at
<http://river.suse.de/job/libzypp-bindings-HEAD/ws/checkout/swig/legacy/GetResolvablesToInsDel.h>:41)
[-Wdeprecated-declarations]
<http://river.suse.de/job/libzypp-bindings-HEAD/ws/build/swig/python/libzypp_python.cc>:
In function 'PyObject* _wrap_GetResolvablesToInsDel__toDelete_set(PyObject*,
PyObject*)':
<http://river.suse.de/job/libzypp-bindings-HEAD/ws/build/swig/python/libzypp_python.cc>:122481:39:
warning: 'GetResolvablesToInsDel' is deprecated (declared at
<http://river.suse.de/job/libzypp-bindings-HEAD/ws/checkout/swig/legacy/GetResolvablesToInsDel.h>:41)
[-Wdeprecated-declarations]
<http://river.suse.de/job/libzypp-bindings-HEAD/ws/build/swig/python/libzypp_python.cc>:122481:82:
warning: 'GetResolvablesToInsDel' is deprecated (declared at
<http://river.suse.de/job/libzypp-bindings-HEAD/ws/checkout/swig/legacy/GetResolvablesToInsDel.h>:41)
[-Wdeprecated-declarations]
<http://river.suse.de/job/libzypp-bindings-HEAD/ws/build/swig/python/libzypp_python.cc>:122495:63:
warning: 'GetResolvablesToInsDel' is deprecated (declared at
<http://river.suse.de/job/libzypp-bindings-HEAD/ws/checkout/swig/legacy/GetResolvablesToInsDel.h>:41)
[-Wdeprecated-declarations]
<http://river.suse.de/job/libzypp-bindings-HEAD/ws/build/swig/python/libzypp_python.cc>:
In function 'PyObject* _wrap_GetResolvablesToInsDel__toDelete_get(PyObject*,
PyObject*)':
<http://river.suse.de/job/libzypp-bindings-HEAD/ws/build/swig/python/libzypp_python.cc>:122511:39:
warning: 'GetResolvablesToInsDel' is deprecated (declared at
<http://river.suse.de/job/libzypp-bindings-HEAD/ws/checkout/swig/legacy/GetResolvablesToInsDel.h>:41)
[-Wdeprecated-declarations]
<http://river.suse.de/job/libzypp-bindings-HEAD/ws/build/swig/python/libzypp_python.cc>:122511:82:
warning: 'GetResolvablesToInsDel' is deprecated (declared at
<http://river.suse.de/job/libzypp-bindings-HEAD/ws/checkout/swig/legacy/GetResolvablesToInsDel.h>:41)
[-Wdeprecated-declarations]
<http://river.suse.de/job/libzypp-bindings-HEAD/ws/build/swig/python/libzypp_python.cc>:122522:63:
warning: 'GetResolvablesToInsDel' is deprecated (declared at
<http://river.suse.de/job/libzypp-bindings-HEAD/ws/checkout/swig/legacy/GetResolvablesToInsDel.h>:41)
[-Wdeprecated-declarations]
<http://river.suse.de/job/libzypp-bindings-HEAD/ws/build/swig/python/libzypp_python.cc>:
In function 'PyObject* _wrap_GetResolvablesToInsDel__toInstall_set(PyObject*,
PyObject*)':
<http://river.suse.de/job/libzypp-bindings-HEAD/ws/build/swig/python/libzypp_python.cc>:122533:39:
warning: 'GetResolvablesToInsDel' is deprecated (declared at
<http://river.suse.de/job/libzypp-bindings-HEAD/ws/checkout/swig/legacy/GetResolvablesToInsDel.h>:41)
[-Wdeprecated-declarations]
<http://river.suse.de/job/libzypp-bindings-HEAD/ws/build/swig/python/libzypp_python.cc>:122533:82:
warning: 'GetResolvablesToInsDel' is deprecated (declared at
<http://river.suse.de/job/libzypp-bindings-HEAD/ws/checkout/swig/legacy/GetResolvablesToInsDel.h>:41)
[-Wdeprecated-declarations]
<http://river.suse.de/job/libzypp-bindings-HEAD/ws/build/swig/python/libzypp_python.cc>:122547:63:
warning: 'GetResolvablesToInsDel' is deprecated (declared at
<http://river.suse.de/job/libzypp-bindings-HEAD/ws/checkout/swig/legacy/GetResolvablesToInsDel.h>:41)
[-Wdeprecated-declarations]
<http://river.suse.de/job/libzypp-bindings-HEAD/ws/build/swig/python/libzypp_python.cc>:
In function 'PyObject* _wrap_GetResolvablesToInsDel__toInstall_get(PyObject*,
PyObject*)':
<http://river.suse.de/job/libzypp-bindings-HEAD/ws/build/swig/python/libzypp_python.cc>:122563:39:
warning: 'GetResolvablesToInsDel' is deprecated (declared at
<http://river.suse.de/job/libzypp-bindings-HEAD/ws/checkout/swig/legacy/GetResolvablesToInsDel.h>:41)
[-Wdeprecated-declarations]
<http://river.suse.de/job/libzypp-bindings-HEAD/ws/build/swig/python/libzypp_python.cc>:122563:82:
warning: 'GetResolvablesToInsDel' is deprecated (declared at
<http://river.suse.de/job/libzypp-bindings-HEAD/ws/checkout/swig/legacy/GetResolvablesToInsDel.h>:41)
[-Wdeprecated-declarations]
<http://river.suse.de/job/libzypp-bindings-HEAD/ws/build/swig/python/libzypp_python.cc>:122574:63:
warning: 'GetResolvablesToInsDel' is deprecated (declared at
<http://river.suse.de/job/libzypp-bindings-HEAD/ws/checkout/swig/legacy/GetResolvablesToInsDel.h>:41)
[-Wdeprecated-declarations]
<http://river.suse.de/job/libzypp-bindings-HEAD/ws/build/swig/python/libzypp_python.cc>:
In function 'PyObject*
_wrap_GetResolvablesToInsDel__toSrcinstall_set(PyObject*, PyObject*)':
<http://river.suse.de/job/libzypp-bindings-HEAD/ws/build/swig/python/libzypp_python.cc>:122585:39:
warning: 'GetResolvablesToInsDel' is deprecated (declared at
<http://river.suse.de/job/libzypp-bindings-HEAD/ws/checkout/swig/legacy/GetResolvablesToInsDel.h>:41)
[-Wdeprecated-declarations]
<http://river.suse.de/job/libzypp-bindings-HEAD/ws/build/swig/python/libzypp_python.cc>:122585:82:
warning: 'GetResolvablesToInsDel' is deprecated (declared at
<http://river.suse.de/job/libzypp-bindings-HEAD/ws/checkout/swig/legacy/GetResolvablesToInsDel.h>:41)
[-Wdeprecated-declarations]
<http://river.suse.de/job/libzypp-bindings-HEAD/ws/build/swig/python/libzypp_python.cc>:122599:63:
warning: 'GetResolvablesToInsDel' is deprecated (declared at
<http://river.suse.de/job/libzypp-bindings-HEAD/ws/checkout/swig/legacy/GetResolvablesToInsDel.h>:41)
[-Wdeprecated-declarations]
<http://river.suse.de/job/libzypp-bindings-HEAD/ws/build/swig/python/libzypp_python.cc>:
In function 'PyObject*
_wrap_GetResolvablesToInsDel__toSrcinstall_get(PyObject*, PyObject*)':
<http://river.suse.de/job/libzypp-bindings-HEAD/ws/build/swig/python/libzypp_python.cc>:122615:39:
warning: 'GetResolvablesToInsDel' is deprecated (declared at
<http://river.suse.de/job/libzypp-bindings-HEAD/ws/checkout/swig/legacy/GetResolvablesToInsDel.h>:41)
[-Wdeprecated-declarations]
<http://river.suse.de/job/libzypp-bindings-HEAD/ws/build/swig/python/libzypp_python.cc>:122615:82:
warning: 'GetResolvablesToInsDel' is deprecated (declared at
<http://river.suse.de/job/libzypp-bindings-HEAD/ws/checkout/swig/legacy/GetResolvablesToInsDel.h>:41)
[-Wdeprecated-declarations]
<http://river.suse.de/job/libzypp-bindings-HEAD/ws/build/swig/python/libzypp_python.cc>:122626:63:
warning: 'GetResolvablesToInsDel' is deprecated (declared at
<http://river.suse.de/job/libzypp-bindings-HEAD/ws/checkout/swig/legacy/GetResolvablesToInsDel.h>:41)
[-Wdeprecated-declarations]
<http://river.suse.de/job/libzypp-bindings-HEAD/ws/build/swig/python/libzypp_python.cc>:
In function 'PyObject* _wrap_delete_GetResolvablesToInsDel(PyObject*,
PyObject*)':
<http://river.suse.de/job/libzypp-bindings-HEAD/ws/build/swig/python/libzypp_python.cc>:122637:39:
warning: 'GetResolvablesToInsDel' is deprecated (declared at
<http://river.suse.de/job/libzypp-bindings-HEAD/ws/checkout/swig/legacy/GetResolvablesToInsDel.h>:41)
[-Wdeprecated-declarations]
<http://river.suse.de/job/libzypp-bindings-HEAD/ws/build/swig/python/libzypp_python.cc>:122637:82:
warning: 'GetResolvablesToInsDel' is deprecated (declared at
<http://river.suse.de/job/libzypp-bindings-HEAD/ws/checkout/swig/legacy/GetResolvablesToInsDel.h>:41)
[-Wdeprecated-declarations]
<http://river.suse.de/job/libzypp-bindings-HEAD/ws/build/swig/python/libzypp_python.cc>:122647:63:
warning: 'GetResolvablesToInsDel' is deprecated (declared at
<http://river.suse.de/job/libzypp-bindings-HEAD/ws/checkout/swig/legacy/GetResolvablesToInsDel.h>:41)
[-Wdeprecated-declarations]
<http://river.suse.de/job/libzypp-bindings-HEAD/ws/build/swig/python/libzypp_python.cc>:
At global scope:
<http://river.suse.de/job/libzypp-bindings-HEAD/ws/build/swig/python/libzypp_python.cc>:6425:18:
warning: 'PyObject* action_abort()' defined but not used [-Wunused-function]
<http://river.suse.de/job/libzypp-bindings-HEAD/ws/build/swig/python/libzypp_python.cc>:6438:18:
warning: 'PyObject* action_retry()' defined but not used [-Wunused-function]
<http://river.suse.de/job/libzypp-bindings-HEAD/ws/build/swig/python/libzypp_python.cc>:6451:18:
warning: 'PyObject* action_ignore()' defined but not used [-Wunused-function]
ICECC[2500] 14:40:03: Compiled on 10.160.4.3
swig/python/CMakeFiles/zypp_python.dir/build.make:63: recipe for target
'swig/python/CMakeFiles/zypp_python.dir/libzypp_python.cc.o' failed
make[2]: *** [swig/python/CMakeFiles/zypp_python.dir/libzypp_python.cc.o] Error
1
CMakeFiles/Makefile2:258: recipe for target
'swig/python/CMakeFiles/zypp_python.dir/all' failed
make[1]: *** [swig/python/CMakeFiles/zypp_python.dir/all] Error 2
Makefile:147: recipe for target 'all' failed
make: *** [all] Error 2
Build step 'Execute shell' marked build as failure
Archiving artifacts

--
To unsubscribe, e-mail: zypp-commit+unsubscribe@xxxxxxxxxxxx
For additional commands, e-mail: zypp-commit+help@xxxxxxxxxxxx

< Previous Next >
This Thread
Follow Ups