Mailinglist Archive: zypp-commit (14 mails)

< Previous Next >
[zypp-commit] Build failed in Jenkins: libzypp-HEAD #2127
  • From: hudson@xxxxxxx
  • Date: Mon, 9 Feb 2015 16:11:46 +0100 (CET)
  • Message-id: <1101943771.1464.1423494706367.JavaMail.jenkins@river>
See <http://river.suse.de/job/libzypp-HEAD/2127/changes>

Changes:

[Michael Andres] New base/TypeTraits.h

[Michael Andres] New base::ValueTransform/ContainerTransform

[Michael Andres] Don't execute scripts in /tmp or /var/tmp, they could be
mounted noexec (bnc#915928)

[Michael Andres] changes 14.36.0 (30)

------------------------------------------
[...truncated 66 lines...]
/home/hudson/workspace/libzypp-HEAD
++ pushd <http://river.suse.de/job/libzypp-HEAD/ws/>
~/hudson/workspace/libzypp-HEAD /home/hudson/workspace/libzypp-HEAD
++ export ICECREAM_BIN=/opt/icecream/bin
++ ICECREAM_BIN=/opt/icecream/bin
++ test -d /usr/lib/icecc/bin
++ ICECREAM_BIN=/usr/lib/icecc/bin
++ export ICECREAM=-DCMAKE_CXX_COMPILER=/usr/lib/icecc/bin/g++
++ ICECREAM=-DCMAKE_CXX_COMPILER=/usr/lib/icecc/bin/g++
++ export CXX=/usr/lib/icecc/bin/g++
++ CXX=/usr/lib/icecc/bin/g++
++ export 'MAKECMD=make -j 10'
++ MAKECMD='make -j 10'
++ export MAKEBIN=make
++ MAKEBIN=make
++ export
PATH=/usr/lib/icecc/bin:/sbin:/usr/sbin:/usr/local/sbin:/root/bin:/usr/local/bin:/usr/bin:/bin:/usr/games
++
PATH=/usr/lib/icecc/bin:/sbin:/usr/sbin:/usr/local/sbin:/root/bin:/usr/local/bin:/usr/bin:/bin:/usr/games
++ popd
/home/hudson/workspace/libzypp-HEAD
++ export CHECKOUTDIR=<http://river.suse.de/job/libzypp-HEAD/ws/checkout>
++ CHECKOUTDIR=<http://river.suse.de/job/libzypp-HEAD/ws/checkout>
++ export BUILDDIR=<http://river.suse.de/job/libzypp-HEAD/ws/build>
++ BUILDDIR=<http://river.suse.de/job/libzypp-HEAD/ws/build>
++ export PACKAGEDIR=<http://river.suse.de/job/libzypp-HEAD/ws/build/package>
++ PACKAGEDIR=<http://river.suse.de/job/libzypp-HEAD/ws/build/package>
++ export
ARTIFACTS=<http://river.suse.de/job/libzypp-HEAD/2127/artifact/.artifacts>
++ ARTIFACTS=<http://river.suse.de/job/libzypp-HEAD/2127/artifact/.artifacts>
++ export OBSDIR=<http://river.suse.de/job/libzypp-HEAD/ws/OBS>
++ OBSDIR=<http://river.suse.de/job/libzypp-HEAD/ws/OBS>
++ export RPMTOPDIR=<http://river.suse.de/job/libzypp-HEAD/ws/rpm>
++ RPMTOPDIR=<http://river.suse.de/job/libzypp-HEAD/ws/rpm>
++ export RPMOUT=<http://river.suse.de/job/libzypp-HEAD/ws/rpm/rpms>
++ RPMOUT=<http://river.suse.de/job/libzypp-HEAD/ws/rpm/rpms>
++ export RPMBUILDDIR=<http://river.suse.de/job/libzypp-HEAD/ws/rpm/rpmbuild>
++ RPMBUILDDIR=<http://river.suse.de/job/libzypp-HEAD/ws/rpm/rpmbuild>
++ export
RPMBUILDROOT=<http://river.suse.de/job/libzypp-HEAD/ws/rpm/rpmbuildroot>
++ RPMBUILDROOT=<http://river.suse.de/job/libzypp-HEAD/ws/rpm/rpmbuildroot>
++ rm -rf <http://river.suse.de/job/libzypp-HEAD/ws/rpm/rpms>
++ rm -rf <http://river.suse.de/job/libzypp-HEAD/ws/rpm/rpmbuild>
++ rm -rf <http://river.suse.de/job/libzypp-HEAD/ws/rpm/rpmbuildroot>
++ rm -rf <http://river.suse.de/job/libzypp-HEAD/2127/artifact/.artifacts>
++ rm -rf <http://river.suse.de/job/libzypp-HEAD/ws/OBS>
++ rm -rf '<http://river.suse.de/job/libzypp-HEAD/ws/copy-to-slave*.dir'>
++ [[ '' == 1 ]]
++ mkdir -p <http://river.suse.de/job/libzypp-HEAD/ws/build>
++ mkdir -p <http://river.suse.de/job/libzypp-HEAD/ws/rpm>
++ mkdir -p <http://river.suse.de/job/libzypp-HEAD/ws/rpm/rpms>
++ mkdir -p <http://river.suse.de/job/libzypp-HEAD/ws/rpm/rpmbuild>
++ mkdir -p <http://river.suse.de/job/libzypp-HEAD/ws/rpm/rpmbuildroot>
++ mkdir -p <http://river.suse.de/job/libzypp-HEAD/2127/artifact/.artifacts>
++ mkdir -p <http://river.suse.de/job/libzypp-HEAD/ws/OBS>
++ cat
+ build_cmake
+ echo '==> Building'
==> Building
+ pushd <http://river.suse.de/job/libzypp-HEAD/ws/build>
~/hudson/workspace/libzypp-HEAD/build /home/hudson/workspace/libzypp-HEAD
+ cmake -DBUILDNAME=x86_64
-DSITE=host-44-0-0-74.openstack.local.p2.cloud.suse.de
-DCMAKE_INSTALL_PREFIX=/usr -DCMAKE_CXX_COMPILER=/usr/lib/icecc/bin/g++
<http://river.suse.de/job/libzypp-HEAD/ws/checkout>
-- Building for SUSE
-- Libraries will be installed in /usr/lib64
-- Header files will be installed in /usr/include
-- Config files will be installed in /etc
** Manual files will be installed in /usr/share/man
-- Writing spec file...
-- I hate you rpm-lint...!!!
CMake Warning at /usr/share/cmake/Modules/CPack.cmake:282 (message):
CPack.cmake has already been included!!
Call Stack (most recent call first):
CMakeLists.txt:82 (INCLUDE)


-- rpm found: includes in /usr/include, library in /usr/lib64/librpm.so
(suspect 4.x)
-- rpm found: use rpm-4.x interface.
-- Boost version: 1.54.0
-- Found the following Boost libraries:
-- program_options
-- thread
-- unit_test_framework
-- boost found: includes in /usr/include, library in /usr/lib64
-- Found Gettext:
-- Found LibSolv: /usr/include /usr/lib64/libsolv.so;/usr/lib64/libsolvext.so
-- Could NOT find Udev (missing: UDEV_LIBRARY UDEV_INCLUDE_DIR USABLE_UDEV)
-- hal not found
CMake Warning at CMakeLists.txt:169 (MESSAGE):
No udev or HAL. CD device detection will be poor


-- checking for one of the modules 'libproxy-1.0'
-- libproxy not found
-- doxygen found: /usr/bin/doxygen
-- soname: 1430.6.0
-- version: 14.36.0
-- Writing pkg-config file...
-- FindZypp.cmake will be installed in /usr/share/cmake/Modules
-- zypp.conf will be installed in /etc/zypp
-- systemCheck will be installed in /etc/zypp
-- zsync not found
dot not found: you should install graphviz.
-- Translation set: zypp-po.tar.bz2
-- Translations:
sk.po;sl.po;el.po;tr.po;ja.po;ru.po;es.po;km.po;th.po;wa.po;en_GB.po;lt.po;be.po;ko.po;hr.po;sr.po;hi.po;en_US.po;mk.po;ku.po;af.po;ta.po;fi.po;pl.po;uk.po;vi.po;cy.po;bn.po;zh_TW.po;id.po;de.po;sv.po;eo.po;zu.po;si.po;zh_CN.po;da.po;nb.po;hu.po;et.po;cs.po;ar.po;mr.po;gu.po;ka.po;ca.po;nl.po;lo.po;he.po;gl.po;fr.po;eu.po;pa.po;tg.po;it.po;ro.po;nds.po;xh.po;nn.po;bg.po;fa.po;pt_BR.po;bs.po;pt.po;
-- Configuring done
-- Generating done
-- Build files have been written to:
<http://river.suse.de/job/libzypp-HEAD/ws/build>
+ make -j 10
Scanning dependencies of target mongoose
[ 0%] Building C object vendor/mongoose/CMakeFiles/mongoose.dir/mongoose.c.o
Scanning dependencies of target man
[ 1%] Built target man
Scanning dependencies of target zypp
[ 1%] [ 1%] [ 3%] [ 3%] [ 3%] [ 3%] [ 4%] [ 4%] [ 4%] Building CXX
object zypp/CMakeFiles/zypp.dir/pool/PoolStats.cc.o
Building CXX object zypp/CMakeFiles/zypp.dir/parser/xml/Node.cc.o
Building CXX object zypp/CMakeFiles/zypp.dir/misc/DefaultLoadSystem.cc.o
Building CXX object zypp/CMakeFiles/zypp.dir/parser/susetags/RepoIndex.cc.o
Building CXX object zypp/CMakeFiles/zypp.dir/misc/CheckAccessDeleted.cc.o
Building CXX object
zypp/CMakeFiles/zypp.dir/parser/susetags/ContentFileReader.cc.o
Building CXX object zypp/CMakeFiles/zypp.dir/pool/PoolImpl.cc.o
Building CXX object zypp/CMakeFiles/zypp.dir/parser/xml/ParseDef.cc.o
Building CXX object zypp/CMakeFiles/zypp.dir/parser/xml/ParseDefConsume.cc.o
Linking C static library libmongoose.a
[ 4%] Built target mongoose
[ 6%] Building CXX object
zypp/CMakeFiles/zypp.dir/parser/xml/ParseDefException.cc.o
[ 6%] Building CXX object zypp/CMakeFiles/zypp.dir/parser/xml/Reader.cc.o
[ 6%] Building CXX object zypp/CMakeFiles/zypp.dir/parser/xml/XmlEscape.cc.o
[ 6%] Building CXX object zypp/CMakeFiles/zypp.dir/parser/xml/XmlString.cc.o
[ 6%] [ 6%] [ 8%] Building CXX object
zypp/CMakeFiles/zypp.dir/parser/yum/PatchesFileReader.cc.o
Building CXX object zypp/CMakeFiles/zypp.dir/parser/yum/RepomdFileReader.cc.o
Building CXX object zypp/CMakeFiles/zypp.dir/parser/xml/libxmlfwd.cc.o
[ 8%] Building CXX object
zypp/CMakeFiles/zypp.dir/parser/ws/WebpinResultFileReader.cc.o
In file included from
<http://river.suse.de/job/libzypp-HEAD/ws/checkout/zypp/misc/DefaultLoadSystem.cc>:20:0:
<http://river.suse.de/job/libzypp-HEAD/ws/checkout/zypp/zypp_detail/ZYppReadOnlyHack.h>:15:2:
warning: #warning ZYPP_ZYPP_DETAIL_ZYPPREADONLYHACK_H [-Wcpp]
#warning ZYPP_ZYPP_DETAIL_ZYPPREADONLYHACK_H
^
[ 9%] Building CXX object zypp/CMakeFiles/zypp.dir/parser/ParseException.cc.o
[ 9%] Building CXX object zypp/CMakeFiles/zypp.dir/parser/IniParser.cc.o
[ 9%] [ 9%] Building CXX object zypp/CMakeFiles/zypp.dir/parser/IniDict.cc.o
Building CXX object zypp/CMakeFiles/zypp.dir/parser/HistoryLogReader.cc.o
[ 11%] Building CXX object zypp/CMakeFiles/zypp.dir/parser/RepoFileReader.cc.o
<http://river.suse.de/job/libzypp-HEAD/ws/checkout/zypp/misc/DefaultLoadSystem.cc>:
In function 'void zypp::misc::defaultLoadSystem(const
zypp::filesystem::Pathname&, zypp::misc::LoadSystemFlags)':
<http://river.suse.de/job/libzypp-HEAD/ws/checkout/zypp/misc/DefaultLoadSystem.cc>:48:29:
warning: 'void zypp::zypp_readonly_hack::IWantIt()' is deprecated (declared at
<http://river.suse.de/job/libzypp-HEAD/ws/checkout/zypp/zypp_detail/ZYppReadOnlyHack.h>:26)
[-Wdeprecated-declarations]
<http://river.suse.de/job/libzypp-HEAD/ws/checkout/zypp/misc/DefaultLoadSystem.cc>:48:38:
warning: 'void zypp::zypp_readonly_hack::IWantIt()' is deprecated (declared at
<http://river.suse.de/job/libzypp-HEAD/ws/checkout/zypp/zypp_detail/ZYppReadOnlyHack.h>:26)
[-Wdeprecated-declarations]
[ 11%] Building CXX object
zypp/CMakeFiles/zypp.dir/parser/RepoindexFileReader.cc.o
[ 11%] [ 11%] Building CXX object
zypp/CMakeFiles/zypp.dir/parser/ProductFileReader.cc.o
Building CXX object zypp/CMakeFiles/zypp.dir/parser/ServiceFileReader.cc.o
[ 13%] Building CXX object
zypp/CMakeFiles/zypp.dir/media/proxyinfo/ProxyInfoSysconfig.cc.o
[ 13%] Building CXX object zypp/CMakeFiles/zypp.dir/media/MediaException.cc.o
[ 13%] Building CXX object zypp/CMakeFiles/zypp.dir/media/MediaAccess.cc.o
[ 13%] Building CXX object zypp/CMakeFiles/zypp.dir/media/MediaHandler.cc.o
[ 14%] Building CXX object zypp/CMakeFiles/zypp.dir/media/Mount.cc.o
[ 14%] Building CXX object zypp/CMakeFiles/zypp.dir/media/MediaNFS.cc.o
[ 14%] Building CXX object zypp/CMakeFiles/zypp.dir/media/MediaCD.cc.o
[ 14%] Building CXX object zypp/CMakeFiles/zypp.dir/media/MediaDIR.cc.o
[ 16%] Building CXX object zypp/CMakeFiles/zypp.dir/media/MediaDISK.cc.o
[ 16%] Building CXX object zypp/CMakeFiles/zypp.dir/media/MediaCIFS.cc.o
[ 16%] Building CXX object zypp/CMakeFiles/zypp.dir/media/ProxyInfo.cc.o
[ 16%] Building CXX object zypp/CMakeFiles/zypp.dir/media/MediaCurl.cc.o
[ 18%] Building CXX object zypp/CMakeFiles/zypp.dir/media/MediaMultiCurl.cc.o
[ 18%] [ 18%] Building CXX object zypp/CMakeFiles/zypp.dir/media/MediaISO.cc.o
Building CXX object zypp/CMakeFiles/zypp.dir/media/MediaPlugin.cc.o
[ 18%] Building CXX object zypp/CMakeFiles/zypp.dir/media/MediaSource.cc.o
[ 19%] Building CXX object zypp/CMakeFiles/zypp.dir/media/MediaManager.cc.o
[ 19%] Building CXX object zypp/CMakeFiles/zypp.dir/media/MediaUserAuth.cc.o
[ 19%] Building CXX object
zypp/CMakeFiles/zypp.dir/media/CredentialFileReader.cc.o
[ 19%] Building CXX object zypp/CMakeFiles/zypp.dir/media/CredentialManager.cc.o
[ 21%] Building CXX object zypp/CMakeFiles/zypp.dir/media/CurlConfig.cc.o
[ 21%] Building CXX object zypp/CMakeFiles/zypp.dir/media/TransferSettings.cc.o
[ 21%] Building CXX object zypp/CMakeFiles/zypp.dir/media/MediaPriority.cc.o
[ 21%] Building CXX object zypp/CMakeFiles/zypp.dir/media/MetaLinkParser.cc.o
[ 22%] Building CXX object zypp/CMakeFiles/zypp.dir/media/ZsyncParser.cc.o
[ 22%] Building CXX object zypp/CMakeFiles/zypp.dir/media/MediaBlockList.cc.o
[ 22%] Building CXX object zypp/CMakeFiles/zypp.dir/media/UrlResolverPlugin.cc.o
[ 22%] Building CXX object zypp/CMakeFiles/zypp.dir/url/UrlUtils.cc.o
[ 24%] Building CXX object zypp/CMakeFiles/zypp.dir/url/UrlBase.cc.o
[ 24%] [ 24%] Building CXX object
zypp/CMakeFiles/zypp.dir/repo/RepoException.cc.o
Building CXX object zypp/CMakeFiles/zypp.dir/repo/RepoMirrorList.cc.o
[ 24%] Building CXX object zypp/CMakeFiles/zypp.dir/repo/RepoType.cc.o
[ 26%] Building CXX object zypp/CMakeFiles/zypp.dir/repo/ServiceType.cc.o
[ 26%] Building CXX object zypp/CMakeFiles/zypp.dir/repo/PackageProvider.cc.o
[ 26%] Building CXX object zypp/CMakeFiles/zypp.dir/repo/SrcPackageProvider.cc.o
[ 26%] Building CXX object zypp/CMakeFiles/zypp.dir/repo/RepoProvideFile.cc.o
[ 26%] Building CXX object zypp/CMakeFiles/zypp.dir/repo/DeltaCandidates.cc.o
[ 27%] Building CXX object zypp/CMakeFiles/zypp.dir/repo/Applydeltarpm.cc.o
[ 27%] Building CXX object zypp/CMakeFiles/zypp.dir/repo/PackageDelta.cc.o
[ 27%] Building CXX object zypp/CMakeFiles/zypp.dir/repo/SUSEMediaVerifier.cc.o
[ 27%] Building CXX object
zypp/CMakeFiles/zypp.dir/repo/MediaInfoDownloader.cc.o
[ 29%] Building CXX object zypp/CMakeFiles/zypp.dir/repo/Downloader.cc.o
[ 29%] Building CXX object zypp/CMakeFiles/zypp.dir/repo/RepoVariables.cc.o
[ 29%] Building CXX object zypp/CMakeFiles/zypp.dir/repo/RepoInfoBase.cc.o
[ 29%] Building CXX object zypp/CMakeFiles/zypp.dir/repo/PluginServices.cc.o
[ 31%] Building CXX object zypp/CMakeFiles/zypp.dir/repo/ServiceRepos.cc.o
[ 31%] Building CXX object zypp/CMakeFiles/zypp.dir/repo/yum/Downloader.cc.o
<http://river.suse.de/job/libzypp-HEAD/ws/checkout/zypp/repo/SUSEMediaVerifier.cc>:58:2:
warning: #warning check the stream status [-Wcpp]
#warning check the stream status
^
[ 31%] Building CXX object zypp/CMakeFiles/zypp.dir/repo/yum/ResourceType.cc.o
[ 31%] Building CXX object
zypp/CMakeFiles/zypp.dir/repo/susetags/Downloader.cc.o
[ 32%] Building CXX object zypp/CMakeFiles/zypp.dir/target/rpm/BinHeader.cc.o
[ 32%] Building CXX object zypp/CMakeFiles/zypp.dir/target/rpm/RpmCallbacks.cc.o
[ 32%] Building CXX object zypp/CMakeFiles/zypp.dir/target/rpm/RpmDb.cc.o
[ 32%] Building CXX object zypp/CMakeFiles/zypp.dir/target/rpm/RpmException.cc.o
[ 34%] Building CXX object zypp/CMakeFiles/zypp.dir/target/rpm/RpmHeader.cc.o
[ 34%] Building CXX object zypp/CMakeFiles/zypp.dir/target/rpm/librpmDb.cc.o
[ 34%] Building CXX object zypp/CMakeFiles/zypp.dir/target/rpm/librpmDb.cv3.cc.o
[ 34%] Building CXX object
zypp/CMakeFiles/zypp.dir/target/modalias/Modalias.cc.o
[ 36%] Building CXX object
zypp/CMakeFiles/zypp.dir/target/RpmPostTransCollector.cc.o
[ 36%] Building CXX object
zypp/CMakeFiles/zypp.dir/target/RequestedLocalesFile.cc.o
[ 36%] Building CXX object zypp/CMakeFiles/zypp.dir/target/SolvIdentFile.cc.o
[ 36%] Building CXX object zypp/CMakeFiles/zypp.dir/target/HardLocksFile.cc.o
<http://river.suse.de/job/libzypp-HEAD/ws/checkout/zypp/target/rpm/RpmDb.cc>:246:2:
warning: #warning Check for obsolete memebers [-Wcpp]
#warning Check for obsolete memebers
^
<http://river.suse.de/job/libzypp-HEAD/ws/checkout/zypp/target/rpm/RpmDb.cc>:414:2:
warning: #warning CHECK: notify root about conversion backup. [-Wcpp]
#warning CHECK: notify root about conversion backup.
^
<http://river.suse.de/job/libzypp-HEAD/ws/checkout/zypp/target/rpm/RpmDb.cc>:670:2:
warning: #warning CHECK: compare vs existing v3 backup. notify root [-Wcpp]
#warning CHECK: compare vs existing v3 backup. notify root
^
[ 37%] Building CXX object
zypp/CMakeFiles/zypp.dir/target/CommitPackageCache.cc.o
[ 37%] Building CXX object
zypp/CMakeFiles/zypp.dir/target/CommitPackageCacheImpl.cc.o
<http://river.suse.de/job/libzypp-HEAD/ws/checkout/zypp/target/rpm/RpmHeader.cc>:396:2:
warning: #warning CHECK IF FILE REQUIRES HANDLING IS OBSOLETE [-Wcpp]
#warning CHECK IF FILE REQUIRES HANDLING IS OBSOLETE
^
<http://river.suse.de/job/libzypp-HEAD/ws/checkout/zypp/target/rpm/librpmDb.cc>:681:2:
warning: #warning TESTCASE: rpmdbAppendIterator and (non)sequential access?
[-Wcpp]
#warning TESTCASE: rpmdbAppendIterator and (non)sequential access?
^
<http://river.suse.de/job/libzypp-HEAD/ws/checkout/zypp/target/rpm/librpmDb.cc>:700:2:
warning: #warning TESTCASE: rpmdbGetIteratorCount returns 0 on sequential
access? [-Wcpp]
#warning TESTCASE: rpmdbGetIteratorCount returns 0 on sequential access?
^
[ 37%] Building CXX object
zypp/CMakeFiles/zypp.dir/target/CommitPackageCacheReadAhead.cc.o
[ 37%] Building CXX object
zypp/CMakeFiles/zypp.dir/target/TargetCallbackReceiver.cc.o
[ 39%] Building CXX object zypp/CMakeFiles/zypp.dir/target/TargetException.cc.o
[ 39%] Building CXX object zypp/CMakeFiles/zypp.dir/target/TargetImpl.cc.o
[ 39%] Building CXX object
zypp/CMakeFiles/zypp.dir/target/TargetImpl.commitFindFileConflicts.cc.o
<http://river.suse.de/job/libzypp-HEAD/ws/checkout/zypp/target/RpmPostTransCollector.cc>:
In member function 'void
zypp::target::RpmPostTransCollector::Impl::executeScripts()':
<http://river.suse.de/job/libzypp-HEAD/ws/checkout/zypp/target/RpmPostTransCollector.cc>:84:30:
error: 'ZConfig' has not been declared
<http://river.suse.de/job/libzypp-HEAD/ws/checkout/zypp/target/RpmPostTransCollector.cc>:
In member function 'zypp::filesystem::Pathname
zypp::target::RpmPostTransCollector::Impl::tmpDir()':
<http://river.suse.de/job/libzypp-HEAD/ws/checkout/zypp/target/RpmPostTransCollector.cc>:152:73:
error: 'ZConfig' has not been declared
ICECC[24833] 16:11:31: Compiled on 10.161.8.93
zypp/CMakeFiles/zypp.dir/build.make:1940: recipe for target
'zypp/CMakeFiles/zypp.dir/target/RpmPostTransCollector.cc.o' failed
make[2]: *** [zypp/CMakeFiles/zypp.dir/target/RpmPostTransCollector.cc.o] Error
1
make[2]: *** Waiting for unfinished jobs....
<http://river.suse.de/job/libzypp-HEAD/ws/checkout/zypp/target/TargetImpl.cc>:1563:2:
warning: #warning Exception handling [-Wcpp]
#warning Exception handling
^
CMakeFiles/Makefile2:1036: recipe for target 'zypp/CMakeFiles/zypp.dir/all'
failed
make[1]: *** [zypp/CMakeFiles/zypp.dir/all] Error 2
Makefile:147: recipe for target 'all' failed
make: *** [all] Error 2
Build step 'Execute shell' marked build as failure
Archiving artifacts
--
To unsubscribe, e-mail: zypp-commit+unsubscribe@xxxxxxxxxxxx
For additional commands, e-mail: zypp-commit+help@xxxxxxxxxxxx

< Previous Next >
List Navigation
This Thread
Follow Ups