Mailinglist Archive: zypp-commit (54 mails)

< Previous Next >
[zypp-commit] Build failed in Jenkins: zypper-HEAD #1315
  • From: hudson@xxxxxxx
  • Date: Fri, 11 Jul 2014 13:02:14 +0200 (CEST)
  • Message-id: <572330096.125.1405076534281.JavaMail.jenkins@river>
See <http://river.suse.de/job/zypper-HEAD/1315/changes>

Changes:

[Michael Andres] Add global option plus-content

[Michael Andres] Add symlink yzpper -> zypper (bnc#885655)

[Michael Andres] Add Out::info() for stream output.

[Michael Andres] Update repo details output

[Michael Andres] Enable --plus-content option (FATE#316287)

[Michael Andres] Update BuildRequires

[Michael Andres] changes 1.11.9

------------------------------------------
Started by an SCM change
Building remotely on node-zyppHEAD in workspace
<http://river.suse.de/job/zypper-HEAD/ws/>
Checkout:zypper-HEAD / <http://river.suse.de/job/zypper-HEAD/ws/> -
hudson.remoting.Channel@2afd2c69:node-zyppHEAD
Using strategy: Default
Last Built Revision: Revision f07ffc6db952a7c1520a995aef18bcd002d34274
(origin/master)
Checkout:checkout / <http://river.suse.de/job/zypper-HEAD/ws/checkout> -
hudson.remoting.LocalChannel@2f5787e1
Fetching changes from the remote Git repository
Fetching upstream changes from git://github.com/openSUSE/zypper.git
Commencing build of Revision 56157e12056ad9ff47937a369c1c89f524488002
(origin/master)
Checking out Revision 56157e12056ad9ff47937a369c1c89f524488002 (origin/master)
[copy-to-slave] Copying '.hudson-scripts/**', excluding nothing, from
'file:/var/lib/jenkins/userContent/' on the master to
'<http://river.suse.de/job/zypper-HEAD/ws/'> on 'node-zyppHEAD'.
[zypper-HEAD] $ /bin/sh -xe /tmp/hudson2432405758504926978.sh
+ echo '### BUILD ###'
### BUILD ###
+ echo '==> Reading build configuration'
==> Reading build configuration
+ . .hudson-scripts/base-functions
++ . .hudson-scripts/ascii_art
++ trap 'error_exit $?' ERR
++ echo 'Job running as user: root'
Job running as user: root
+++ date '+%F %T'
++ echo 'Started at: 2014-07-11 13:01:39'
Started at: 2014-07-11 13:01:39
+++ hostname --fqdn
++ export SITENAME=host-44-0-0-74.openstack.local.p2.cloud.suse.de
++ SITENAME=host-44-0-0-74.openstack.local.p2.cloud.suse.de
++ export TARGET_DIST=HEAD
++ TARGET_DIST=HEAD
++ export PROJECT=zypper
++ PROJECT=zypper
+ . .hudson-scripts/build-functions
+ . .hudson-scripts/obs-functions
++ trap 'error_exit $?' ERR
++ export ALLOW_OBS_SUBMIT=yes
++ ALLOW_OBS_SUBMIT=yes
+ . .hudson-scripts/setup-buildenvironment
++ export RUNTESTS=1
++ RUNTESTS=1
++ export ICEJOBS=4
++ ICEJOBS=4
++ export CMAKE_INSTALL_PREFIX=/usr
++ CMAKE_INSTALL_PREFIX=/usr
+++ uname -m
+++ hostname -f
++ export 'CMAKEPARAS=-DBUILDNAME=x86_64
-DSITE=host-44-0-0-74.openstack.local.p2.cloud.suse.de
-DCMAKE_INSTALL_PREFIX=/usr'
++ CMAKEPARAS='-DBUILDNAME=x86_64
-DSITE=host-44-0-0-74.openstack.local.p2.cloud.suse.de
-DCMAKE_INSTALL_PREFIX=/usr'
++ export ICECCDIR=<http://river.suse.de/job/zypper-HEAD/ws/ICECC>
++ ICECCDIR=<http://river.suse.de/job/zypper-HEAD/ws/ICECC>
++ echo 'Configuring cmake for Icecream ...'
Configuring cmake for Icecream ...
++ rm -rf <http://river.suse.de/job/zypper-HEAD/ws/ICECC>
++ mkdir -p <http://river.suse.de/job/zypper-HEAD/ws/ICECC>
++ pushd <http://river.suse.de/job/zypper-HEAD/ws/ICECC>
~/hudson/workspace/zypper-HEAD/ICECC /home/hudson/workspace/zypper-HEAD
+++ sed -e 's/creating //'
+++ tail -1
+++ grep .tar.gz
+++ icecc --build-native
++ export ICECC_ENV=e89eb1c2234f3be340be71430b0f53e5.tar.gz
++ ICECC_ENV=e89eb1c2234f3be340be71430b0f53e5.tar.gz
++ export ICECC_ENV=e89eb1c2234f3be340be71430b0f53e5.tar.gz
++ ICECC_ENV=e89eb1c2234f3be340be71430b0f53e5.tar.gz
++ export
ICECC_VERSION=<http://river.suse.de/job/zypper-HEAD/ws/ICECC/e89eb1c2234f3be340be71430b0f53e5.tar.gz>
++
ICECC_VERSION=<http://river.suse.de/job/zypper-HEAD/ws/ICECC/e89eb1c2234f3be340be71430b0f53e5.tar.gz>
++ popd
/home/hudson/workspace/zypper-HEAD
++ pushd <http://river.suse.de/job/zypper-HEAD/ws/>
~/hudson/workspace/zypper-HEAD /home/hudson/workspace/zypper-HEAD
++ export ICECREAM_BIN=/opt/icecream/bin
++ ICECREAM_BIN=/opt/icecream/bin
++ test -d /usr/lib/icecc/bin
++ ICECREAM_BIN=/usr/lib/icecc/bin
++ export ICECREAM=-DCMAKE_CXX_COMPILER=/usr/lib/icecc/bin/g++
++ ICECREAM=-DCMAKE_CXX_COMPILER=/usr/lib/icecc/bin/g++
++ export CXX=/usr/lib/icecc/bin/g++
++ CXX=/usr/lib/icecc/bin/g++
++ export 'MAKECMD=make -j 4'
++ MAKECMD='make -j 4'
++ export MAKEBIN=make
++ MAKEBIN=make
++ export
PATH=/usr/lib/icecc/bin:/usr/lib64/mpi/gcc/openmpi/bin:/sbin:/usr/sbin:/usr/local/sbin:/root/bin:/usr/local/bin:/usr/bin:/bin:/usr/X11R6/bin:/usr/games
++
PATH=/usr/lib/icecc/bin:/usr/lib64/mpi/gcc/openmpi/bin:/sbin:/usr/sbin:/usr/local/sbin:/root/bin:/usr/local/bin:/usr/bin:/bin:/usr/X11R6/bin:/usr/games
++ popd
/home/hudson/workspace/zypper-HEAD
++ export CHECKOUTDIR=<http://river.suse.de/job/zypper-HEAD/ws/checkout>
++ CHECKOUTDIR=<http://river.suse.de/job/zypper-HEAD/ws/checkout>
++ export BUILDDIR=<http://river.suse.de/job/zypper-HEAD/ws/build>
++ BUILDDIR=<http://river.suse.de/job/zypper-HEAD/ws/build>
++ export PACKAGEDIR=<http://river.suse.de/job/zypper-HEAD/ws/build/package>
++ PACKAGEDIR=<http://river.suse.de/job/zypper-HEAD/ws/build/package>
++ export
ARTIFACTS=<http://river.suse.de/job/zypper-HEAD/1315/artifact/.artifacts>
++ ARTIFACTS=<http://river.suse.de/job/zypper-HEAD/1315/artifact/.artifacts>
++ export OBSDIR=<http://river.suse.de/job/zypper-HEAD/ws/OBS>
++ OBSDIR=<http://river.suse.de/job/zypper-HEAD/ws/OBS>
++ export RPMTOPDIR=<http://river.suse.de/job/zypper-HEAD/ws/rpm>
++ RPMTOPDIR=<http://river.suse.de/job/zypper-HEAD/ws/rpm>
++ export RPMOUT=<http://river.suse.de/job/zypper-HEAD/ws/rpm/rpms>
++ RPMOUT=<http://river.suse.de/job/zypper-HEAD/ws/rpm/rpms>
++ export RPMBUILDDIR=<http://river.suse.de/job/zypper-HEAD/ws/rpm/rpmbuild>
++ RPMBUILDDIR=<http://river.suse.de/job/zypper-HEAD/ws/rpm/rpmbuild>
++ export
RPMBUILDROOT=<http://river.suse.de/job/zypper-HEAD/ws/rpm/rpmbuildroot>
++ RPMBUILDROOT=<http://river.suse.de/job/zypper-HEAD/ws/rpm/rpmbuildroot>
++ rm -rf <http://river.suse.de/job/zypper-HEAD/ws/rpm/rpms>
++ rm -rf <http://river.suse.de/job/zypper-HEAD/ws/rpm/rpmbuild>
++ rm -rf <http://river.suse.de/job/zypper-HEAD/ws/rpm/rpmbuildroot>
++ rm -rf <http://river.suse.de/job/zypper-HEAD/1315/artifact/.artifacts>
++ rm -rf <http://river.suse.de/job/zypper-HEAD/ws/OBS>
++ rm -rf '<http://river.suse.de/job/zypper-HEAD/ws/copy-to-slave*.dir'>
++ [[ '' == 1 ]]
++ rm -rf <http://river.suse.de/job/zypper-HEAD/ws/build>
++ mkdir -p <http://river.suse.de/job/zypper-HEAD/ws/build>
++ mkdir -p <http://river.suse.de/job/zypper-HEAD/ws/rpm>
++ mkdir -p <http://river.suse.de/job/zypper-HEAD/ws/rpm/rpms>
++ mkdir -p <http://river.suse.de/job/zypper-HEAD/ws/rpm/rpmbuild>
++ mkdir -p <http://river.suse.de/job/zypper-HEAD/ws/rpm/rpmbuildroot>
++ mkdir -p <http://river.suse.de/job/zypper-HEAD/1315/artifact/.artifacts>
++ mkdir -p <http://river.suse.de/job/zypper-HEAD/ws/OBS>
++ cat
+ build_cmake
+ echo '==> Building'
==> Building
+ pushd <http://river.suse.de/job/zypper-HEAD/ws/build>
~/hudson/workspace/zypper-HEAD/build /home/hudson/workspace/zypper-HEAD
+ cmake -DBUILDNAME=x86_64
-DSITE=host-44-0-0-74.openstack.local.p2.cloud.suse.de
-DCMAKE_INSTALL_PREFIX=/usr -DCMAKE_CXX_COMPILER=/usr/lib/icecc/bin/g++
<http://river.suse.de/job/zypper-HEAD/ws/checkout>
-- The C compiler identification is GNU 4.8.1
-- The CXX compiler identification is GNU 4.8.1
-- Check for working C compiler: /usr/lib/icecc/bin/cc
-- Check for working C compiler: /usr/lib/icecc/bin/cc -- works
-- Detecting C compiler ABI info
-- Detecting C compiler ABI info - done
-- Check for working CXX compiler: /usr/lib/icecc/bin/g++
-- Check for working CXX compiler: /usr/lib/icecc/bin/g++ -- works
-- Detecting CXX compiler ABI info
-- Detecting CXX compiler ABI info - done
-- Libraries will be installed in /usr/lib64
-- Config files will be installed in /etc
** Manual files will be installed in /usr/share/man
-- Writing spec file...
-- I hate you rpm-lint...!!!
-- ZYpp path not set. Looking for it.
-- ZYpp found: includes in /usr/include, library in /usr/lib64/libzypp.so
-- readline found: includes in /usr/include, library in
/usr/lib64/libreadline.so
-- augeas found: includes in /usr/include, library in /usr/lib64/libaugeas.so
-- Found LibXml2: /usr/lib64/libxml2.so (found version "2.9.1")
** Locale dir is /usr/share/locale
** ZYpper binary will be installed in /usr/bin
-- Translation set: zypper-po.tar.bz2
-- Translations:
ja.po;ru.po;es.po;en_GB.po;ko.po;en_US.po;fi.po;pl.po;zh_TW.po;de.po;sv.po;zh_CN.po;da.po;nb.po;hu.po;cs.po;ar.po;nl.po;fr.po;it.po;pt_BR.po;pt.po;
-- Configuring done
-- Generating done
-- Build files have been written to:
<http://river.suse.de/job/zypper-HEAD/ws/build>
+ make -j 4
Scanning dependencies of target zypp-refresh
Scanning dependencies of target translations
[ 1%] [ 3%] Building CXX object
src/CMakeFiles/zypp-refresh.dir/zypp-refresh.cc.o
Generating ja.po, ru.po, es.po, en_GB.po, ko.po, en_US.po, fi.po, pl.po,
zh_TW.po, de.po, sv.po, zh_CN.po, da.po, nb.po, hu.po, cs.po, ar.po, nl.po,
fr.po, it.po, pt_BR.po, pt.po
Scanning dependencies of target zypper_lib
[ 5%] [ 7%] Building CXX object src/CMakeFiles/zypper_lib.dir/Zypper.cc.o
Building CXX object src/CMakeFiles/zypper_lib.dir/Command.cc.o
[ 8%] Generating ja.gmo
[ 10%] Generating ru.gmo
[ 12%] Generating es.gmo
[ 14%] Generating en_GB.gmo
[ 16%] Generating ko.gmo
[ 17%] Generating en_US.gmo
[ 19%] Generating fi.gmo
[ 21%] Generating pl.gmo
[ 23%] Generating zh_TW.gmo
[ 25%] Generating de.gmo
[ 26%] Generating sv.gmo
[ 28%] Generating zh_CN.gmo
[ 30%] Generating da.gmo
[ 32%] Generating nb.gmo
[ 33%] Generating hu.gmo
[ 35%] Generating cs.gmo
[ 37%] Generating ar.gmo
[ 39%] Generating nl.gmo
[ 41%] Generating fr.gmo
[ 42%] Generating it.gmo
[ 44%] Generating pt_BR.gmo
[ 46%] Generating pt.gmo
[ 46%] Built target translations
[ 48%] Building CXX object src/CMakeFiles/zypper_lib.dir/Config.cc.o
Linking CXX executable zypp-refresh
[ 48%] Built target zypp-refresh
[ 50%] Building CXX object src/CMakeFiles/zypper_lib.dir/repos.cc.o
[ 51%] Building CXX object src/CMakeFiles/zypper_lib.dir/misc.cc.o
In file included from
<http://river.suse.de/job/zypper-HEAD/ws/checkout/src/Zypper.cc>:26:0:
/usr/include/zypp/zypp_detail/ZYppReadOnlyHack.h:15:2: warning: #warning
ZYPP_ZYPP_DETAIL_ZYPPREADONLYHACK_H [-Wcpp]
#warning ZYPP_ZYPP_DETAIL_ZYPPREADONLYHACK_H
^
[ 53%] Building CXX object src/CMakeFiles/zypper_lib.dir/search.cc.o
<http://river.suse.de/job/zypper-HEAD/ws/checkout/src/repos.cc>: In function
'void do_init_repos(Zypper&, const Container&)':
<http://river.suse.de/job/zypper-HEAD/ws/checkout/src/repos.cc>:671:17: error:
'class zypp::RepoInfo' has no member named 'hasContentAny'
<http://river.suse.de/job/zypper-HEAD/ws/checkout/src/repos.cc>:671:75: error:
'class zypp::RepoInfo' has no member named 'hasContent'
<http://river.suse.de/job/zypper-HEAD/ws/checkout/src/repos.cc>:772:17: error:
'class zypp::RepoInfo' has no member named 'hasContentAny'
ICECC[17488] 13:02:07: Compiled on 10.121.8.48
make[2]: *** [src/CMakeFiles/zypper_lib.dir/repos.cc.o] Error 1
make[2]: *** Waiting for unfinished jobs....
<http://river.suse.de/job/zypper-HEAD/ws/checkout/src/Zypper.cc>: In member
function 'void Zypper::doCommand()':
<http://river.suse.de/job/zypper-HEAD/ws/checkout/src/Zypper.cc>:2805:24:
warning: 'void zypp::zypp_readonly_hack::IWantIt()' is deprecated (declared at
/usr/include/zypp/zypp_detail/ZYppReadOnlyHack.h:26) [-Wdeprecated-declarations]
<http://river.suse.de/job/zypper-HEAD/ws/checkout/src/Zypper.cc>:2805:33:
warning: 'void zypp::zypp_readonly_hack::IWantIt()' is deprecated (declared at
/usr/include/zypp/zypp_detail/ZYppReadOnlyHack.h:26) [-Wdeprecated-declarations]
<http://river.suse.de/job/zypper-HEAD/ws/checkout/src/Zypper.cc>:2810:24:
warning: 'void zypp::zypp_readonly_hack::IWantIt()' is deprecated (declared at
/usr/include/zypp/zypp_detail/ZYppReadOnlyHack.h:26) [-Wdeprecated-declarations]
<http://river.suse.de/job/zypper-HEAD/ws/checkout/src/Zypper.cc>:2810:33:
warning: 'void zypp::zypp_readonly_hack::IWantIt()' is deprecated (declared at
/usr/include/zypp/zypp_detail/ZYppReadOnlyHack.h:26) [-Wdeprecated-declarations]
make[1]: *** [src/CMakeFiles/zypper_lib.dir/all] Error 2
make: *** [all] Error 2
Build step 'Execute shell' marked build as failure
Archiving artifacts
--
To unsubscribe, e-mail: zypp-commit+unsubscribe@xxxxxxxxxxxx
For additional commands, e-mail: zypp-commit+help@xxxxxxxxxxxx

< Previous Next >
This Thread
Follow Ups