Mailinglist Archive: zypp-commit (54 mails)

< Previous Next >
[zypp-commit] Build failed in Jenkins: dialogsolver-HEAD #1168
  • From: hudson@xxxxxxx
  • Date: Tue, 1 Jul 2014 10:28:10 +0200 (CEST)
  • Message-id: <212916233.133.1404203290550.JavaMail.jenkins@river>
See <http://river.suse.de/job/dialogsolver-HEAD/1168/>

------------------------------------------
[...truncated 1743 lines...]
/usr/include/zypp/base/Flags.h:81:9: note: C++11 'constexpr' only available
with -std=c++11 or -std=gnu++11
/usr/include/zypp/base/Flags.h:82:9: error: 'constexpr' does not name a type
/usr/include/zypp/base/Flags.h:82:9: note: C++11 'constexpr' only available
with -std=c++11 or -std=gnu++11
/usr/include/zypp/base/Flags.h:84:9: error: 'constexpr' does not name a type
/usr/include/zypp/base/Flags.h:84:9: note: C++11 'constexpr' only available
with -std=c++11 or -std=gnu++11
/usr/include/zypp/base/Flags.h:85:9: error: 'constexpr' does not name a type
/usr/include/zypp/base/Flags.h:85:9: note: C++11 'constexpr' only available
with -std=c++11 or -std=gnu++11
/usr/include/zypp/base/Flags.h:87:9: error: 'constexpr' does not name a type
/usr/include/zypp/base/Flags.h:87:9: note: C++11 'constexpr' only available
with -std=c++11 or -std=gnu++11
/usr/include/zypp/base/Flags.h:88:9: error: 'constexpr' does not name a type
/usr/include/zypp/base/Flags.h:88:9: note: C++11 'constexpr' only available
with -std=c++11 or -std=gnu++11
/usr/include/zypp/base/Flags.h:90:9: error: 'constexpr' does not name a type
/usr/include/zypp/base/Flags.h:90:9: note: C++11 'constexpr' only available
with -std=c++11 or -std=gnu++11
/usr/include/zypp/base/Flags.h:106:9: error: 'Integral' does not name a type
/usr/include/zypp/base/Flags.h: In member function 'zypp::base::Flags<_Enum>&
zypp::base::Flags<_Enum>::operator&=(zypp::base::Flags<_Enum>)':
/usr/include/zypp/base/Flags.h:69:43: error: '_val' was not declared in this
scope
/usr/include/zypp/base/Flags.h: In member function 'zypp::base::Flags<_Enum>&
zypp::base::Flags<_Enum>::operator&=(zypp::base::Flags<_Enum>::Enum)':
/usr/include/zypp/base/Flags.h:70:42: error: '_val' was not declared in this
scope
/usr/include/zypp/base/Flags.h: In member function 'zypp::base::Flags<_Enum>&
zypp::base::Flags<_Enum>::operator|=(zypp::base::Flags<_Enum>)':
/usr/include/zypp/base/Flags.h:72:43: error: '_val' was not declared in this
scope
/usr/include/zypp/base/Flags.h: In member function 'zypp::base::Flags<_Enum>&
zypp::base::Flags<_Enum>::operator|=(zypp::base::Flags<_Enum>::Enum)':
/usr/include/zypp/base/Flags.h:73:42: error: '_val' was not declared in this
scope
/usr/include/zypp/base/Flags.h: In member function 'zypp::base::Flags<_Enum>&
zypp::base::Flags<_Enum>::operator^=(zypp::base::Flags<_Enum>)':
/usr/include/zypp/base/Flags.h:75:43: error: '_val' was not declared in this
scope
/usr/include/zypp/base/Flags.h: In member function 'zypp::base::Flags<_Enum>&
zypp::base::Flags<_Enum>::operator^=(zypp::base::Flags<_Enum>::Enum)':
/usr/include/zypp/base/Flags.h:76:42: error: '_val' was not declared in this
scope
/usr/include/zypp/base/Flags.h: In member function 'zypp::base::Flags<_Enum>&
zypp::base::Flags<_Enum>::setFlag(zypp::base::Flags<_Enum>)':
/usr/include/zypp/base/Flags.h:96:43: error: '_val' was not declared in this
scope
/usr/include/zypp/base/Flags.h: In member function 'zypp::base::Flags<_Enum>&
zypp::base::Flags<_Enum>::setFlag(zypp::base::Flags<_Enum>::Enum)':
/usr/include/zypp/base/Flags.h:97:42: error: '_val' was not declared in this
scope
/usr/include/zypp/base/Flags.h: In member function 'zypp::base::Flags<_Enum>&
zypp::base::Flags<_Enum>::unsetFlag(zypp::base::Flags<_Enum>)':
/usr/include/zypp/base/Flags.h:99:45: error: '_val' was not declared in this
scope
/usr/include/zypp/base/Flags.h: In member function 'zypp::base::Flags<_Enum>&
zypp::base::Flags<_Enum>::unsetFlag(zypp::base::Flags<_Enum>::Enum)':
/usr/include/zypp/base/Flags.h:100:44: error: '_val' was not declared in this
scope
/usr/include/zypp/base/Flags.h: In member function 'bool
zypp::base::Flags<_Enum>::testFlag(zypp::base::Flags<_Enum>) const':
/usr/include/zypp/base/Flags.h:102:56: error: '_val' was not declared in this
scope
/usr/include/zypp/base/Flags.h: In member function 'bool
zypp::base::Flags<_Enum>::testFlag(zypp::base::Flags<_Enum>::Enum) const':
/usr/include/zypp/base/Flags.h:103:55: error: '_val' was not declared in this
scope
In file included from /usr/include/zypp/CpeId.h:20:0,
from /usr/include/zypp/Repository.h:22,
from /usr/include/zypp/ResObject.h:23,
from /usr/include/zypp/PoolItem.h:19,
from /usr/include/zypp/pool/PoolTraits.h:23,
from /usr/include/zypp/ResPool.h:20,
from /usr/include/zypp/solver/detail/Resolver.h:33,
from
<http://river.suse.de/job/dialogsolver-HEAD/ws/checkout/src/QZyppSolverDialog.h>:5,
from
<http://river.suse.de/job/dialogsolver-HEAD/ws/checkout/src/resgraphview.cpp>:20:
/usr/include/zypp/base/SetRelationMixin.h: At global scope:
/usr/include/zypp/base/SetRelationMixin.h:171:42: error: expected ',' or '...'
before '&&' token
/usr/include/zypp/base/SetRelationMixin.h:171:49: error: invalid constructor;
you probably meant 'zypp::base::SetRelationMixin<Derived> (const
zypp::base::SetRelationMixin<Derived>&)'
/usr/include/zypp/base/SetRelationMixin.h:171:105: error: expected ',' or '...'
before '&&' token
/usr/include/zypp/base/SetRelationMixin.h: In instantiation of 'class
zypp::base::SetRelationMixin<zypp::CpeId>':
/usr/include/zypp/CpeId.h:31:30: required from here
/usr/include/zypp/base/SetRelationMixin.h:171:77: error: defaulted declaration
'zypp::base::SetRelationMixin<Derived>&
zypp::base::SetRelationMixin<Derived>::operator=(zypp::base::SetRelationMixin<Derived>)
[with Derived = zypp::CpeId; zypp::base::SetRelationMixin<Derived> =
zypp::base::SetRelationMixin<zypp::CpeId>]'
/usr/include/zypp/base/SetRelationMixin.h:171:77: error: does not match
expected signature 'zypp::base::SetRelationMixin<zypp::CpeId>&
zypp::base::SetRelationMixin<zypp::CpeId>::operator=(zypp::base::SetRelationMixin<zypp::CpeId>&)'
In file included from /usr/include/zypp/Repository.h:22:0,
from /usr/include/zypp/ResObject.h:23,
from /usr/include/zypp/PoolItem.h:19,
from /usr/include/zypp/pool/PoolTraits.h:23,
from /usr/include/zypp/ResPool.h:20,
from /usr/include/zypp/solver/detail/Resolver.h:33,
from
<http://river.suse.de/job/dialogsolver-HEAD/ws/checkout/src/QZyppSolverDialog.h>:5,
from
<http://river.suse.de/job/dialogsolver-HEAD/ws/checkout/src/resgraphview.cpp>:20:
/usr/include/zypp/CpeId.h:53:14: error: 'constexpr' does not name a type
/usr/include/zypp/CpeId.h:53:14: note: C++11 'constexpr' only available with
-std=c++11 or -std=gnu++11
/usr/include/zypp/CpeId.h:62:12: error: 'constexpr' does not name a type
/usr/include/zypp/CpeId.h:62:12: note: C++11 'constexpr' only available with
-std=c++11 or -std=gnu++11
In file included from /usr/include/zypp/CpeId.h:20:0,
from /usr/include/zypp/Repository.h:22,
from /usr/include/zypp/ResObject.h:23,
from /usr/include/zypp/PoolItem.h:19,
from /usr/include/zypp/pool/PoolTraits.h:23,
from /usr/include/zypp/ResPool.h:20,
from /usr/include/zypp/solver/detail/Resolver.h:33,
from
<http://river.suse.de/job/dialogsolver-HEAD/ws/checkout/src/QZyppSolverDialog.h>:5,
from
<http://river.suse.de/job/dialogsolver-HEAD/ws/checkout/src/resgraphview.cpp>:20:
/usr/include/zypp/base/SetRelationMixin.h: In instantiation of 'class
zypp::base::SetRelationMixin<zypp::CpeId::Value>':
/usr/include/zypp/CpeId.h:158:37: required from here
/usr/include/zypp/base/SetRelationMixin.h:171:77: error: defaulted declaration
'zypp::base::SetRelationMixin<Derived>&
zypp::base::SetRelationMixin<Derived>::operator=(zypp::base::SetRelationMixin<Derived>)
[with Derived = zypp::CpeId::Value; zypp::base::SetRelationMixin<Derived> =
zypp::base::SetRelationMixin<zypp::CpeId::Value>]'
/usr/include/zypp/base/SetRelationMixin.h:171:77: error: does not match
expected signature 'zypp::base::SetRelationMixin<zypp::CpeId::Value>&
zypp::base::SetRelationMixin<zypp::CpeId::Value>::operator=(zypp::base::SetRelationMixin<zypp::CpeId::Value>&)'
In file included from /usr/include/zypp/Repository.h:22:0,
from /usr/include/zypp/ResObject.h:23,
from /usr/include/zypp/PoolItem.h:19,
from /usr/include/zypp/pool/PoolTraits.h:23,
from /usr/include/zypp/ResPool.h:20,
from /usr/include/zypp/solver/detail/Resolver.h:33,
from
<http://river.suse.de/job/dialogsolver-HEAD/ws/checkout/src/QZyppSolverDialog.h>:5,
from
<http://river.suse.de/job/dialogsolver-HEAD/ws/checkout/src/resgraphview.cpp>:20:
/usr/include/zypp/CpeId.h:171:12: error: 'constexpr' does not name a type
/usr/include/zypp/CpeId.h:171:12: note: C++11 'constexpr' only available with
-std=c++11 or -std=gnu++11
/usr/include/zypp/CpeId.h:176:12: error: 'constexpr' does not name a type
/usr/include/zypp/CpeId.h:176:12: note: C++11 'constexpr' only available with
-std=c++11 or -std=gnu++11
In file included from /usr/include/zypp/ZConfig.h:29:0,
from /usr/include/zypp/ZYpp.h:22,
from /usr/include/zypp/ZYppFactory.h:18,
from
<http://river.suse.de/job/dialogsolver-HEAD/ws/checkout/src/resgraphview.cpp>:43:
/usr/include/zypp/target/rpm/RpmFlags.h:54:67: error: 'constexpr' does not name
a type
/usr/include/zypp/target/rpm/RpmFlags.h:54:67: note: C++11 'constexpr' only
available with -std=c++11 or -std=gnu++11
In file included from /usr/include/zypp/ZConfig.h:29:0,
from /usr/include/zypp/ZYpp.h:22,
from /usr/include/zypp/ZYppFactory.h:18,
from
<http://river.suse.de/job/dialogsolver-HEAD/ws/checkout/src/resgraphview.cpp>:43:
/usr/include/zypp/target/rpm/RpmFlags.h:54:195: error: 'constexpr' does not
name a type
/usr/include/zypp/target/rpm/RpmFlags.h:54:195: note: C++11 'constexpr' only
available with -std=c++11 or -std=gnu++11
/usr/include/zypp/target/rpm/RpmFlags.h:54:301: error: 'constexpr' does not
name a type
/usr/include/zypp/target/rpm/RpmFlags.h:54:301: note: C++11 'constexpr' only
available with -std=c++11 or -std=gnu++11
/usr/include/zypp/target/rpm/RpmFlags.h:54:429: error: 'constexpr' does not
name a type
/usr/include/zypp/target/rpm/RpmFlags.h:54:429: note: C++11 'constexpr' only
available with -std=c++11 or -std=gnu++11
/usr/include/zypp/target/rpm/RpmFlags.h:54:535: error: 'constexpr' does not
name a type
/usr/include/zypp/target/rpm/RpmFlags.h:54:535: note: C++11 'constexpr' only
available with -std=c++11 or -std=gnu++11
/usr/include/zypp/target/rpm/RpmFlags.h:54:663: error: 'constexpr' does not
name a type
/usr/include/zypp/target/rpm/RpmFlags.h:54:663: note: C++11 'constexpr' only
available with -std=c++11 or -std=gnu++11
/usr/include/zypp/target/rpm/RpmFlags.h:54:769: error: 'constexpr' does not
name a type
/usr/include/zypp/target/rpm/RpmFlags.h:54:769: note: C++11 'constexpr' only
available with -std=c++11 or -std=gnu++11
In file included from /usr/include/zypp/ZYppCommitResult.h:20:0,
from /usr/include/zypp/ZYppCommit.h:18,
from /usr/include/zypp/ZYpp.h:25,
from /usr/include/zypp/ZYppFactory.h:18,
from
<http://river.suse.de/job/dialogsolver-HEAD/ws/checkout/src/resgraphview.cpp>:43:
/usr/include/zypp/sat/Transaction.h:86:15: error: 'constexpr' does not name a
type
/usr/include/zypp/sat/Transaction.h:86:15: note: C++11 'constexpr' only
available with -std=c++11 or -std=gnu++11
In file included from /usr/include/zypp/ZYppCommitResult.h:20:0,
from /usr/include/zypp/ZYppCommit.h:18,
from /usr/include/zypp/ZYpp.h:25,
from /usr/include/zypp/ZYppFactory.h:18,
from
<http://river.suse.de/job/dialogsolver-HEAD/ws/checkout/src/resgraphview.cpp>:43:
/usr/include/zypp/sat/Transaction.h:194:12: error: 'constexpr' does not name a
type
/usr/include/zypp/sat/Transaction.h:194:12: note: C++11 'constexpr' only
available with -std=c++11 or -std=gnu++11
In file included from /usr/include/zypp/ZYppCommitResult.h:20:0,
from /usr/include/zypp/ZYppCommit.h:18,
from /usr/include/zypp/ZYpp.h:25,
from /usr/include/zypp/ZYppFactory.h:18,
from
<http://river.suse.de/job/dialogsolver-HEAD/ws/checkout/src/resgraphview.cpp>:43:
/usr/include/zypp/sat/Transaction.h:194:184: error: 'constexpr' does not name a
type
/usr/include/zypp/sat/Transaction.h:194:184: note: C++11 'constexpr' only
available with -std=c++11 or -std=gnu++11
/usr/include/zypp/sat/Transaction.h:194:323: error: 'constexpr' does not name a
type
/usr/include/zypp/sat/Transaction.h:194:323: note: C++11 'constexpr' only
available with -std=c++11 or -std=gnu++11
/usr/include/zypp/sat/Transaction.h:194:495: error: 'constexpr' does not name a
type
/usr/include/zypp/sat/Transaction.h:194:495: note: C++11 'constexpr' only
available with -std=c++11 or -std=gnu++11
/usr/include/zypp/sat/Transaction.h:194:634: error: 'constexpr' does not name a
type
/usr/include/zypp/sat/Transaction.h:194:634: note: C++11 'constexpr' only
available with -std=c++11 or -std=gnu++11
/usr/include/zypp/sat/Transaction.h:194:806: error: 'constexpr' does not name a
type
/usr/include/zypp/sat/Transaction.h:194:806: note: C++11 'constexpr' only
available with -std=c++11 or -std=gnu++11
/usr/include/zypp/sat/Transaction.h:194:945: error: 'constexpr' does not name a
type
/usr/include/zypp/sat/Transaction.h:194:945: note: C++11 'constexpr' only
available with -std=c++11 or -std=gnu++11
In file included from /usr/include/zypp/ZYppCommitResult.h:20:0,
from /usr/include/zypp/ZYppCommit.h:18,
from /usr/include/zypp/ZYpp.h:25,
from /usr/include/zypp/ZYppFactory.h:18,
from
<http://river.suse.de/job/dialogsolver-HEAD/ws/checkout/src/resgraphview.cpp>:43:
/usr/include/zypp/sat/Transaction.h: In member function 'bool
zypp::sat::Transaction::FilterAction::operator()(const
zypp::sat::Transaction::Step&) const':
/usr/include/zypp/sat/Transaction.h:376:9: error: no match for 'operator!'
(operand type is 'const StepStages {aka const
zypp::base::Flags<zypp::sat::Transaction::StepStage>}')
/usr/include/zypp/sat/Transaction.h:376:9: note: candidate is:
/usr/include/zypp/sat/Transaction.h:376:9: note: operator!(bool) <built-in>
/usr/include/zypp/sat/Transaction.h:376:9: note: no known conversion for
argument 1 from 'const StepStages {aka const
zypp::base::Flags<zypp::sat::Transaction::StepStage>}' to 'bool'
In file included from /usr/include/zypp/ZYppCommit.h:18:0,
from /usr/include/zypp/ZYpp.h:25,
from /usr/include/zypp/ZYppFactory.h:18,
from
<http://river.suse.de/job/dialogsolver-HEAD/ws/checkout/src/resgraphview.cpp>:43:
/usr/include/zypp/ZYppCommitResult.h: In member function 'bool
zypp::ZYppCommitResult::allDone() const':
/usr/include/zypp/ZYppCommitResult.h:159:67: error: no matching function for
call to 'zypp::sat::Transaction::actionEmpty(int) const'
/usr/include/zypp/ZYppCommitResult.h:159:67: note: candidate is:
In file included from /usr/include/zypp/ZYppCommitResult.h:20:0,
from /usr/include/zypp/ZYppCommit.h:18,
from /usr/include/zypp/ZYpp.h:25,
from /usr/include/zypp/ZYppFactory.h:18,
from
<http://river.suse.de/job/dialogsolver-HEAD/ws/checkout/src/resgraphview.cpp>:43:
/usr/include/zypp/sat/Transaction.h:388:17: note: bool
zypp::sat::Transaction::actionEmpty(zypp::sat::Transaction::StepStages) const
/usr/include/zypp/sat/Transaction.h:388:17: note: no known conversion for
argument 1 from 'int' to 'zypp::sat::Transaction::StepStages {aka
zypp::base::Flags<zypp::sat::Transaction::StepStage>}'
In file included from /usr/include/zypp/ZYppCommit.h:18:0,
from /usr/include/zypp/ZYpp.h:25,
from /usr/include/zypp/ZYppFactory.h:18,
from
<http://river.suse.de/job/dialogsolver-HEAD/ws/checkout/src/resgraphview.cpp>:43:
/usr/include/zypp/ZYppCommitResult.h: In member function 'bool
zypp::ZYppCommitResult::noError() const':
/usr/include/zypp/ZYppCommitResult.h:163:67: error: no matching function for
call to 'zypp::sat::Transaction::actionEmpty(zypp::sat::Transaction::StepStage)
const'
/usr/include/zypp/ZYppCommitResult.h:163:67: note: candidate is:
In file included from /usr/include/zypp/ZYppCommitResult.h:20:0,
from /usr/include/zypp/ZYppCommit.h:18,
from /usr/include/zypp/ZYpp.h:25,
from /usr/include/zypp/ZYppFactory.h:18,
from
<http://river.suse.de/job/dialogsolver-HEAD/ws/checkout/src/resgraphview.cpp>:43:
/usr/include/zypp/sat/Transaction.h:388:17: note: bool
zypp::sat::Transaction::actionEmpty(zypp::sat::Transaction::StepStages) const
/usr/include/zypp/sat/Transaction.h:388:17: note: no known conversion for
argument 1 from 'zypp::sat::Transaction::StepStage' to
'zypp::sat::Transaction::StepStages {aka
zypp::base::Flags<zypp::sat::Transaction::StepStage>}'
In file included from /usr/include/zypp/ZYpp.h:30:0,
from /usr/include/zypp/ZYppFactory.h:18,
from
<http://river.suse.de/job/dialogsolver-HEAD/ws/checkout/src/resgraphview.cpp>:43:
/usr/include/zypp/KeyRing.h: At global scope:
/usr/include/zypp/KeyRing.h:300:10: error: 'constexpr' does not name a type
/usr/include/zypp/KeyRing.h:300:10: note: C++11 'constexpr' only available with
-std=c++11 or -std=gnu++11
In file included from /usr/include/zypp/ZYpp.h:30:0,
from /usr/include/zypp/ZYppFactory.h:18,
from
<http://river.suse.de/job/dialogsolver-HEAD/ws/checkout/src/resgraphview.cpp>:43:
/usr/include/zypp/KeyRing.h:300:178: error: 'constexpr' does not name a type
/usr/include/zypp/KeyRing.h:300:178: note: C++11 'constexpr' only available
with -std=c++11 or -std=gnu++11
/usr/include/zypp/KeyRing.h:300:314: error: 'constexpr' does not name a type
/usr/include/zypp/KeyRing.h:300:314: note: C++11 'constexpr' only available
with -std=c++11 or -std=gnu++11
/usr/include/zypp/KeyRing.h:300:482: error: 'constexpr' does not name a type
/usr/include/zypp/KeyRing.h:300:482: note: C++11 'constexpr' only available
with -std=c++11 or -std=gnu++11
/usr/include/zypp/KeyRing.h:300:618: error: 'constexpr' does not name a type
/usr/include/zypp/KeyRing.h:300:618: note: C++11 'constexpr' only available
with -std=c++11 or -std=gnu++11
/usr/include/zypp/KeyRing.h:300:786: error: 'constexpr' does not name a type
/usr/include/zypp/KeyRing.h:300:786: note: C++11 'constexpr' only available
with -std=c++11 or -std=gnu++11
/usr/include/zypp/KeyRing.h:300:922: error: 'constexpr' does not name a type
/usr/include/zypp/KeyRing.h:300:922: note: C++11 'constexpr' only available
with -std=c++11 or -std=gnu++11
In file included from /usr/include/zypp/Bitmap.h:15:0,
from /usr/include/zypp/DiskUsageCounter.h:20,
from /usr/include/zypp/ZYpp.h:31,
from /usr/include/zypp/ZYppFactory.h:18,
from
<http://river.suse.de/job/dialogsolver-HEAD/ws/checkout/src/resgraphview.cpp>:43:
/usr/include/zypp/sat/Map.h:44:14: error: 'constexpr' does not name a type
/usr/include/zypp/sat/Map.h:44:14: note: C++11 'constexpr' only available with
-std=c++11 or -std=gnu++11
In file included from /usr/include/zypp/ZYpp.h:31:0,
from /usr/include/zypp/ZYppFactory.h:18,
from
<http://river.suse.de/job/dialogsolver-HEAD/ws/checkout/src/resgraphview.cpp>:43:
/usr/include/zypp/DiskUsageCounter.h: In member function
'zypp::DiskUsageCounter::MountPointSet
zypp::DiskUsageCounter::disk_usage(Iterator, Iterator) const':
/usr/include/zypp/DiskUsageCounter.h:142:22: error: 'poolSize' is not a member
of 'zypp::Bitmap {aka zypp::sat::Map}'
In file included from /usr/include/zypp/sat/detail/PoolMember.h:17:0,
from /usr/include/zypp/sat/Solvable.h:17,
from /usr/include/zypp/Resolvable.h:24,
from /usr/include/zypp/ResObject.h:17,
from /usr/include/zypp/PoolItem.h:19,
from /usr/include/zypp/pool/PoolTraits.h:23,
from /usr/include/zypp/ResPool.h:20,
from /usr/include/zypp/solver/detail/Resolver.h:33,
from
<http://river.suse.de/job/dialogsolver-HEAD/ws/checkout/src/QZyppSolverDialog.h>:5,
from
<http://river.suse.de/job/dialogsolver-HEAD/ws/checkout/src/resgraphview.cpp>:20:
/usr/include/zypp/base/String.h: In instantiation of 'std::string
zypp::str::join(_Iterator, _Iterator, const zypp::C_Str&) [with _Iterator =
boost::transform_iterator<std::const_mem_fun_ref_t<const
std::basic_string<char>&, zypp::Arch>,
std::_Rb_tree_const_iterator<zypp::Arch>, boost::use_default,
boost::use_default>; std::string = std::basic_string<char>]':
/usr/include/zypp/Arch.h:138:98: required from here
/usr/include/zypp/base/String.h:717:34: error: call of overloaded
'asString(const std::basic_string<char>&)' is ambiguous
/usr/include/zypp/base/String.h:717:34: note: candidates are:
In file included from /usr/include/zypp/sat/detail/PoolMember.h:17:0,
from /usr/include/zypp/sat/Solvable.h:17,
from /usr/include/zypp/Resolvable.h:24,
from /usr/include/zypp/ResObject.h:17,
from /usr/include/zypp/PoolItem.h:19,
from /usr/include/zypp/pool/PoolTraits.h:23,
from /usr/include/zypp/ResPool.h:20,
from /usr/include/zypp/solver/detail/Resolver.h:33,
from
<http://river.suse.de/job/dialogsolver-HEAD/ws/checkout/src/QZyppSolverDialog.h>:5,
from
<http://river.suse.de/job/dialogsolver-HEAD/ws/checkout/src/resgraphview.cpp>:20:
/usr/include/zypp/base/String.h:155:24: note: std::string
zypp::str::asString(const string&)
/usr/include/zypp/base/String.h:159:24: note: std::string
zypp::str::asString(std::string)
/usr/include/zypp/base/String.h:170:28: note: std::string
zypp::str::asString(const _T&) [with _T = std::basic_string<char>; std::string
= std::basic_string<char>]
ICECC[9231] 10:28:07: Compiled on 10.120.5.40
make[2]: *** [src/CMakeFiles/qdialogsolver.dir/resgraphview.o] Error 1
make[1]: *** [src/CMakeFiles/qdialogsolver.dir/all] Error 2
make: *** [all] Error 2
Build step 'Execute shell' marked build as failure
Archiving artifacts
--
To unsubscribe, e-mail: zypp-commit+unsubscribe@xxxxxxxxxxxx
For additional commands, e-mail: zypp-commit+help@xxxxxxxxxxxx

< Previous Next >
This Thread
Follow Ups