Mailinglist Archive: zypp-commit (17 mails)

< Previous Next >
[zypp-commit] Build failed in Jenkins: libzypp-HEAD #1935
  • From: hudson@xxxxxxx
  • Date: Thu, 3 Apr 2014 19:32:19 +0200 (CEST)
  • Message-id: <317416540.177.1396546339856.JavaMail.jenkins@river>
See <http://river.suse.de/job/libzypp-HEAD/1935/changes>

Changes:

[Michael Andres] String: adapt default args

[Michael Andres] CheckSum: support parsing from string and temp. istream

[Michael Andres] RepoStatus: Support computation for directory (PLAINDIR)

[Michael Andres] RepoManager: Fix RepoStatus computation and refresh of
PLAINDIR repos.

[Michael Andres] Drop unneeded parser/plaindir/* code

[Michael Andres] RepoStatus: Hide implementation details.

[Michael Andres] changes 14.17.2 (17)

------------------------------------------
[...truncated 490 lines...]
#warning immediately build LocaleSet as soon as Loale is an Id based type
^
[ 88%] Building CXX object zypp/CMakeFiles/zypp.dir/base/Fd.cc.o
[ 88%] Building CXX object zypp/CMakeFiles/zypp.dir/base/Gettext.cc.o
[ 88%] Building CXX object zypp/CMakeFiles/zypp.dir/base/GzStream.cc.o
<http://river.suse.de/job/libzypp-HEAD/ws/checkout/zypp/ZConfig.cc>:208:2:
warning: #warning HACK AROUND BOOST_TEST_CATCH_SYSTEM_ERRORS [-Wcpp]
#warning HACK AROUND BOOST_TEST_CATCH_SYSTEM_ERRORS
^
<http://river.suse.de/job/libzypp-HEAD/ws/checkout/zypp/ZConfig.cc>:731:2:
warning: #warning prefer signal [-Wcpp]
#warning prefer signal
^
[ 88%] Building CXX object zypp/CMakeFiles/zypp.dir/base/IOStream.cc.o
[ 89%] Building CXX object zypp/CMakeFiles/zypp.dir/base/InputStream.cc.o
[ 89%] Building CXX object zypp/CMakeFiles/zypp.dir/base/ReferenceCounted.cc.o
[ 89%] [ 91%] Building CXX object
zypp/CMakeFiles/zypp.dir/base/SetRelationMixin.cc.o
Building CXX object zypp/CMakeFiles/zypp.dir/base/String.cc.o
[ 91%] Building CXX object zypp/CMakeFiles/zypp.dir/base/StrMatcher.cc.o
[ 91%] Building CXX object zypp/CMakeFiles/zypp.dir/base/Regex.cc.o
[ 91%] Building CXX object zypp/CMakeFiles/zypp.dir/base/Unit.cc.o
[ 92%] Building CXX object zypp/CMakeFiles/zypp.dir/base/ExternalDataSource.cc.o
[ 92%] Building CXX object zypp/CMakeFiles/zypp.dir/base/Exception.cc.o
[ 92%] Building CXX object
zypp/CMakeFiles/zypp.dir/base/UserRequestException.cc.o
[ 94%] Building CXX object zypp/CMakeFiles/zypp.dir/base/Sysconfig.cc.o
[ 94%] Building CXX object zypp/CMakeFiles/zypp.dir/base/ProfilingFormater.cc.o
[ 94%] Building CXX object zypp/CMakeFiles/zypp.dir/base/LogControl.cc.o
Linking CXX shared library libzypp.so
[ 94%] Built target zypp
Scanning dependencies of target percent-encode
Scanning dependencies of target zypp-CheckAccessDeleted
Scanning dependencies of target ProvideSignedDirectory
Scanning dependencies of target COW_debug
[ 94%] [ 94%] [ 95%] [ 95%] Scanning dependencies of target DumpSelectable
Scanning dependencies of target ToolScanRepos
Building CXX object tools/CMakeFiles/percent-encode.dir/percent-encode.cc.o
Building CXX object
tools/CMakeFiles/zypp-CheckAccessDeleted.dir/zypp-CheckAccessDeleted.cc.o
Scanning dependencies of target patch_find_bug
Scanning dependencies of target zypp-NameReqPrv
Building CXX object examples/CMakeFiles/COW_debug.dir/COW_debug.cc.o
Building CXX object
tools/CMakeFiles/ProvideSignedDirectory.dir/ProvideSignedDirectory.cc.o
Scanning dependencies of target zypp-pubkey
Scanning dependencies of target zypp-list
[ 97%] [ 97%] [ 97%] Building CXX object
tools/CMakeFiles/ToolScanRepos.dir/ToolScanRepos.cc.o
[ 98%] Building CXX object
tools/CMakeFiles/patch_find_bug.dir/patch_find_bug.cc.o
[ 98%] Building CXX object
tools/CMakeFiles/DumpSelectable.dir/DumpSelectable.cc.o
[ 98%] Building CXX object
tools/CMakeFiles/zypp-NameReqPrv.dir/zypp-NameReqPrv.cc.o
Building CXX object tools/CMakeFiles/zypp-pubkey.dir/zypp-pubkey.cc.o
Building CXX object tools/CMakeFiles/zypp-list.dir/zypp-list.cc.o
In file included from
<http://river.suse.de/job/libzypp-HEAD/ws/checkout/examples/COW_debug.cc>:41:0:
<http://river.suse.de/job/libzypp-HEAD/ws/checkout/zypp/base/Debug.h>:13:2:
warning: #warning ZYPP_BASE_DEBUG_H included [-Wcpp]
#warning ZYPP_BASE_DEBUG_H included
^
Linking CXX executable percent-encode
Linking CXX executable zypp-CheckAccessDeleted
Linking CXX executable COW_debug
[ 98%] Built target percent-encode
Scanning dependencies of target EditionCompare
[ 98%] Building CXX object
examples/CMakeFiles/EditionCompare.dir/EditionCompare.cc.o
Linking CXX executable ProvideSignedDirectory
[ 98%] Built target zypp-CheckAccessDeleted
Scanning dependencies of target whatprovides
[100%] Building CXX object
examples/CMakeFiles/whatprovides.dir/whatprovides.cc.o
Linking CXX executable ToolScanRepos
Linking CXX executable patch_find_bug
Linking CXX executable DumpSelectable
Linking CXX executable zypp-NameReqPrv
[100%] Built target COW_debug
[100%] Built target ProvideSignedDirectory
Linking CXX executable zypp-list
[100%] Built target ToolScanRepos
[100%] Built target patch_find_bug
Linking CXX executable EditionCompare
[100%] Built target DumpSelectable
[100%] Built target zypp-NameReqPrv
[100%] Built target zypp-list
[100%] Built target EditionCompare
Linking CXX executable whatprovides
[100%] Built target whatprovides
Linking CXX executable zypp-pubkey
[100%] Built target zypp-pubkey
+ popd
/home/hudson/workspace/libzypp-HEAD
+ export BOOST_TEST_CATCH_SYSTEM_ERRORS=no
+ BOOST_TEST_CATCH_SYSTEM_ERRORS=no
+ build_and_run_cmake_tests
+ echo '==> Building and running tests'
==> Building and running tests
+ pushd <http://river.suse.de/job/libzypp-HEAD/ws/build>
~/hudson/workspace/libzypp-HEAD/build /home/hudson/workspace/libzypp-HEAD
+ '[' -e ./CTestTestfile.cmake ']'
+ '[' -e tests ']'
+ pushd tests
~/hudson/workspace/libzypp-HEAD/build/tests
~/hudson/workspace/libzypp-HEAD/build /home/hudson/workspace/libzypp-HEAD
+ make -j 10
[ 0%] Built target mongoose
[ 75%] Built target zypp
Scanning dependencies of target zypp_test_utils
[ 76%] Building CXX object
tests/lib/CMakeFiles/zypp_test_utils.dir/WebServer.cc.o
ICECC[27862] 19:30:58: no server found behind given hostname 10.122.166.22:10245
ICECC[27862] 19:30:58: got exception 2 (10.122.166.22)
Linking CXX static library libzypp_test_utils.a
[ 76%] Built target zypp_test_utils
Scanning dependencies of target CredentialFileReader_test
Scanning dependencies of target MetaLinkParser_test
Scanning dependencies of target Arch_test
Scanning dependencies of target CredentialManager_test
Scanning dependencies of target CpeId_test
Scanning dependencies of target Date_test
Scanning dependencies of target Digest_test
[ 76%] [ 77%] [ 77%] [ 78%] [ 78%] [ 78%] [ 78%] Building CXX object
tests/media/CMakeFiles/MetaLinkParser_test.dir/MetaLinkParser_test.cc.o
Building CXX object
tests/media/CMakeFiles/CredentialFileReader_test.dir/CredentialFileReader_test.cc.o
Scanning dependencies of target CheckSum_test
Scanning dependencies of target Deltarpm_test
Building CXX object tests/zypp/CMakeFiles/Arch_test.dir/Arch_test.cc.o
Building CXX object
tests/media/CMakeFiles/CredentialManager_test.dir/CredentialManager_test.cc.o
Scanning dependencies of target Capabilities_test
Building CXX object tests/zypp/CMakeFiles/CpeId_test.dir/CpeId_test.cc.o
Building CXX object tests/zypp/CMakeFiles/Date_test.dir/Date_test.cc.o
Building CXX object tests/zypp/CMakeFiles/Digest_test.dir/Digest_test.cc.o
[ 78%] [ 78%] [ 78%] Building CXX object
tests/zypp/CMakeFiles/Deltarpm_test.dir/Deltarpm_test.cc.o
Building CXX object
tests/zypp/CMakeFiles/Capabilities_test.dir/Capabilities_test.cc.o
Building CXX object tests/zypp/CMakeFiles/CheckSum_test.dir/CheckSum_test.cc.o
Linking CXX executable MetaLinkParser_test
Linking CXX executable Date_test
Linking CXX executable CredentialFileReader_test
Linking CXX executable Digest_test
Linking CXX executable CpeId_test
[ 78%] Built target MetaLinkParser_test
Scanning dependencies of target Dup_test
[ 79%] Building CXX object tests/zypp/CMakeFiles/Dup_test.dir/Dup_test.cc.o
Linking CXX executable Arch_test
Linking CXX executable CredentialManager_test
Linking CXX executable Deltarpm_test
[ 79%] Built target Date_test
Scanning dependencies of target Edition_test
[ 79%] Building CXX object
tests/zypp/CMakeFiles/Edition_test.dir/Edition_test.cc.o
[ 79%] Built target CredentialFileReader_test
Scanning dependencies of target Fetcher_test
[ 79%] Building CXX object
tests/zypp/CMakeFiles/Fetcher_test.dir/Fetcher_test.cc.o
Linking CXX executable CheckSum_test
[ 79%] Built target Digest_test
Scanning dependencies of target FileChecker_test
[ 80%] Building CXX object
tests/zypp/CMakeFiles/FileChecker_test.dir/FileChecker_test.cc.o
Linking CXX executable Capabilities_test
[ 80%] Built target CpeId_test
Scanning dependencies of target Flags_test
[ 80%] Building CXX object tests/zypp/CMakeFiles/Flags_test.dir/Flags_test.cc.o
[ 80%] Built target Arch_test
Scanning dependencies of target InstanceId_test
[ 80%] Building CXX object
tests/zypp/CMakeFiles/InstanceId_test.dir/InstanceId_test.cc.o
[ 80%] Built target CredentialManager_test
Linking CXX executable Dup_test
Scanning dependencies of target KeyRing_test
[ 80%] Building CXX object
tests/zypp/CMakeFiles/KeyRing_test.dir/KeyRing_test.cc.o
Linking CXX executable Edition_test
[ 80%] Built target Deltarpm_test
Scanning dependencies of target Locks_test
[ 82%] Building CXX object tests/zypp/CMakeFiles/Locks_test.dir/Locks_test.cc.o
Linking CXX executable Fetcher_test
[ 82%] Built target CheckSum_test
Scanning dependencies of target MediaSetAccess_test
[ 82%] Building CXX object
tests/zypp/CMakeFiles/MediaSetAccess_test.dir/MediaSetAccess_test.cc.o
Linking CXX executable FileChecker_test
Linking CXX executable Flags_test
[ 82%] Built target Capabilities_test
Scanning dependencies of target PathInfo_test
[ 82%] Building CXX object
tests/zypp/CMakeFiles/PathInfo_test.dir/PathInfo_test.cc.o
[ 82%] Built target Dup_test
Scanning dependencies of target Pathname_test
[ 82%] Building CXX object
tests/zypp/CMakeFiles/Pathname_test.dir/Pathname_test.cc.o
Linking CXX executable InstanceId_test
[ 82%] Built target Edition_test
Scanning dependencies of target PluginFrame_test
[ 82%] Building CXX object
tests/zypp/CMakeFiles/PluginFrame_test.dir/PluginFrame_test.cc.o
Linking CXX executable KeyRing_test
[ 82%] Built target Fetcher_test
Scanning dependencies of target PoolQuery_test
[ 82%] Building CXX object
tests/zypp/CMakeFiles/PoolQuery_test.dir/PoolQuery_test.cc.o
Linking CXX executable MediaSetAccess_test
Linking CXX executable Locks_test
[ 82%] Built target FileChecker_test
Scanning dependencies of target ProgressData_test
[ 82%] Building CXX object
tests/zypp/CMakeFiles/ProgressData_test.dir/ProgressData_test.cc.o
Linking CXX executable PathInfo_test
[ 82%] Built target Flags_test
Linking CXX executable Pathname_test
Scanning dependencies of target PtrTypes_test
[ 83%] Building CXX object
tests/zypp/CMakeFiles/PtrTypes_test.dir/PtrTypes_test.cc.o
[ 83%] Built target InstanceId_test
Scanning dependencies of target PublicKey_test
[ 83%] Building CXX object
tests/zypp/CMakeFiles/PublicKey_test.dir/PublicKey_test.cc.o
[ 83%] Built target KeyRing_test
Scanning dependencies of target RWPtr_test
[ 83%] Building CXX object tests/zypp/CMakeFiles/RWPtr_test.dir/RWPtr_test.cc.o
<http://river.suse.de/job/libzypp-HEAD/ws/checkout/tests/zypp/PtrTypes_test.cc>:
In function 'void test()':
<http://river.suse.de/job/libzypp-HEAD/ws/checkout/tests/zypp/PtrTypes_test.cc>:73:46:
warning: typedef '_constPtr_element_type' locally defined but not used
[-Wunused-local-typedefs]
Linking CXX executable PtrTypes_test
[ 83%] Built target MediaSetAccess_test
Scanning dependencies of target RepoInfo_test
[ 83%] Building CXX object
tests/zypp/CMakeFiles/RepoInfo_test.dir/RepoInfo_test.cc.o
Linking CXX executable ProgressData_test
Linking CXX executable PluginFrame_test
[ 83%] Built target Locks_test
Scanning dependencies of target RepoManager_test
[ 83%] Building CXX object
tests/zypp/CMakeFiles/RepoManager_test.dir/RepoManager_test.cc.o
Linking CXX executable RWPtr_test
Linking CXX executable PoolQuery_test
[ 83%] Built target PathInfo_test
Scanning dependencies of target RepoStatus_test
[ 83%] Building CXX object
tests/zypp/CMakeFiles/RepoStatus_test.dir/RepoStatus_test.cc.o
Linking CXX executable PublicKey_test
[ 83%] Built target Pathname_test
Scanning dependencies of target ResKind_test
[ 83%] Building CXX object
tests/zypp/CMakeFiles/ResKind_test.dir/ResKind_test.cc.o
[ 83%] Built target PtrTypes_test
Scanning dependencies of target ResStatus_test
[ 84%] Building CXX object
tests/zypp/CMakeFiles/ResStatus_test.dir/ResStatus_test.cc.o
[ 84%] Built target PluginFrame_test
Scanning dependencies of target Selectable_test
[ 84%] Building CXX object
tests/zypp/CMakeFiles/Selectable_test.dir/Selectable_test.cc.o
Linking CXX executable RepoInfo_test
[ 84%] Built target ProgressData_test
Scanning dependencies of target SetRelationMixin_test
[ 85%] Building CXX object
tests/zypp/CMakeFiles/SetRelationMixin_test.dir/SetRelationMixin_test.cc.o
<http://river.suse.de/job/libzypp-HEAD/ws/checkout/tests/zypp/RepoStatus_test.cc>:
In member function 'void repostatus_test::test_method()':
<http://river.suse.de/job/libzypp-HEAD/ws/checkout/tests/zypp/RepoStatus_test.cc>:30:778:
error: 'class zypp::RepoStatus' has no member named 'checksum'
<http://river.suse.de/job/libzypp-HEAD/ws/checkout/tests/zypp/RepoStatus_test.cc>:30:841:
error: 'class zypp::RepoStatus' has no member named 'checksum'
<http://river.suse.de/job/libzypp-HEAD/ws/checkout/tests/zypp/RepoStatus_test.cc>:31:780:
error: 'class zypp::RepoStatus' has no member named 'checksum'
<http://river.suse.de/job/libzypp-HEAD/ws/checkout/tests/zypp/RepoStatus_test.cc>:31:847:
error: 'class zypp::RepoStatus' has no member named 'checksum'
ICECC[28854] 19:32:11: Compiled on 10.120.4.3
make[2]: *** [tests/zypp/CMakeFiles/RepoStatus_test.dir/RepoStatus_test.cc.o]
Error 1
make[1]: *** [tests/zypp/CMakeFiles/RepoStatus_test.dir/all] Error 2
make[1]: *** Waiting for unfinished jobs....
[ 85%] Built target RWPtr_test
Linking CXX executable RepoManager_test
[ 85%] Built target PoolQuery_test
[ 85%] Built target PublicKey_test
Linking CXX executable ResKind_test
Linking CXX executable SetRelationMixin_test
[ 85%] Built target RepoInfo_test
[ 85%] Built target RepoManager_test
[ 85%] Built target ResKind_test
[ 85%] Built target SetRelationMixin_test
Linking CXX executable ResStatus_test
[ 85%] Built target ResStatus_test
Linking CXX executable Selectable_test
[ 85%] Built target Selectable_test
make: *** [all] Error 2
Build step 'Execute shell' marked build as failure
Archiving artifacts
--
To unsubscribe, e-mail: zypp-commit+unsubscribe@xxxxxxxxxxxx
For additional commands, e-mail: zypp-commit+help@xxxxxxxxxxxx

< Previous Next >
List Navigation
This Thread
Follow Ups