Mailinglist Archive: zypp-commit (79 mails)

< Previous Next >
[zypp-commit] Build failed in Jenkins: libzypp-HEAD #1847
  • From: hudson@xxxxxxx
  • Date: Thu, 13 Feb 2014 10:27:55 +0100 (CET)
  • Message-id: <563580495.1418.1392283675455.JavaMail.jenkins@river>
See <http://river.suse.de/job/libzypp-HEAD/1847/changes>

Changes:

[Michael Andres] Don't assume solver defaults when writing a testcase

[Michael Andres] Adjust solver defaults to changed soft lock handling
(bnc#863275)

------------------------------------------
[...truncated 105 lines...]
++ rm -rf <http://river.suse.de/job/libzypp-HEAD/1847/artifact/.artifacts>
++ rm -rf <http://river.suse.de/job/libzypp-HEAD/ws/OBS>
++ rm -rf '<http://river.suse.de/job/libzypp-HEAD/ws/copy-to-slave*.dir'>
++ [[ '' == 1 ]]
++ rm -rf <http://river.suse.de/job/libzypp-HEAD/ws/build>
++ mkdir -p <http://river.suse.de/job/libzypp-HEAD/ws/build>
++ mkdir -p <http://river.suse.de/job/libzypp-HEAD/ws/rpm>
++ mkdir -p <http://river.suse.de/job/libzypp-HEAD/ws/rpm/rpms>
++ mkdir -p <http://river.suse.de/job/libzypp-HEAD/ws/rpm/rpmbuild>
++ mkdir -p <http://river.suse.de/job/libzypp-HEAD/ws/rpm/rpmbuildroot>
++ mkdir -p <http://river.suse.de/job/libzypp-HEAD/1847/artifact/.artifacts>
++ mkdir -p <http://river.suse.de/job/libzypp-HEAD/ws/OBS>
++ cat
+ build_cmake
+ echo '==> Building'
==> Building
+ pushd <http://river.suse.de/job/libzypp-HEAD/ws/build>
~/hudson/workspace/libzypp-HEAD/build /home/hudson/workspace/libzypp-HEAD
+ cmake -DBUILDNAME=x86_64
-DSITE=host-44-0-0-74.openstack.local.p2.cloud.suse.de
-DCMAKE_INSTALL_PREFIX=/usr -DCMAKE_CXX_COMPILER=/usr/lib/icecc/bin/g++
<http://river.suse.de/job/libzypp-HEAD/ws/checkout>
-- The C compiler identification is GNU 4.8.1
-- The CXX compiler identification is GNU 4.8.1
-- Check for working C compiler: /usr/lib/icecc/bin/cc
-- Check for working C compiler: /usr/lib/icecc/bin/cc -- works
-- Detecting C compiler ABI info
-- Detecting C compiler ABI info - done
-- Check for working CXX compiler: /usr/lib/icecc/bin/g++
-- Check for working CXX compiler: /usr/lib/icecc/bin/g++ -- works
-- Detecting CXX compiler ABI info
-- Detecting CXX compiler ABI info - done
-- Libraries will be installed in /usr/lib64
-- Config files will be installed in /etc
** Manual files will be installed in /usr/share/man
-- Performing Test CC_FORMAT_SECURITY
-- Performing Test CC_FORMAT_SECURITY - Failed
-- Performing Test CXX_FORMAT_SECURITY
-- Performing Test CXX_FORMAT_SECURITY - Failed
-- Looking for pipe2
-- Looking for pipe2 - found
-- Writing spec file...
-- I hate you rpm-lint...!!!
CMake Warning at /usr/share/cmake/Modules/CPack.cmake:289 (message):
CPack.cmake has already been included!!
Call Stack (most recent call first):
CMakeLists.txt:59 (INCLUDE)


-- rpm found: includes in /usr/include, library in /usr/lib64/librpm.so
(suspect 4.x)
-- rpm found: use rpm-4.x interface.
-- Boost version: 1.53.0
-- Found the following Boost libraries:
-- program_options
-- unit_test_framework
-- boost found: includes in /usr/include, library in /usr/lib64
-- Found Gettext:
-- curl found: includes in /usr/include, library in /usr/lib64/libcurl.so
-- libxml found: includes in /usr/include, library in /usr/lib64/libxml2.so
-- Found ZLIB: /usr/lib64/libz.so (found version "1.2.8")
-- Found LibSolv: /usr/lib64/libsolv.so
-- Found LibSolv_ext: /usr/lib64/libsolvext.so
-- Found LibSolv: /usr/include /usr/lib64/libsolv.so;/usr/lib64/libsolvext.so
-- Found EXPAT: /usr/lib64/libexpat.so (found version "2.1.0")
-- Found libcrypto: /usr/lib64/libcrypto.so
-- Found OpenSSL: /usr/lib64/libssl.so
-- Looking for udev_enumerate_new
-- Looking for udev_enumerate_new - found
-- Found Udev: /usr/lib64/libudev.so
-- Found PkgConfig: /usr/bin/pkg-config (found version "0.28")
-- checking for one of the modules 'libproxy-1.0'
-- libproxy not found
-- doxygen found: /usr/bin/doxygen
-- soname: 1412.0.0
-- version: 14.12.0
-- Writing pkg-config file...
-- FindZypp.cmake will be installed in /usr/share/cmake/Modules
-- zypp.conf will be installed in /etc/zypp
-- systemCheck will be installed in /etc/zypp
-- zsync not found
-- Translation set: zypp-po.tar.bz2
-- Translations:
sk.po;sl.po;el.po;tr.po;ja.po;ru.po;es.po;km.po;th.po;wa.po;en_GB.po;lt.po;be.po;ko.po;hr.po;sr.po;hi.po;en_US.po;mk.po;ku.po;af.po;ta.po;fi.po;pl.po;uk.po;vi.po;cy.po;bn.po;zh_TW.po;id.po;de.po;sv.po;eo.po;zu.po;si.po;zh_CN.po;da.po;nb.po;hu.po;et.po;cs.po;ar.po;mr.po;gu.po;ka.po;ca.po;nl.po;lo.po;he.po;gl.po;fr.po;eu.po;pa.po;tg.po;it.po;ro.po;nds.po;xh.po;nn.po;bg.po;pt_BR.po;bs.po;pt.po;
dot not found: you should install graphviz.
-- Configuring done
-- Generating done
-- Build files have been written to:
<http://river.suse.de/job/libzypp-HEAD/ws/build>
+ make -j 10
Scanning dependencies of target mongoose
[ 0%] Building C object vendor/mongoose/CMakeFiles/mongoose.dir/mongoose.c.o
Scanning dependencies of target zypp
[ 1%] [ 1%] [ 1%] [ 1%] Building CXX object
zypp/CMakeFiles/zypp.dir/misc/DefaultLoadSystem.cc.o
[ 3%] Linking C static library libmongoose.a
Building CXX object zypp/CMakeFiles/zypp.dir/misc/CheckAccessDeleted.cc.o
Building CXX object zypp/CMakeFiles/zypp.dir/pool/PoolImpl.cc.o
[ 3%] [ 3%] Building CXX object zypp/CMakeFiles/zypp.dir/pool/PoolStats.cc.o
[ 3%] Building CXX object
zypp/CMakeFiles/zypp.dir/parser/susetags/RepoIndex.cc.o
Building CXX object
zypp/CMakeFiles/zypp.dir/parser/susetags/ContentFileReader.cc.o
Building CXX object zypp/CMakeFiles/zypp.dir/parser/xml/Node.cc.o
[ 4%] Building CXX object zypp/CMakeFiles/zypp.dir/parser/xml/ParseDef.cc.o
Building CXX object zypp/CMakeFiles/zypp.dir/parser/xml/ParseDefConsume.cc.o
[ 4%] Built target mongoose
[ 4%] Building CXX object
zypp/CMakeFiles/zypp.dir/parser/xml/ParseDefException.cc.o
[ 4%] Building CXX object zypp/CMakeFiles/zypp.dir/parser/xml/Reader.cc.o
[ 4%] Building CXX object zypp/CMakeFiles/zypp.dir/parser/xml/XmlEscape.cc.o
[ 6%] Building CXX object zypp/CMakeFiles/zypp.dir/parser/xml/XmlString.cc.o
[ 6%] Building CXX object zypp/CMakeFiles/zypp.dir/parser/xml/libxmlfwd.cc.o
[ 6%] Building CXX object
zypp/CMakeFiles/zypp.dir/parser/yum/RepomdFileReader.cc.o
[ 6%] Building CXX object
zypp/CMakeFiles/zypp.dir/parser/yum/PatchesFileReader.cc.o
[ 8%] In file included from
<http://river.suse.de/job/libzypp-HEAD/ws/checkout/zypp/misc/DefaultLoadSystem.cc>:20:0:
<http://river.suse.de/job/libzypp-HEAD/ws/checkout/zypp/zypp_detail/ZYppReadOnlyHack.h>:15:2:
warning: #warning ZYPP_ZYPP_DETAIL_ZYPPREADONLYHACK_H [-Wcpp]
#warning ZYPP_ZYPP_DETAIL_ZYPPREADONLYHACK_H
^
Building CXX object zypp/CMakeFiles/zypp.dir/parser/plaindir/RepoParser.cc.o
[ 8%] Building CXX object
zypp/CMakeFiles/zypp.dir/parser/ws/WebpinResultFileReader.cc.o
[ 8%] Building CXX object zypp/CMakeFiles/zypp.dir/parser/ParseException.cc.o
[ 8%] Building CXX object zypp/CMakeFiles/zypp.dir/parser/IniParser.cc.o
[ 9%] Building CXX object zypp/CMakeFiles/zypp.dir/parser/IniDict.cc.o
[ 9%] Building CXX object zypp/CMakeFiles/zypp.dir/parser/HistoryLogReader.cc.o
<http://river.suse.de/job/libzypp-HEAD/ws/checkout/zypp/misc/DefaultLoadSystem.cc>:
In function 'void zypp::misc::defaultLoadSystem(const
zypp::filesystem::Pathname&, zypp::misc::LoadSystemFlags)':
<http://river.suse.de/job/libzypp-HEAD/ws/checkout/zypp/misc/DefaultLoadSystem.cc>:48:29:
warning: 'void zypp::zypp_readonly_hack::IWantIt()' is deprecated (declared at
<http://river.suse.de/job/libzypp-HEAD/ws/checkout/zypp/zypp_detail/ZYppReadOnlyHack.h>:26)
[-Wdeprecated-declarations]
<http://river.suse.de/job/libzypp-HEAD/ws/checkout/zypp/misc/DefaultLoadSystem.cc>:48:38:
warning: 'void zypp::zypp_readonly_hack::IWantIt()' is deprecated (declared at
<http://river.suse.de/job/libzypp-HEAD/ws/checkout/zypp/zypp_detail/ZYppReadOnlyHack.h>:26)
[-Wdeprecated-declarations]
[ 9%] Building CXX object zypp/CMakeFiles/zypp.dir/parser/RepoFileReader.cc.o
[ 9%] Building CXX object
zypp/CMakeFiles/zypp.dir/parser/RepoindexFileReader.cc.o
[ 11%] Building CXX object
zypp/CMakeFiles/zypp.dir/parser/ServiceFileReader.cc.o
[ 11%] Building CXX object
zypp/CMakeFiles/zypp.dir/parser/ProductFileReader.cc.o
[ 11%] Building CXX object
zypp/CMakeFiles/zypp.dir/media/proxyinfo/ProxyInfoSysconfig.cc.o
[ 11%] Building CXX object zypp/CMakeFiles/zypp.dir/media/MediaException.cc.o
[ 13%] Building CXX object zypp/CMakeFiles/zypp.dir/media/MediaAccess.cc.o
[ 13%] Building CXX object zypp/CMakeFiles/zypp.dir/media/MediaHandler.cc.o
[ 13%] Building CXX object zypp/CMakeFiles/zypp.dir/media/Mount.cc.o
[ 14%] Building CXX object zypp/CMakeFiles/zypp.dir/media/MediaNFS.cc.o
[ 14%] Building CXX object zypp/CMakeFiles/zypp.dir/media/MediaCD.cc.o
[ 14%] Building CXX object zypp/CMakeFiles/zypp.dir/media/MediaDIR.cc.o
[ 14%] Building CXX object zypp/CMakeFiles/zypp.dir/media/MediaDISK.cc.o
[ 16%] Building CXX object zypp/CMakeFiles/zypp.dir/media/MediaCIFS.cc.o
[ 16%] Building CXX object zypp/CMakeFiles/zypp.dir/media/ProxyInfo.cc.o
[ 16%] Building CXX object zypp/CMakeFiles/zypp.dir/media/MediaCurl.cc.o
[ 16%] Building CXX object zypp/CMakeFiles/zypp.dir/media/MediaMultiCurl.cc.o
[ 18%] Building CXX object zypp/CMakeFiles/zypp.dir/media/MediaISO.cc.o
[ 18%] Building CXX object zypp/CMakeFiles/zypp.dir/media/MediaPlugin.cc.o
[ 18%] Building CXX object zypp/CMakeFiles/zypp.dir/media/MediaSource.cc.o
[ 18%] Building CXX object zypp/CMakeFiles/zypp.dir/media/MediaManager.cc.o
[ 19%] Building CXX object zypp/CMakeFiles/zypp.dir/media/MediaUserAuth.cc.o
[ 19%] Building CXX object
zypp/CMakeFiles/zypp.dir/media/CredentialFileReader.cc.o
[ 19%] Building CXX object zypp/CMakeFiles/zypp.dir/media/CredentialManager.cc.o
[ 19%] Building CXX object zypp/CMakeFiles/zypp.dir/media/CurlConfig.cc.o
[ 21%] Building CXX object zypp/CMakeFiles/zypp.dir/media/TransferSettings.cc.o
[ 21%] Building CXX object zypp/CMakeFiles/zypp.dir/media/MediaPriority.cc.o
[ 21%] Building CXX object zypp/CMakeFiles/zypp.dir/media/MetaLinkParser.cc.o
[ 21%] Building CXX object zypp/CMakeFiles/zypp.dir/media/ZsyncParser.cc.o
[ 22%] [ 22%] Building CXX object
zypp/CMakeFiles/zypp.dir/media/MediaBlockList.cc.o
Building CXX object zypp/CMakeFiles/zypp.dir/media/UrlResolverPlugin.cc.o
[ 22%] Building CXX object zypp/CMakeFiles/zypp.dir/url/UrlUtils.cc.o
[ 22%] Building CXX object zypp/CMakeFiles/zypp.dir/url/UrlBase.cc.o
[ 24%] Building CXX object zypp/CMakeFiles/zypp.dir/repo/RepoException.cc.o
[ 24%] Building CXX object zypp/CMakeFiles/zypp.dir/repo/RepoMirrorList.cc.o
[ 24%] Building CXX object zypp/CMakeFiles/zypp.dir/repo/RepoType.cc.o
[ 24%] Building CXX object zypp/CMakeFiles/zypp.dir/repo/ServiceType.cc.o
[ 26%] [ 26%] Building CXX object
zypp/CMakeFiles/zypp.dir/repo/PackageProvider.cc.o
Building CXX object zypp/CMakeFiles/zypp.dir/repo/SrcPackageProvider.cc.o
[ 26%] Building CXX object zypp/CMakeFiles/zypp.dir/repo/RepoProvideFile.cc.o
[ 26%] Building CXX object zypp/CMakeFiles/zypp.dir/repo/DeltaCandidates.cc.o
[ 27%] Building CXX object zypp/CMakeFiles/zypp.dir/repo/Applydeltarpm.cc.o
[ 27%] Building CXX object zypp/CMakeFiles/zypp.dir/repo/PackageDelta.cc.o
[ 27%] Building CXX object zypp/CMakeFiles/zypp.dir/repo/SUSEMediaVerifier.cc.o
[ 27%] Building CXX object
zypp/CMakeFiles/zypp.dir/repo/MediaInfoDownloader.cc.o
[ 29%] Building CXX object zypp/CMakeFiles/zypp.dir/repo/Downloader.cc.o
[ 29%] Building CXX object zypp/CMakeFiles/zypp.dir/repo/RepoVariables.cc.o
[ 29%] Building CXX object zypp/CMakeFiles/zypp.dir/repo/RepoInfoBase.cc.o
[ 29%] Building CXX object zypp/CMakeFiles/zypp.dir/repo/PluginServices.cc.o
[ 31%] Building CXX object zypp/CMakeFiles/zypp.dir/repo/ServiceRepos.cc.o
[ 31%] Building CXX object zypp/CMakeFiles/zypp.dir/repo/yum/Downloader.cc.o
[ 31%] Building CXX object zypp/CMakeFiles/zypp.dir/repo/yum/ResourceType.cc.o
<http://river.suse.de/job/libzypp-HEAD/ws/checkout/zypp/repo/SUSEMediaVerifier.cc>:58:2:
warning: #warning check the stream status [-Wcpp]
#warning check the stream status
^
[ 31%] Building CXX object
zypp/CMakeFiles/zypp.dir/repo/susetags/Downloader.cc.o
[ 32%] Building CXX object zypp/CMakeFiles/zypp.dir/target/rpm/BinHeader.cc.o
[ 32%] Building CXX object zypp/CMakeFiles/zypp.dir/target/rpm/RpmCallbacks.cc.o
[ 32%] Building CXX object zypp/CMakeFiles/zypp.dir/target/rpm/RpmDb.cc.o
[ 32%] Building CXX object zypp/CMakeFiles/zypp.dir/target/rpm/RpmException.cc.o
[ 34%] [ 34%] Building CXX object
zypp/CMakeFiles/zypp.dir/target/rpm/RpmHeader.cc.o
Building CXX object zypp/CMakeFiles/zypp.dir/target/rpm/librpmDb.cc.o
[ 34%] Building CXX object zypp/CMakeFiles/zypp.dir/target/rpm/librpmDb.cv3.cc.o
<http://river.suse.de/job/libzypp-HEAD/ws/checkout/zypp/repo/yum/Downloader.cc>:147:2:
warning: #warning Do we need SignatureFileChecker(string descr)? [-Wcpp]
#warning Do we need SignatureFileChecker(string descr)?
^
[ 34%] Building CXX object
zypp/CMakeFiles/zypp.dir/target/modalias/Modalias.cc.o
[ 36%] [ 36%] Building CXX object
zypp/CMakeFiles/zypp.dir/target/RpmPostTransCollector.cc.o
Building CXX object zypp/CMakeFiles/zypp.dir/target/RequestedLocalesFile.cc.o
[ 36%] Building CXX object zypp/CMakeFiles/zypp.dir/target/SoftLocksFile.cc.o
[ 36%] Building CXX object zypp/CMakeFiles/zypp.dir/target/HardLocksFile.cc.o
<http://river.suse.de/job/libzypp-HEAD/ws/checkout/zypp/target/rpm/RpmDb.cc>:246:2:
warning: #warning Check for obsolete memebers [-Wcpp]
#warning Check for obsolete memebers
^
[ 37%]
<http://river.suse.de/job/libzypp-HEAD/ws/checkout/zypp/target/rpm/RpmDb.cc>:414:2:
warning: #warning CHECK: notify root about conversion backup. [-Wcpp]
#warning CHECK: notify root about conversion backup.
^
<http://river.suse.de/job/libzypp-HEAD/ws/checkout/zypp/target/rpm/RpmDb.cc>:670:2:
warning: #warning CHECK: compare vs existing v3 backup. notify root [-Wcpp]
#warning CHECK: compare vs existing v3 backup. notify root
^
Building CXX object zypp/CMakeFiles/zypp.dir/target/CommitPackageCache.cc.o
[ 37%] Building CXX object
zypp/CMakeFiles/zypp.dir/target/CommitPackageCacheImpl.cc.o
<http://river.suse.de/job/libzypp-HEAD/ws/checkout/zypp/target/rpm/librpmDb.cc>:681:2:
warning: #warning TESTCASE: rpmdbAppendIterator and (non)sequential access?
[-Wcpp]
#warning TESTCASE: rpmdbAppendIterator and (non)sequential access?
^
<http://river.suse.de/job/libzypp-HEAD/ws/checkout/zypp/target/rpm/librpmDb.cc>:696:2:
warning: #warning TESTCASE: rpmdbGetIteratorCount returns 0 on sequential
access? [-Wcpp]
#warning TESTCASE: rpmdbGetIteratorCount returns 0 on sequential access?
^
<http://river.suse.de/job/libzypp-HEAD/ws/checkout/zypp/target/rpm/RpmHeader.cc>:396:2:
warning: #warning CHECK IF FILE REQUIRES HANDLING IS OBSOLETE [-Wcpp]
#warning CHECK IF FILE REQUIRES HANDLING IS OBSOLETE
^
[ 37%] Building CXX object
zypp/CMakeFiles/zypp.dir/target/CommitPackageCacheReadAhead.cc.o
[ 37%] Building CXX object
zypp/CMakeFiles/zypp.dir/target/TargetCallbackReceiver.cc.o
[ 39%] Building CXX object zypp/CMakeFiles/zypp.dir/target/TargetException.cc.o
[ 39%] Building CXX object zypp/CMakeFiles/zypp.dir/target/TargetImpl.cc.o
[ 39%] Building CXX object
zypp/CMakeFiles/zypp.dir/target/TargetImpl.commitFindFileConflicts.cc.o
[ 39%] Building CXX object zypp/CMakeFiles/zypp.dir/solver/detail/Helper.cc.o
[ 40%] Building CXX object
zypp/CMakeFiles/zypp.dir/solver/detail/ProblemSolutionIgnore.cc.o
[ 40%] Building CXX object
zypp/CMakeFiles/zypp.dir/solver/detail/ProblemSolutionCombi.cc.o
[ 40%] Building CXX object zypp/CMakeFiles/zypp.dir/solver/detail/Resolver.cc.o
[ 40%] Building CXX object
zypp/CMakeFiles/zypp.dir/solver/detail/SolutionAction.cc.o
[ 42%] Building CXX object zypp/CMakeFiles/zypp.dir/solver/detail/Testcase.cc.o
[ 42%] Building CXX object
zypp/CMakeFiles/zypp.dir/solver/detail/SolverQueueItem.cc.o
<http://river.suse.de/job/libzypp-HEAD/ws/checkout/zypp/target/TargetImpl.cc>:1547:2:
warning: #warning Exception handling [-Wcpp]
#warning Exception handling
^
[ 42%] Building CXX object
zypp/CMakeFiles/zypp.dir/solver/detail/SolverQueueItemInstall.cc.o
[ 42%] Building CXX object
zypp/CMakeFiles/zypp.dir/solver/detail/SolverQueueItemDelete.cc.o
[ 44%] Building CXX object
zypp/CMakeFiles/zypp.dir/solver/detail/SolverQueueItemUpdate.cc.o
[ 44%] Building CXX object
zypp/CMakeFiles/zypp.dir/solver/detail/SolverQueueItemInstallOneOf.cc.o
[ 44%] Building CXX object
zypp/CMakeFiles/zypp.dir/solver/detail/SolverQueueItemLock.cc.o
[ 44%] Building CXX object
zypp/CMakeFiles/zypp.dir/solver/detail/SATResolver.cc.o
[ 45%] Building CXX object
zypp/CMakeFiles/zypp.dir/solver/detail/SystemCheck.cc.o
[ 45%] Building CXX object zypp/CMakeFiles/zypp.dir/ui/Selectable.cc.o
<http://river.suse.de/job/libzypp-HEAD/ws/checkout/zypp/solver/detail/Testcase.cc>:275:5:
error: default argument missing for parameter 8 of
'zypp::solver::detail::HelixControl::HelixControl(const string&, const
RepositoryTable&, const zypp::Arch&, const LocaleSet&, const ModaliasList&,
const std::set<std::basic_string<char> >&, const string&, bool, bool, bool)'
<http://river.suse.de/job/libzypp-HEAD/ws/checkout/zypp/solver/detail/Testcase.cc>:275:5:
error: default argument missing for parameter 9 of
'zypp::solver::detail::HelixControl::HelixControl(const string&, const
RepositoryTable&, const zypp::Arch&, const LocaleSet&, const ModaliasList&,
const std::set<std::basic_string<char> >&, const string&, bool, bool, bool)'
<http://river.suse.de/job/libzypp-HEAD/ws/checkout/zypp/solver/detail/Testcase.cc>:275:5:
error: default argument missing for parameter 10 of
'zypp::solver::detail::HelixControl::HelixControl(const string&, const
RepositoryTable&, const zypp::Arch&, const LocaleSet&, const ModaliasList&,
const std::set<std::basic_string<char> >&, const string&, bool, bool, bool)'
ICECC[1567] 10:27:46: Compiled on 10.121.8.6
make[2]: *** [zypp/CMakeFiles/zypp.dir/solver/detail/Testcase.cc.o] Error 1
make[2]: *** Waiting for unfinished jobs....
<http://river.suse.de/job/libzypp-HEAD/ws/checkout/zypp/solver/detail/SATResolver.cc>:
In member function 'std::string
zypp::solver::detail::SATResolver::SATprobleminfoString(Id, std::string&, Id&)':
<http://river.suse.de/job/libzypp-HEAD/ws/checkout/zypp/solver/detail/SATResolver.cc>:1001:10:
warning: enumeration value 'SOLVER_RULE_UNKNOWN' not handled in switch
[-Wswitch]
<http://river.suse.de/job/libzypp-HEAD/ws/checkout/zypp/solver/detail/SATResolver.cc>:1001:10:
warning: enumeration value 'SOLVER_RULE_RPM_IMPLICIT_OBSOLETES' not handled in
switch [-Wswitch]
<http://river.suse.de/job/libzypp-HEAD/ws/checkout/zypp/solver/detail/SATResolver.cc>:1001:10:
warning: enumeration value 'SOLVER_RULE_FEATURE' not handled in switch
[-Wswitch]
<http://river.suse.de/job/libzypp-HEAD/ws/checkout/zypp/solver/detail/SATResolver.cc>:1001:10:
warning: enumeration value 'SOLVER_RULE_CHOICE' not handled in switch
[-Wswitch]
<http://river.suse.de/job/libzypp-HEAD/ws/checkout/zypp/solver/detail/SATResolver.cc>:1001:10:
warning: enumeration value 'SOLVER_RULE_LEARNT' not handled in switch
[-Wswitch]
<http://river.suse.de/job/libzypp-HEAD/ws/checkout/zypp/solver/detail/SATResolver.cc>:1001:10:
warning: enumeration value 'SOLVER_RULE_BEST' not handled in switch [-Wswitch]
make[1]: *** [zypp/CMakeFiles/zypp.dir/all] Error 2
make: *** [all] Error 2
Build step 'Execute shell' marked build as failure
Archiving artifacts
--
To unsubscribe, e-mail: zypp-commit+unsubscribe@xxxxxxxxxxxx
For additional commands, e-mail: zypp-commit+help@xxxxxxxxxxxx

< Previous Next >
This Thread
Follow Ups