Mailinglist Archive: zypp-commit (64 mails)

< Previous Next >
[zypp-commit] Build failed in Jenkins: dialogsolver-12.3 #88
  • From: hudson@xxxxxxx
  • Date: Fri, 18 Oct 2013 09:23:30 +0200 (CEST)
  • Message-id: <8755430.1628.1382081010589.JavaMail.jenkins@river>
See <http://river.suse.de/job/dialogsolver-12.3/88/>

------------------------------------------
[...truncated 125 lines...]
-- The CXX compiler identification is GNU 4.7.2
-- Check for working C compiler: /opt/icecream/bin/cc
-- Check for working C compiler: /opt/icecream/bin/cc -- works
-- Detecting C compiler ABI info
-- Detecting C compiler ABI info - done
-- Check for working CXX compiler: /opt/icecream/bin/g++
-- Check for working CXX compiler: /opt/icecream/bin/g++ -- works
-- Detecting CXX compiler ABI info
-- Detecting CXX compiler ABI info - done
-- Libraries will be installed in /usr/lib64
-- Config files will be installed in /etc
** Manual files will be installed in /usr/share/man
-- Looking for Q_WS_X11
-- Looking for Q_WS_X11 - found
-- Looking for Q_WS_WIN
-- Looking for Q_WS_WIN - not found
-- Looking for Q_WS_QWS
-- Looking for Q_WS_QWS - not found
-- Looking for Q_WS_MAC
-- Looking for Q_WS_MAC - not found
-- Found Qt4: /usr/bin/qmake (found version "4.8.4")
-- ZYpp path not set. Looking for it.
-- ZYpp found: includes in /usr/include, library in /usr/lib64/libzypp.so
-- Found Libyui: (Version: 2.42.6)
-- Found Gettext:
-- Writing spec file...
-- Writing spec file...
-- Configuring done
-- Generating done
CMake Warning:
Manually-specified variables were not used by the project:

BUILDNAME
SITE


-- Build files have been written to:
<http://river.suse.de/job/dialogsolver-12.3/ws/build>
+ make -j 4
[ 1%] [ 2%] [ 4%] Scanning dependencies of target translations
Generating restreewidget.moc
Generating pannerview.moc
Generating QZyppSolverDialog.moc
[ 5%] Generating sl.gmo
[ 7%] Generating lo.gmo
[ 8%] Generating af.gmo
[ 10%] Generating he.gmo
[ 11%] Generating fi.gmo
[ 13%] Generating pa.gmo
[ 14%] [ 15%] [ 17%] Generating th.gmo
[ 18%] Generating resgraphview.moc
Generating et.gmo
Generating zh_CN.gmo
[ 20%] [ 21%] [ 23%] Generating sr.gmo
Generating bs.gmo
Generating ro.gmo
[ 24%] [ 26%] [ 27%] Generating fr.gmo
Generating ru.gmo
Scanning dependencies of target qdialogsolver
Generating vi.gmo
[ 28%] [ 30%] [ 31%] [ 33%] Generating nl.gmo
Building CXX object src/CMakeFiles/qdialogsolver.dir/drawparams.o
Generating mr.gmo
Generating da.gmo
[ 34%] [ 36%] [ 37%] Generating sk.gmo
Generating cs.gmo
Generating it.gmo
[ 39%] [ 40%] [ 42%] Generating xh.gmo
Generating es.gmo
Generating ca.gmo
[ 43%] [ 44%] [ 46%] Generating nb.gmo
Generating wa.gmo
Generating de.gmo
[ 47%] [ 49%] [ 50%] Generating si.gmo
Generating cy.gmo
Generating mk.gmo
[ 52%] [ 53%] [ 55%] Generating en_US.gmo
Generating bn.gmo
Generating pl.gmo
[ 56%] [ 57%] [ 59%] Generating hr.gmo
Generating uk.gmo
Generating pt.gmo
[ 60%] [ 62%] [ 63%] Generating gu.gmo
Generating zh_TW.gmo
Generating tr.gmo
[ 65%] [ 66%] [ 68%] Generating km.gmo
Generating ar.gmo
Generating en_GB.gmo
[ 69%] [ 71%] [ 72%] Generating sv.gmo
Generating ka.gmo
Generating gl.gmo
[ 73%] [ 75%] [ 76%] Generating zu.gmo
Generating pt_BR.gmo
Generating lt.gmo
[ 78%] [ 79%] [ 81%] Generating ko.gmo
Generating bg.gmo
Generating ta.gmo
[ 82%] [ 84%] [ 85%] Generating el.gmo
Generating ja.gmo
Generating id.gmo
[ 86%] [ 88%] [ 89%] Generating hu.gmo
Generating hi.gmo
Building CXX object src/CMakeFiles/qdialogsolver.dir/graphtreelabel.o
[ 91%] [ 91%] Built target translations
Building CXX object src/CMakeFiles/qdialogsolver.dir/pannerview.o
[ 92%] Building CXX object src/CMakeFiles/qdialogsolver.dir/QZyppSolverDialog.o
[ 94%] Building CXX object src/CMakeFiles/qdialogsolver.dir/resgraphview.o
[ 95%] Building CXX object src/CMakeFiles/qdialogsolver.dir/restreewidget.o
[ 97%] Building CXX object src/CMakeFiles/qdialogsolver.dir/solvertree.o
In file included from /usr/include/zypp/PathInfo.h:31:0,
from /usr/include/zypp/VendorAttr.h:19,
from /usr/include/zypp/Vendor.h:28,
from /usr/include/zypp/ResObject.h:20,
from /usr/include/zypp/PoolItem.h:19,
from /usr/include/zypp/pool/PoolTraits.h:23,
from /usr/include/zypp/ResPool.h:20,
from /usr/include/zypp/solver/detail/Resolver.h:33,
from
<http://river.suse.de/job/dialogsolver-12.3/ws/checkout/src/QZyppSolverDialog.h>:5,
from
<http://river.suse.de/job/dialogsolver-12.3/ws/checkout/src/QZyppSolverDialog.cpp>:8:
/usr/include/zypp/CheckSum.h:54:56: error: expected ‘,’ or ‘...’ before ‘&&’
token
/usr/include/zypp/CheckSum.h: In constructor ‘zypp::CheckSum::CheckSum(const
string&, std::istream)’:
/usr/include/zypp/CheckSum.h:55:25: error: ‘input_r’ was not declared in this
scope
/usr/include/zypp/CheckSum.h: In static member function ‘static zypp::CheckSum
zypp::CheckSum::md5(std::istream&)’:
/usr/include/zypp/CheckSum.h:75:44: error: call of overloaded ‘CheckSum(const
string&, std::istream&)’ is ambiguous
/usr/include/zypp/CheckSum.h:75:44: note: candidates are:
/usr/include/zypp/CheckSum.h:54:7: note: zypp::CheckSum::CheckSum(const
string&, std::istream)
/usr/include/zypp/CheckSum.h:50:5: note: zypp::CheckSum::CheckSum(const
string&, std::istream&)
/usr/include/zypp/CheckSum.h: In static member function ‘static zypp::CheckSum
zypp::CheckSum::sha(std::istream&)’:
/usr/include/zypp/CheckSum.h:77:45: error: call of overloaded ‘CheckSum(const
string&, std::istream&)’ is ambiguous
/usr/include/zypp/CheckSum.h:77:45: note: candidates are:
/usr/include/zypp/CheckSum.h:54:7: note: zypp::CheckSum::CheckSum(const
string&, std::istream)
/usr/include/zypp/CheckSum.h:50:5: note: zypp::CheckSum::CheckSum(const
string&, std::istream&)
/usr/include/zypp/CheckSum.h: In static member function ‘static zypp::CheckSum
zypp::CheckSum::sha1(std::istream&)’:
/usr/include/zypp/CheckSum.h:79:45: error: call of overloaded ‘CheckSum(const
string&, std::istream&)’ is ambiguous
/usr/include/zypp/CheckSum.h:79:45: note: candidates are:
/usr/include/zypp/CheckSum.h:54:7: note: zypp::CheckSum::CheckSum(const
string&, std::istream)
/usr/include/zypp/CheckSum.h:50:5: note: zypp::CheckSum::CheckSum(const
string&, std::istream&)
/usr/include/zypp/CheckSum.h: In static member function ‘static zypp::CheckSum
zypp::CheckSum::sha256(std::istream&)’:
/usr/include/zypp/CheckSum.h:81:47: error: call of overloaded ‘CheckSum(const
string&, std::istream&)’ is ambiguous
/usr/include/zypp/CheckSum.h:81:47: note: candidates are:
/usr/include/zypp/CheckSum.h:54:7: note: zypp::CheckSum::CheckSum(const
string&, std::istream)
/usr/include/zypp/CheckSum.h:50:5: note: zypp::CheckSum::CheckSum(const
string&, std::istream&)
make[2]: *** [src/CMakeFiles/qdialogsolver.dir/QZyppSolverDialog.o] Error 1
make[2]: *** Waiting for unfinished jobs....
In file included from /usr/include/zypp/PathInfo.h:31:0,
from /usr/include/zypp/VendorAttr.h:19,
from /usr/include/zypp/Vendor.h:28,
from /usr/include/zypp/ResObject.h:20,
from /usr/include/zypp/PoolItem.h:19,
from /usr/include/zypp/pool/PoolTraits.h:23,
from /usr/include/zypp/ResPool.h:20,
from /usr/include/zypp/solver/detail/Resolver.h:33,
from
<http://river.suse.de/job/dialogsolver-12.3/ws/checkout/src/QZyppSolverDialog.h>:5,
from
<http://river.suse.de/job/dialogsolver-12.3/ws/checkout/src/resgraphview.cpp>:20:
/usr/include/zypp/CheckSum.h:54:56: error: expected ‘,’ or ‘...’ before ‘&&’
token
/usr/include/zypp/CheckSum.h: In constructor ‘zypp::CheckSum::CheckSum(const
string&, std::istream)’:
/usr/include/zypp/CheckSum.h:55:25: error: ‘input_r’ was not declared in this
scope
/usr/include/zypp/CheckSum.h: In static member function ‘static zypp::CheckSum
zypp::CheckSum::md5(std::istream&)’:
/usr/include/zypp/CheckSum.h:75:44: error: call of overloaded ‘CheckSum(const
string&, std::istream&)’ is ambiguous
/usr/include/zypp/CheckSum.h:75:44: note: candidates are:
/usr/include/zypp/CheckSum.h:54:7: note: zypp::CheckSum::CheckSum(const
string&, std::istream)
/usr/include/zypp/CheckSum.h:50:5: note: zypp::CheckSum::CheckSum(const
string&, std::istream&)
/usr/include/zypp/CheckSum.h: In static member function ‘static zypp::CheckSum
zypp::CheckSum::sha(std::istream&)’:
/usr/include/zypp/CheckSum.h:77:45: error: call of overloaded ‘CheckSum(const
string&, std::istream&)’ is ambiguous
/usr/include/zypp/CheckSum.h:77:45: note: candidates are:
/usr/include/zypp/CheckSum.h:54:7: note: zypp::CheckSum::CheckSum(const
string&, std::istream)
/usr/include/zypp/CheckSum.h:50:5: note: zypp::CheckSum::CheckSum(const
string&, std::istream&)
/usr/include/zypp/CheckSum.h: In static member function ‘static zypp::CheckSum
zypp::CheckSum::sha1(std::istream&)’:
/usr/include/zypp/CheckSum.h:79:45: error: call of overloaded ‘CheckSum(const
string&, std::istream&)’ is ambiguous
/usr/include/zypp/CheckSum.h:79:45: note: candidates are:
/usr/include/zypp/CheckSum.h:54:7: note: zypp::CheckSum::CheckSum(const
string&, std::istream)
/usr/include/zypp/CheckSum.h:50:5: note: zypp::CheckSum::CheckSum(const
string&, std::istream&)
/usr/include/zypp/CheckSum.h: In static member function ‘static zypp::CheckSum
zypp::CheckSum::sha256(std::istream&)’:
/usr/include/zypp/CheckSum.h:81:47: error: call of overloaded ‘CheckSum(const
string&, std::istream&)’ is ambiguous
/usr/include/zypp/CheckSum.h:81:47: note: candidates are:
/usr/include/zypp/CheckSum.h:54:7: note: zypp::CheckSum::CheckSum(const
string&, std::istream)
/usr/include/zypp/CheckSum.h:50:5: note: zypp::CheckSum::CheckSum(const
string&, std::istream&)
make[2]: *** [src/CMakeFiles/qdialogsolver.dir/resgraphview.o] Error 1
In file included from /usr/include/zypp/PathInfo.h:31:0,
from /usr/include/zypp/VendorAttr.h:19,
from /usr/include/zypp/Vendor.h:28,
from /usr/include/zypp/ResObject.h:20,
from /usr/include/zypp/PoolItem.h:19,
from /usr/include/zypp/pool/PoolTraits.h:23,
from /usr/include/zypp/ResPool.h:20,
from /usr/include/zypp/Resolver.h:21,
from
<http://river.suse.de/job/dialogsolver-12.3/ws/checkout/src/restreewidget.h>:31,
from
<http://river.suse.de/job/dialogsolver-12.3/ws/checkout/src/restreewidget.cpp>:20:
/usr/include/zypp/CheckSum.h:54:56: error: expected ‘,’ or ‘...’ before ‘&&’
token
/usr/include/zypp/CheckSum.h: In constructor ‘zypp::CheckSum::CheckSum(const
string&, std::istream)’:
/usr/include/zypp/CheckSum.h:55:25: error: ‘input_r’ was not declared in this
scope
/usr/include/zypp/CheckSum.h: In static member function ‘static zypp::CheckSum
zypp::CheckSum::md5(std::istream&)’:
/usr/include/zypp/CheckSum.h:75:44: error: call of overloaded ‘CheckSum(const
string&, std::istream&)’ is ambiguous
/usr/include/zypp/CheckSum.h:75:44: note: candidates are:
/usr/include/zypp/CheckSum.h:54:7: note: zypp::CheckSum::CheckSum(const
string&, std::istream)
/usr/include/zypp/CheckSum.h:50:5: note: zypp::CheckSum::CheckSum(const
string&, std::istream&)
/usr/include/zypp/CheckSum.h: In static member function ‘static zypp::CheckSum
zypp::CheckSum::sha(std::istream&)’:
/usr/include/zypp/CheckSum.h:77:45: error: call of overloaded ‘CheckSum(const
string&, std::istream&)’ is ambiguous
/usr/include/zypp/CheckSum.h:77:45: note: candidates are:
/usr/include/zypp/CheckSum.h:54:7: note: zypp::CheckSum::CheckSum(const
string&, std::istream)
/usr/include/zypp/CheckSum.h:50:5: note: zypp::CheckSum::CheckSum(const
string&, std::istream&)
/usr/include/zypp/CheckSum.h: In static member function ‘static zypp::CheckSum
zypp::CheckSum::sha1(std::istream&)’:
/usr/include/zypp/CheckSum.h:79:45: error: call of overloaded ‘CheckSum(const
string&, std::istream&)’ is ambiguous
/usr/include/zypp/CheckSum.h:79:45: note: candidates are:
/usr/include/zypp/CheckSum.h:54:7: note: zypp::CheckSum::CheckSum(const
string&, std::istream)
/usr/include/zypp/CheckSum.h:50:5: note: zypp::CheckSum::CheckSum(const
string&, std::istream&)
/usr/include/zypp/CheckSum.h: In static member function ‘static zypp::CheckSum
zypp::CheckSum::sha256(std::istream&)’:
/usr/include/zypp/CheckSum.h:81:47: error: call of overloaded ‘CheckSum(const
string&, std::istream&)’ is ambiguous
/usr/include/zypp/CheckSum.h:81:47: note: candidates are:
/usr/include/zypp/CheckSum.h:54:7: note: zypp::CheckSum::CheckSum(const
string&, std::istream)
/usr/include/zypp/CheckSum.h:50:5: note: zypp::CheckSum::CheckSum(const
string&, std::istream&)
make[2]: *** [src/CMakeFiles/qdialogsolver.dir/restreewidget.o] Error 1
In file included from /usr/include/zypp/PathInfo.h:31:0,
from /usr/include/zypp/VendorAttr.h:19,
from /usr/include/zypp/Vendor.h:28,
from /usr/include/zypp/ResObject.h:20,
from /usr/include/zypp/PoolItem.h:19,
from /usr/include/zypp/pool/PoolTraits.h:23,
from /usr/include/zypp/ResPool.h:20,
from /usr/include/zypp/Resolver.h:21,
from
<http://river.suse.de/job/dialogsolver-12.3/ws/checkout/src/solvertree.h>:23,
from
<http://river.suse.de/job/dialogsolver-12.3/ws/checkout/src/solvertree.cpp>:27:
/usr/include/zypp/CheckSum.h:54:56: error: expected ‘,’ or ‘...’ before ‘&&’
token
/usr/include/zypp/CheckSum.h: In constructor ‘zypp::CheckSum::CheckSum(const
string&, std::istream)’:
/usr/include/zypp/CheckSum.h:55:25: error: ‘input_r’ was not declared in this
scope
/usr/include/zypp/CheckSum.h: In static member function ‘static zypp::CheckSum
zypp::CheckSum::md5(std::istream&)’:
/usr/include/zypp/CheckSum.h:75:44: error: call of overloaded ‘CheckSum(const
string&, std::istream&)’ is ambiguous
/usr/include/zypp/CheckSum.h:75:44: note: candidates are:
/usr/include/zypp/CheckSum.h:54:7: note: zypp::CheckSum::CheckSum(const
string&, std::istream)
/usr/include/zypp/CheckSum.h:50:5: note: zypp::CheckSum::CheckSum(const
string&, std::istream&)
/usr/include/zypp/CheckSum.h: In static member function ‘static zypp::CheckSum
zypp::CheckSum::sha(std::istream&)’:
/usr/include/zypp/CheckSum.h:77:45: error: call of overloaded ‘CheckSum(const
string&, std::istream&)’ is ambiguous
/usr/include/zypp/CheckSum.h:77:45: note: candidates are:
/usr/include/zypp/CheckSum.h:54:7: note: zypp::CheckSum::CheckSum(const
string&, std::istream)
/usr/include/zypp/CheckSum.h:50:5: note: zypp::CheckSum::CheckSum(const
string&, std::istream&)
/usr/include/zypp/CheckSum.h: In static member function ‘static zypp::CheckSum
zypp::CheckSum::sha1(std::istream&)’:
/usr/include/zypp/CheckSum.h:79:45: error: call of overloaded ‘CheckSum(const
string&, std::istream&)’ is ambiguous
/usr/include/zypp/CheckSum.h:79:45: note: candidates are:
/usr/include/zypp/CheckSum.h:54:7: note: zypp::CheckSum::CheckSum(const
string&, std::istream)
/usr/include/zypp/CheckSum.h:50:5: note: zypp::CheckSum::CheckSum(const
string&, std::istream&)
/usr/include/zypp/CheckSum.h: In static member function ‘static zypp::CheckSum
zypp::CheckSum::sha256(std::istream&)’:
/usr/include/zypp/CheckSum.h:81:47: error: call of overloaded ‘CheckSum(const
string&, std::istream&)’ is ambiguous
/usr/include/zypp/CheckSum.h:81:47: note: candidates are:
/usr/include/zypp/CheckSum.h:54:7: note: zypp::CheckSum::CheckSum(const
string&, std::istream)
/usr/include/zypp/CheckSum.h:50:5: note: zypp::CheckSum::CheckSum(const
string&, std::istream&)
make[2]: *** [src/CMakeFiles/qdialogsolver.dir/solvertree.o] Error 1
make[1]: *** [src/CMakeFiles/qdialogsolver.dir/all] Error 2
make: *** [all] Error 2
Build step 'Execute shell' marked build as failure
Archiving artifacts
--
To unsubscribe, e-mail: zypp-commit+unsubscribe@xxxxxxxxxxxx
For additional commands, e-mail: zypp-commit+help@xxxxxxxxxxxx

< Previous Next >
Follow Ups