Mailinglist Archive: zypp-commit (93 mails)

< Previous Next >
[zypp-commit] Build failed in Jenkins: libzypp-12.3 #1
  • From: hudson@xxxxxxx
  • Date: Fri, 15 Mar 2013 12:19:13 +0100 (CET)
  • Message-id: <1518874046.2524.1363346354035.JavaMail.jenkins@river>
See <http://river.suse.de/job/libzypp-12.3/1/>

------------------------------------------
[...truncated 25619 lines...]
from
<http://river.suse.de/job/libzypp-12.3/ws/checkout/zypp/base/Iterator.h>:18,
from
<http://river.suse.de/job/libzypp-12.3/ws/checkout/zypp/base/LogTools.h>:24,
from
<http://river.suse.de/job/libzypp-12.3/ws/checkout/zypp/pool/GetResolvablesToInsDel.cc>:15:
/usr/include/c++/4.7/tuple:819:5: note: template<class ... _TElements, class
... _UElements> bool std::operator!=(const std::tuple<_Args1 ...>&, const
std::tuple<_Args2 ...>&)
/usr/include/c++/4.7/tuple:819:5: note: template argument
deduction/substitution failed:
In file included from
<http://river.suse.de/job/libzypp-12.3/ws/checkout/zypp/base/Iterator.h>:19:0,
from
<http://river.suse.de/job/libzypp-12.3/ws/checkout/zypp/base/LogTools.h>:24,
from
<http://river.suse.de/job/libzypp-12.3/ws/checkout/zypp/pool/GetResolvablesToInsDel.cc>:15:
/usr/include/boost/iterator/filter_iterator.hpp:100:11: note: ‘const
boost::transform_iterator<zypp::GetPairSecond<std::pair<const zypp::ResKind,
boost::intrusive_ptr<zypp::ui::Selectable> > >,
std::_Rb_tree_const_iterator<std::pair<const zypp::ResKind,
boost::intrusive_ptr<zypp::ui::Selectable> > >, boost::use_default,
boost::use_default>’ is not derived from ‘const std::tuple<_Args1 ...>’
In file included from /usr/include/c++/4.7/iterator:66:0,
from
<http://river.suse.de/job/libzypp-12.3/ws/checkout/zypp/base/Iterator.h>:15,
from
<http://river.suse.de/job/libzypp-12.3/ws/checkout/zypp/base/LogTools.h>:24,
from
<http://river.suse.de/job/libzypp-12.3/ws/checkout/zypp/pool/GetResolvablesToInsDel.cc>:15:
/usr/include/c++/4.7/bits/stream_iterator.h:137:5: note: template<class _Tp,
class _CharT, class _Traits, class _Dist> bool std::operator!=(const
std::istream_iterator<_Tp, _CharT, _Traits, _Dist>&, const
std::istream_iterator<_Tp, _CharT, _Traits, _Dist>&)
/usr/include/c++/4.7/bits/stream_iterator.h:137:5: note: template argument
deduction/substitution failed:
In file included from
<http://river.suse.de/job/libzypp-12.3/ws/checkout/zypp/base/Iterator.h>:19:0,
from
<http://river.suse.de/job/libzypp-12.3/ws/checkout/zypp/base/LogTools.h>:24,
from
<http://river.suse.de/job/libzypp-12.3/ws/checkout/zypp/pool/GetResolvablesToInsDel.cc>:15:
/usr/include/boost/iterator/filter_iterator.hpp:100:11: note: ‘const
boost::transform_iterator<zypp::GetPairSecond<std::pair<const zypp::ResKind,
boost::intrusive_ptr<zypp::ui::Selectable> > >,
std::_Rb_tree_const_iterator<std::pair<const zypp::ResKind,
boost::intrusive_ptr<zypp::ui::Selectable> > >, boost::use_default,
boost::use_default>’ is not derived from ‘const std::istream_iterator<_Tp,
_CharT, _Traits, _Dist>’
In file included from /usr/include/c++/4.7/map:62:0,
from
<http://river.suse.de/job/libzypp-12.3/ws/checkout/zypp/base/LogTools.h>:20,
from
<http://river.suse.de/job/libzypp-12.3/ws/checkout/zypp/pool/GetResolvablesToInsDel.cc>:15:
/usr/include/c++/4.7/bits/stl_multimap.h:829:5: note: template<class _Key,
class _Tp, class _Compare, class _Alloc> bool std::operator!=(const
std::multimap<_Key, _Tp, _Compare, _Alloc>&, const std::multimap<_Key, _Tp,
_Compare, _Alloc>&)
/usr/include/c++/4.7/bits/stl_multimap.h:829:5: note: template argument
deduction/substitution failed:
In file included from
<http://river.suse.de/job/libzypp-12.3/ws/checkout/zypp/base/Iterator.h>:19:0,
from
<http://river.suse.de/job/libzypp-12.3/ws/checkout/zypp/base/LogTools.h>:24,
from
<http://river.suse.de/job/libzypp-12.3/ws/checkout/zypp/pool/GetResolvablesToInsDel.cc>:15:
/usr/include/boost/iterator/filter_iterator.hpp:100:11: note: ‘const
boost::transform_iterator<zypp::GetPairSecond<std::pair<const zypp::ResKind,
boost::intrusive_ptr<zypp::ui::Selectable> > >,
std::_Rb_tree_const_iterator<std::pair<const zypp::ResKind,
boost::intrusive_ptr<zypp::ui::Selectable> > >, boost::use_default,
boost::use_default>’ is not derived from ‘const std::multimap<_Key, _Tp,
_Compare, _Alloc>’
In file included from /usr/include/c++/4.7/map:61:0,
from
<http://river.suse.de/job/libzypp-12.3/ws/checkout/zypp/base/LogTools.h>:20,
from
<http://river.suse.de/job/libzypp-12.3/ws/checkout/zypp/pool/GetResolvablesToInsDel.cc>:15:
/usr/include/c++/4.7/bits/stl_map.h:913:5: note: template<class _Key, class
_Tp, class _Compare, class _Alloc> bool std::operator!=(const std::map<_Key,
_Tp, _Compare, _Alloc>&, const std::map<_Key, _Tp, _Compare, _Alloc>&)
/usr/include/c++/4.7/bits/stl_map.h:913:5: note: template argument
deduction/substitution failed:
In file included from
<http://river.suse.de/job/libzypp-12.3/ws/checkout/zypp/base/Iterator.h>:19:0,
from
<http://river.suse.de/job/libzypp-12.3/ws/checkout/zypp/base/LogTools.h>:24,
from
<http://river.suse.de/job/libzypp-12.3/ws/checkout/zypp/pool/GetResolvablesToInsDel.cc>:15:
/usr/include/boost/iterator/filter_iterator.hpp:100:11: note: ‘const
boost::transform_iterator<zypp::GetPairSecond<std::pair<const zypp::ResKind,
boost::intrusive_ptr<zypp::ui::Selectable> > >,
std::_Rb_tree_const_iterator<std::pair<const zypp::ResKind,
boost::intrusive_ptr<zypp::ui::Selectable> > >, boost::use_default,
boost::use_default>’ is not derived from ‘const std::map<_Key, _Tp, _Compare,
_Alloc>’
In file included from /usr/include/c++/4.7/list:64:0,
from
<http://river.suse.de/job/libzypp-12.3/ws/checkout/zypp/base/LogTools.h>:18,
from
<http://river.suse.de/job/libzypp-12.3/ws/checkout/zypp/pool/GetResolvablesToInsDel.cc>:15:
/usr/include/c++/4.7/bits/stl_list.h:1610:5: note: template<class _Tp, class
_Alloc> bool std::operator!=(const std::list<_Tp, _Alloc>&, const
std::list<_Tp, _Alloc>&)
/usr/include/c++/4.7/bits/stl_list.h:1610:5: note: template argument
deduction/substitution failed:
In file included from
<http://river.suse.de/job/libzypp-12.3/ws/checkout/zypp/base/Iterator.h>:19:0,
from
<http://river.suse.de/job/libzypp-12.3/ws/checkout/zypp/base/LogTools.h>:24,
from
<http://river.suse.de/job/libzypp-12.3/ws/checkout/zypp/pool/GetResolvablesToInsDel.cc>:15:
/usr/include/boost/iterator/filter_iterator.hpp:100:11: note: ‘const
boost::transform_iterator<zypp::GetPairSecond<std::pair<const zypp::ResKind,
boost::intrusive_ptr<zypp::ui::Selectable> > >,
std::_Rb_tree_const_iterator<std::pair<const zypp::ResKind,
boost::intrusive_ptr<zypp::ui::Selectable> > >, boost::use_default,
boost::use_default>’ is not derived from ‘const std::list<_Tp, _Alloc>’
In file included from /usr/include/c++/4.7/list:64:0,
from
<http://river.suse.de/job/libzypp-12.3/ws/checkout/zypp/base/LogTools.h>:18,
from
<http://river.suse.de/job/libzypp-12.3/ws/checkout/zypp/pool/GetResolvablesToInsDel.cc>:15:
/usr/include/c++/4.7/bits/stl_list.h:283:5: note: template<class _Val> bool
std::operator!=(const std::_List_iterator<_Tp>&, const
std::_List_const_iterator<_Val>&)
/usr/include/c++/4.7/bits/stl_list.h:283:5: note: template argument
deduction/substitution failed:
In file included from
<http://river.suse.de/job/libzypp-12.3/ws/checkout/zypp/base/Iterator.h>:19:0,
from
<http://river.suse.de/job/libzypp-12.3/ws/checkout/zypp/base/LogTools.h>:24,
from
<http://river.suse.de/job/libzypp-12.3/ws/checkout/zypp/pool/GetResolvablesToInsDel.cc>:15:
/usr/include/boost/iterator/filter_iterator.hpp:100:11: note: ‘const
boost::transform_iterator<zypp::GetPairSecond<std::pair<const zypp::ResKind,
boost::intrusive_ptr<zypp::ui::Selectable> > >,
std::_Rb_tree_const_iterator<std::pair<const zypp::ResKind,
boost::intrusive_ptr<zypp::ui::Selectable> > >, boost::use_default,
boost::use_default>’ is not derived from ‘const std::_List_iterator<_Tp>’
In file included from /usr/include/c++/4.7/vector:65:0,
from
<http://river.suse.de/job/libzypp-12.3/ws/checkout/zypp/base/LogTools.h>:17,
from
<http://river.suse.de/job/libzypp-12.3/ws/checkout/zypp/pool/GetResolvablesToInsDel.cc>:15:
/usr/include/c++/4.7/bits/stl_vector.h:1394:5: note: template<class _Tp, class
_Alloc> bool std::operator!=(const std::vector<_Tp, _Alloc>&, const
std::vector<_Tp, _Alloc>&)
/usr/include/c++/4.7/bits/stl_vector.h:1394:5: note: template argument
deduction/substitution failed:
In file included from
<http://river.suse.de/job/libzypp-12.3/ws/checkout/zypp/base/Iterator.h>:19:0,
from
<http://river.suse.de/job/libzypp-12.3/ws/checkout/zypp/base/LogTools.h>:24,
from
<http://river.suse.de/job/libzypp-12.3/ws/checkout/zypp/pool/GetResolvablesToInsDel.cc>:15:
/usr/include/boost/iterator/filter_iterator.hpp:100:11: note: ‘const
boost::transform_iterator<zypp::GetPairSecond<std::pair<const zypp::ResKind,
boost::intrusive_ptr<zypp::ui::Selectable> > >,
std::_Rb_tree_const_iterator<std::pair<const zypp::ResKind,
boost::intrusive_ptr<zypp::ui::Selectable> > >, boost::use_default,
boost::use_default>’ is not derived from ‘const std::vector<_Tp, _Alloc>’
In file included from /usr/include/c++/4.7/set:62:0,
from
<http://river.suse.de/job/libzypp-12.3/ws/checkout/zypp/pool/GetResolvablesToInsDel.cc>:13:
/usr/include/c++/4.7/bits/stl_multiset.h:709:5: note: template<class _Key,
class _Compare, class _Alloc> bool std::operator!=(const std::multiset<_Key,
_Compare, _Alloc>&, const std::multiset<_Key, _Compare, _Alloc>&)
/usr/include/c++/4.7/bits/stl_multiset.h:709:5: note: template argument
deduction/substitution failed:
In file included from
<http://river.suse.de/job/libzypp-12.3/ws/checkout/zypp/base/Iterator.h>:19:0,
from
<http://river.suse.de/job/libzypp-12.3/ws/checkout/zypp/base/LogTools.h>:24,
from
<http://river.suse.de/job/libzypp-12.3/ws/checkout/zypp/pool/GetResolvablesToInsDel.cc>:15:
/usr/include/boost/iterator/filter_iterator.hpp:100:11: note: ‘const
boost::transform_iterator<zypp::GetPairSecond<std::pair<const zypp::ResKind,
boost::intrusive_ptr<zypp::ui::Selectable> > >,
std::_Rb_tree_const_iterator<std::pair<const zypp::ResKind,
boost::intrusive_ptr<zypp::ui::Selectable> > >, boost::use_default,
boost::use_default>’ is not derived from ‘const std::multiset<_Key, _Compare,
_Alloc>’
In file included from /usr/include/c++/4.7/set:61:0,
from
<http://river.suse.de/job/libzypp-12.3/ws/checkout/zypp/pool/GetResolvablesToInsDel.cc>:13:
/usr/include/c++/4.7/bits/stl_set.h:728:5: note: template<class _Key, class
_Compare, class _Alloc> bool std::operator!=(const std::set<_Key, _Compare,
_Alloc>&, const std::set<_Key, _Compare, _Alloc>&)
/usr/include/c++/4.7/bits/stl_set.h:728:5: note: template argument
deduction/substitution failed:
In file included from
<http://river.suse.de/job/libzypp-12.3/ws/checkout/zypp/base/Iterator.h>:19:0,
from
<http://river.suse.de/job/libzypp-12.3/ws/checkout/zypp/base/LogTools.h>:24,
from
<http://river.suse.de/job/libzypp-12.3/ws/checkout/zypp/pool/GetResolvablesToInsDel.cc>:15:
/usr/include/boost/iterator/filter_iterator.hpp:100:11: note: ‘const
boost::transform_iterator<zypp::GetPairSecond<std::pair<const zypp::ResKind,
boost::intrusive_ptr<zypp::ui::Selectable> > >,
std::_Rb_tree_const_iterator<std::pair<const zypp::ResKind,
boost::intrusive_ptr<zypp::ui::Selectable> > >, boost::use_default,
boost::use_default>’ is not derived from ‘const std::set<_Key, _Compare,
_Alloc>’
In file included from /usr/include/c++/4.7/set:60:0,
from
<http://river.suse.de/job/libzypp-12.3/ws/checkout/zypp/pool/GetResolvablesToInsDel.cc>:13:
/usr/include/c++/4.7/bits/stl_tree.h:883:5: note: template<class _Key, class
_Val, class _KeyOfValue, class _Compare, class _Alloc> bool
std::operator!=(const std::_Rb_tree<_Key, _Val, _KeyOfValue, _Compare,
_Alloc>&, const std::_Rb_tree<_Key, _Val, _KeyOfValue, _Compare, _Alloc>&)
/usr/include/c++/4.7/bits/stl_tree.h:883:5: note: template argument
deduction/substitution failed:
In file included from
<http://river.suse.de/job/libzypp-12.3/ws/checkout/zypp/base/Iterator.h>:19:0,
from
<http://river.suse.de/job/libzypp-12.3/ws/checkout/zypp/base/LogTools.h>:24,
from
<http://river.suse.de/job/libzypp-12.3/ws/checkout/zypp/pool/GetResolvablesToInsDel.cc>:15:
/usr/include/boost/iterator/filter_iterator.hpp:100:11: note: ‘const
boost::transform_iterator<zypp::GetPairSecond<std::pair<const zypp::ResKind,
boost::intrusive_ptr<zypp::ui::Selectable> > >,
std::_Rb_tree_const_iterator<std::pair<const zypp::ResKind,
boost::intrusive_ptr<zypp::ui::Selectable> > >, boost::use_default,
boost::use_default>’ is not derived from ‘const std::_Rb_tree<_Key, _Val,
_KeyOfValue, _Compare, _Alloc>’
In file included from /usr/include/c++/4.7/set:60:0,
from
<http://river.suse.de/job/libzypp-12.3/ws/checkout/zypp/pool/GetResolvablesToInsDel.cc>:13:
/usr/include/c++/4.7/bits/stl_tree.h:315:5: note: template<class _Val> bool
std::operator!=(const std::_Rb_tree_iterator<_Tp>&, const
std::_Rb_tree_const_iterator<_Val>&)
/usr/include/c++/4.7/bits/stl_tree.h:315:5: note: template argument
deduction/substitution failed:
In file included from
<http://river.suse.de/job/libzypp-12.3/ws/checkout/zypp/base/Iterator.h>:19:0,
from
<http://river.suse.de/job/libzypp-12.3/ws/checkout/zypp/base/LogTools.h>:24,
from
<http://river.suse.de/job/libzypp-12.3/ws/checkout/zypp/pool/GetResolvablesToInsDel.cc>:15:
/usr/include/boost/iterator/filter_iterator.hpp:100:11: note: ‘const
boost::transform_iterator<zypp::GetPairSecond<std::pair<const zypp::ResKind,
boost::intrusive_ptr<zypp::ui::Selectable> > >,
std::_Rb_tree_const_iterator<std::pair<const zypp::ResKind,
boost::intrusive_ptr<zypp::ui::Selectable> > >, boost::use_default,
boost::use_default>’ is not derived from ‘const std::_Rb_tree_iterator<_Tp>’
In file included from /usr/include/c++/4.7/bits/locale_facets.h:50:0,
from /usr/include/c++/4.7/bits/basic_ios.h:39,
from /usr/include/c++/4.7/ios:45,
from /usr/include/c++/4.7/ostream:40,
from /usr/include/c++/4.7/iostream:40,
from
<http://river.suse.de/job/libzypp-12.3/ws/checkout/zypp/pool/GetResolvablesToInsDel.cc>:12:
/usr/include/c++/4.7/bits/streambuf_iterator.h:212:5: note: template<class
_CharT, class _Traits> bool std::operator!=(const
std::istreambuf_iterator<_CharT, _Traits>&, const
std::istreambuf_iterator<_CharT, _Traits>&)
/usr/include/c++/4.7/bits/streambuf_iterator.h:212:5: note: template argument
deduction/substitution failed:
In file included from
<http://river.suse.de/job/libzypp-12.3/ws/checkout/zypp/base/Iterator.h>:19:0,
from
<http://river.suse.de/job/libzypp-12.3/ws/checkout/zypp/base/LogTools.h>:24,
from
<http://river.suse.de/job/libzypp-12.3/ws/checkout/zypp/pool/GetResolvablesToInsDel.cc>:15:
/usr/include/boost/iterator/filter_iterator.hpp:100:11: note: ‘const
boost::transform_iterator<zypp::GetPairSecond<std::pair<const zypp::ResKind,
boost::intrusive_ptr<zypp::ui::Selectable> > >,
std::_Rb_tree_const_iterator<std::pair<const zypp::ResKind,
boost::intrusive_ptr<zypp::ui::Selectable> > >, boost::use_default,
boost::use_default>’ is not derived from ‘const
std::istreambuf_iterator<_CharT, _Traits>’
In file included from /usr/include/c++/4.7/string:54:0,
from /usr/include/c++/4.7/bits/locale_classes.h:42,
from /usr/include/c++/4.7/bits/ios_base.h:43,
from /usr/include/c++/4.7/ios:43,
from /usr/include/c++/4.7/ostream:40,
from /usr/include/c++/4.7/iostream:40,
from
<http://river.suse.de/job/libzypp-12.3/ws/checkout/zypp/pool/GetResolvablesToInsDel.cc>:12:
/usr/include/c++/4.7/bits/basic_string.h:2553:5: note: template<class _CharT,
class _Traits, class _Alloc> bool std::operator!=(const
std::basic_string<_CharT, _Traits, _Alloc>&, const _CharT*)
/usr/include/c++/4.7/bits/basic_string.h:2553:5: note: template argument
deduction/substitution failed:
In file included from
<http://river.suse.de/job/libzypp-12.3/ws/checkout/zypp/base/Iterator.h>:19:0,
from
<http://river.suse.de/job/libzypp-12.3/ws/checkout/zypp/base/LogTools.h>:24,
from
<http://river.suse.de/job/libzypp-12.3/ws/checkout/zypp/pool/GetResolvablesToInsDel.cc>:15:
/usr/include/boost/iterator/filter_iterator.hpp:100:11: note: ‘const
boost::transform_iterator<zypp::GetPairSecond<std::pair<const zypp::ResKind,
boost::intrusive_ptr<zypp::ui::Selectable> > >,
std::_Rb_tree_const_iterator<std::pair<const zypp::ResKind,
boost::intrusive_ptr<zypp::ui::Selectable> > >, boost::use_default,
boost::use_default>’ is not derived from ‘const std::basic_string<_CharT,
_Traits, _Alloc>’
In file included from /usr/include/c++/4.7/string:54:0,
from /usr/include/c++/4.7/bits/locale_classes.h:42,
from /usr/include/c++/4.7/bits/ios_base.h:43,
from /usr/include/c++/4.7/ios:43,
from /usr/include/c++/4.7/ostream:40,
from /usr/include/c++/4.7/iostream:40,
from
<http://river.suse.de/job/libzypp-12.3/ws/checkout/zypp/pool/GetResolvablesToInsDel.cc>:12:
/usr/include/c++/4.7/bits/basic_string.h:2541:5: note: template<class _CharT,
class _Traits, class _Alloc> bool std::operator!=(const _CharT*, const
std::basic_string<_CharT, _Traits, _Alloc>&)
/usr/include/c++/4.7/bits/basic_string.h:2541:5: note: template argument
deduction/substitution failed:
In file included from
<http://river.suse.de/job/libzypp-12.3/ws/checkout/zypp/base/Iterator.h>:19:0,
from
<http://river.suse.de/job/libzypp-12.3/ws/checkout/zypp/base/LogTools.h>:24,
from
<http://river.suse.de/job/libzypp-12.3/ws/checkout/zypp/pool/GetResolvablesToInsDel.cc>:15:
/usr/include/boost/iterator/filter_iterator.hpp:100:11: note: mismatched
types ‘const _CharT*’ and
‘boost::transform_iterator<zypp::GetPairSecond<std::pair<const zypp::ResKind,
boost::intrusive_ptr<zypp::ui::Selectable> > >,
std::_Rb_tree_const_iterator<std::pair<const zypp::ResKind,
boost::intrusive_ptr<zypp::ui::Selectable> > >, boost::use_default,
boost::use_default>’
In file included from /usr/include/c++/4.7/string:54:0,
from /usr/include/c++/4.7/bits/locale_classes.h:42,
from /usr/include/c++/4.7/bits/ios_base.h:43,
from /usr/include/c++/4.7/ios:43,
from /usr/include/c++/4.7/ostream:40,
from /usr/include/c++/4.7/iostream:40,
from
<http://river.suse.de/job/libzypp-12.3/ws/checkout/zypp/pool/GetResolvablesToInsDel.cc>:12:
/usr/include/c++/4.7/bits/basic_string.h:2529:5: note: template<class _CharT,
class _Traits, class _Alloc> bool std::operator!=(const
std::basic_string<_CharT, _Traits, _Alloc>&, const std::basic_string<_CharT,
_Traits, _Alloc>&)
/usr/include/c++/4.7/bits/basic_string.h:2529:5: note: template argument
deduction/substitution failed:
In file included from
<http://river.suse.de/job/libzypp-12.3/ws/checkout/zypp/base/Iterator.h>:19:0,
from
<http://river.suse.de/job/libzypp-12.3/ws/checkout/zypp/base/LogTools.h>:24,
from
<http://river.suse.de/job/libzypp-12.3/ws/checkout/zypp/pool/GetResolvablesToInsDel.cc>:15:
/usr/include/boost/iterator/filter_iterator.hpp:100:11: note: ‘const
boost::transform_iterator<zypp::GetPairSecond<std::pair<const zypp::ResKind,
boost::intrusive_ptr<zypp::ui::Selectable> > >,
std::_Rb_tree_const_iterator<std::pair<const zypp::ResKind,
boost::intrusive_ptr<zypp::ui::Selectable> > >, boost::use_default,
boost::use_default>’ is not derived from ‘const std::basic_string<_CharT,
_Traits, _Alloc>’
In file included from /usr/include/c++/4.7/string:43:0,
from /usr/include/c++/4.7/bits/locale_classes.h:42,
from /usr/include/c++/4.7/bits/ios_base.h:43,
from /usr/include/c++/4.7/ios:43,
from /usr/include/c++/4.7/ostream:40,
from /usr/include/c++/4.7/iostream:40,
from
<http://river.suse.de/job/libzypp-12.3/ws/checkout/zypp/pool/GetResolvablesToInsDel.cc>:12:
/usr/include/c++/4.7/bits/allocator.h:134:5: note: template<class _Tp> bool
std::operator!=(const std::allocator<_CharT>&, const std::allocator<_CharT>&)
/usr/include/c++/4.7/bits/allocator.h:134:5: note: template argument
deduction/substitution failed:
In file included from
<http://river.suse.de/job/libzypp-12.3/ws/checkout/zypp/base/Iterator.h>:19:0,
from
<http://river.suse.de/job/libzypp-12.3/ws/checkout/zypp/base/LogTools.h>:24,
from
<http://river.suse.de/job/libzypp-12.3/ws/checkout/zypp/pool/GetResolvablesToInsDel.cc>:15:
/usr/include/boost/iterator/filter_iterator.hpp:100:11: note: ‘const
boost::transform_iterator<zypp::GetPairSecond<std::pair<const zypp::ResKind,
boost::intrusive_ptr<zypp::ui::Selectable> > >,
std::_Rb_tree_const_iterator<std::pair<const zypp::ResKind,
boost::intrusive_ptr<zypp::ui::Selectable> > >, boost::use_default,
boost::use_default>’ is not derived from ‘const std::allocator<_CharT>’
In file included from /usr/include/c++/4.7/string:43:0,
from /usr/include/c++/4.7/bits/locale_classes.h:42,
from /usr/include/c++/4.7/bits/ios_base.h:43,
from /usr/include/c++/4.7/ios:43,
from /usr/include/c++/4.7/ostream:40,
from /usr/include/c++/4.7/iostream:40,
from
<http://river.suse.de/job/libzypp-12.3/ws/checkout/zypp/pool/GetResolvablesToInsDel.cc>:12:
/usr/include/c++/4.7/bits/allocator.h:129:5: note: template<class _T1, class
_T2> bool std::operator!=(const std::allocator<_CharT>&, const
std::allocator<_T2>&)
/usr/include/c++/4.7/bits/allocator.h:129:5: note: template argument
deduction/substitution failed:
In file included from
<http://river.suse.de/job/libzypp-12.3/ws/checkout/zypp/base/Iterator.h>:19:0,
from
<http://river.suse.de/job/libzypp-12.3/ws/checkout/zypp/base/LogTools.h>:24,
from
<http://river.suse.de/job/libzypp-12.3/ws/checkout/zypp/pool/GetResolvablesToInsDel.cc>:15:
/usr/include/boost/iterator/filter_iterator.hpp:100:11: note: ‘const
boost::transform_iterator<zypp::GetPairSecond<std::pair<const zypp::ResKind,
boost::intrusive_ptr<zypp::ui::Selectable> > >,
std::_Rb_tree_const_iterator<std::pair<const zypp::ResKind,
boost::intrusive_ptr<zypp::ui::Selectable> > >, boost::use_default,
boost::use_default>’ is not derived from ‘const std::allocator<_CharT>’
In file included from /usr/include/c++/4.7/bits/stl_algobase.h:68:0,
from /usr/include/c++/4.7/bits/char_traits.h:41,
from /usr/include/c++/4.7/ios:41,
from /usr/include/c++/4.7/ostream:40,
from /usr/include/c++/4.7/iostream:40,
from
<http://river.suse.de/job/libzypp-12.3/ws/checkout/zypp/pool/GetResolvablesToInsDel.cc>:12:
/usr/include/c++/4.7/bits/stl_iterator.h:1051:5: note: template<class
_Iterator> bool std::operator!=(const std::move_iterator<_Iterator>&, const
std::move_iterator<_Iterator>&)
/usr/include/c++/4.7/bits/stl_iterator.h:1051:5: note: template argument
deduction/substitution failed:
In file included from
<http://river.suse.de/job/libzypp-12.3/ws/checkout/zypp/base/Iterator.h>:19:0,
from
<http://river.suse.de/job/libzypp-12.3/ws/checkout/zypp/base/LogTools.h>:24,
from
<http://river.suse.de/job/libzypp-12.3/ws/checkout/zypp/pool/GetResolvablesToInsDel.cc>:15:
/usr/include/boost/iterator/filter_iterator.hpp:100:11: note: ‘const
boost::transform_iterator<zypp::GetPairSecond<std::pair<const zypp::ResKind,
boost::intrusive_ptr<zypp::ui::Selectable> > >,
std::_Rb_tree_const_iterator<std::pair<const zypp::ResKind,
boost::intrusive_ptr<zypp::ui::Selectable> > >, boost::use_default,
boost::use_default>’ is not derived from ‘const std::move_iterator<_Iterator>’
In file included from /usr/include/c++/4.7/bits/stl_algobase.h:68:0,
from /usr/include/c++/4.7/bits/char_traits.h:41,
from /usr/include/c++/4.7/ios:41,
from /usr/include/c++/4.7/ostream:40,
from /usr/include/c++/4.7/iostream:40,
from
<http://river.suse.de/job/libzypp-12.3/ws/checkout/zypp/pool/GetResolvablesToInsDel.cc>:12:
/usr/include/c++/4.7/bits/stl_iterator.h:1045:5: note: template<class
_IteratorL, class _IteratorR> bool std::operator!=(const
std::move_iterator<_Iterator>&, const std::move_iterator<_IteratorR>&)
/usr/include/c++/4.7/bits/stl_iterator.h:1045:5: note: template argument
deduction/substitution failed:
In file included from
<http://river.suse.de/job/libzypp-12.3/ws/checkout/zypp/base/Iterator.h>:19:0,
from
<http://river.suse.de/job/libzypp-12.3/ws/checkout/zypp/base/LogTools.h>:24,
from
<http://river.suse.de/job/libzypp-12.3/ws/checkout/zypp/pool/GetResolvablesToInsDel.cc>:15:
/usr/include/boost/iterator/filter_iterator.hpp:100:11: note: ‘const
boost::transform_iterator<zypp::GetPairSecond<std::pair<const zypp::ResKind,
boost::intrusive_ptr<zypp::ui::Selectable> > >,
std::_Rb_tree_const_iterator<std::pair<const zypp::ResKind,
boost::intrusive_ptr<zypp::ui::Selectable> > >, boost::use_default,
boost::use_default>’ is not derived from ‘const std::move_iterator<_Iterator>’
In file included from /usr/include/c++/4.7/bits/stl_algobase.h:68:0,
from /usr/include/c++/4.7/bits/char_traits.h:41,
from /usr/include/c++/4.7/ios:41,
from /usr/include/c++/4.7/ostream:40,
from /usr/include/c++/4.7/iostream:40,
from
<http://river.suse.de/job/libzypp-12.3/ws/checkout/zypp/pool/GetResolvablesToInsDel.cc>:12:
/usr/include/c++/4.7/bits/stl_iterator.h:355:5: note: template<class
_IteratorL, class _IteratorR> bool std::operator!=(const
std::reverse_iterator<_Iterator>&, const std::reverse_iterator<_IteratorR>&)
/usr/include/c++/4.7/bits/stl_iterator.h:355:5: note: template argument
deduction/substitution failed:
In file included from
<http://river.suse.de/job/libzypp-12.3/ws/checkout/zypp/base/Iterator.h>:19:0,
from
<http://river.suse.de/job/libzypp-12.3/ws/checkout/zypp/base/LogTools.h>:24,
from
<http://river.suse.de/job/libzypp-12.3/ws/checkout/zypp/pool/GetResolvablesToInsDel.cc>:15:
/usr/include/boost/iterator/filter_iterator.hpp:100:11: note: ‘const
boost::transform_iterator<zypp::GetPairSecond<std::pair<const zypp::ResKind,
boost::intrusive_ptr<zypp::ui::Selectable> > >,
std::_Rb_tree_const_iterator<std::pair<const zypp::ResKind,
boost::intrusive_ptr<zypp::ui::Selectable> > >, boost::use_default,
boost::use_default>’ is not derived from ‘const
std::reverse_iterator<_Iterator>’
In file included from /usr/include/c++/4.7/bits/stl_algobase.h:68:0,
from /usr/include/c++/4.7/bits/char_traits.h:41,
from /usr/include/c++/4.7/ios:41,
from /usr/include/c++/4.7/ostream:40,
from /usr/include/c++/4.7/iostream:40,
from
<http://river.suse.de/job/libzypp-12.3/ws/checkout/zypp/pool/GetResolvablesToInsDel.cc>:12:
/usr/include/c++/4.7/bits/stl_iterator.h:305:5: note: template<class _Iterator>
bool std::operator!=(const std::reverse_iterator<_Iterator>&, const
std::reverse_iterator<_Iterator>&)
/usr/include/c++/4.7/bits/stl_iterator.h:305:5: note: template argument
deduction/substitution failed:
In file included from
<http://river.suse.de/job/libzypp-12.3/ws/checkout/zypp/base/Iterator.h>:19:0,
from
<http://river.suse.de/job/libzypp-12.3/ws/checkout/zypp/base/LogTools.h>:24,
from
<http://river.suse.de/job/libzypp-12.3/ws/checkout/zypp/pool/GetResolvablesToInsDel.cc>:15:
/usr/include/boost/iterator/filter_iterator.hpp:100:11: note: ‘const
boost::transform_iterator<zypp::GetPairSecond<std::pair<const zypp::ResKind,
boost::intrusive_ptr<zypp::ui::Selectable> > >,
std::_Rb_tree_const_iterator<std::pair<const zypp::ResKind,
boost::intrusive_ptr<zypp::ui::Selectable> > >, boost::use_default,
boost::use_default>’ is not derived from ‘const
std::reverse_iterator<_Iterator>’
In file included from /usr/include/c++/4.7/bits/stl_algobase.h:65:0,
from /usr/include/c++/4.7/bits/char_traits.h:41,
from /usr/include/c++/4.7/ios:41,
from /usr/include/c++/4.7/ostream:40,
from /usr/include/c++/4.7/iostream:40,
from
<http://river.suse.de/job/libzypp-12.3/ws/checkout/zypp/pool/GetResolvablesToInsDel.cc>:12:
/usr/include/c++/4.7/bits/stl_pair.h:219:5: note: template<class _T1, class
_T2> constexpr bool std::operator!=(const std::pair<_T1, _T2>&, const
std::pair<_T1, _T2>&)
/usr/include/c++/4.7/bits/stl_pair.h:219:5: note: template argument
deduction/substitution failed:
In file included from
<http://river.suse.de/job/libzypp-12.3/ws/checkout/zypp/base/Iterator.h>:19:0,
from
<http://river.suse.de/job/libzypp-12.3/ws/checkout/zypp/base/LogTools.h>:24,
from
<http://river.suse.de/job/libzypp-12.3/ws/checkout/zypp/pool/GetResolvablesToInsDel.cc>:15:
/usr/include/boost/iterator/filter_iterator.hpp:100:11: note: ‘const
boost::transform_iterator<zypp::GetPairSecond<std::pair<const zypp::ResKind,
boost::intrusive_ptr<zypp::ui::Selectable> > >,
std::_Rb_tree_const_iterator<std::pair<const zypp::ResKind,
boost::intrusive_ptr<zypp::ui::Selectable> > >, boost::use_default,
boost::use_default>’ is not derived from ‘const std::pair<_T1, _T2>’
In file included from /usr/include/c++/4.7/iosfwd:42:0,
from /usr/include/c++/4.7/ios:39,
from /usr/include/c++/4.7/ostream:40,
from /usr/include/c++/4.7/iostream:40,
from
<http://river.suse.de/job/libzypp-12.3/ws/checkout/zypp/pool/GetResolvablesToInsDel.cc>:12:
/usr/include/c++/4.7/bits/postypes.h:223:5: note: template<class _StateT> bool
std::operator!=(const std::fpos<_StateT>&, const std::fpos<_StateT>&)
/usr/include/c++/4.7/bits/postypes.h:223:5: note: template argument
deduction/substitution failed:
In file included from
<http://river.suse.de/job/libzypp-12.3/ws/checkout/zypp/base/Iterator.h>:19:0,
from
<http://river.suse.de/job/libzypp-12.3/ws/checkout/zypp/base/LogTools.h>:24,
from
<http://river.suse.de/job/libzypp-12.3/ws/checkout/zypp/pool/GetResolvablesToInsDel.cc>:15:
/usr/include/boost/iterator/filter_iterator.hpp:100:11: note: ‘const
boost::transform_iterator<zypp::GetPairSecond<std::pair<const zypp::ResKind,
boost::intrusive_ptr<zypp::ui::Selectable> > >,
std::_Rb_tree_const_iterator<std::pair<const zypp::ResKind,
boost::intrusive_ptr<zypp::ui::Selectable> > >, boost::use_default,
boost::use_default>’ is not derived from ‘const std::fpos<_StateT>’
make[2]: *** [zypp/CMakeFiles/zypp.dir/pool/GetResolvablesToInsDel.cc.o] Error 1
make[1]: *** [zypp/CMakeFiles/zypp.dir/all] Error 2
make: *** [all] Error 2
Build step 'Execute shell' marked build as failure
Archiving artifacts
--
To unsubscribe, e-mail: zypp-commit+unsubscribe@xxxxxxxxxxxx
For additional commands, e-mail: zypp-commit+help@xxxxxxxxxxxx

< Previous Next >
This Thread
Follow Ups