Mailinglist Archive: zypp-commit (93 mails)

< Previous Next >
[zypp-commit] Build failed in Jenkins: libzypp-SLE11SP3 #23
  • From: hudson@xxxxxxx
  • Date: Mon, 11 Mar 2013 10:34:48 +0100 (CET)
  • Message-id: <1330199587.2180.1362994488709.JavaMail.jenkins@river>
See <http://river.suse.de/job/libzypp-SLE11SP3/23/changes>

Changes:

[Michael Andres] fix GlobalLock implementation

[Michael Andres] Implement $ZYPP_LOCK_TIMEOUT: number of seconds to wait for a
zypplock becoming available (bnc#772965)

[Michael Andres] update zypp-envars doc

[Michael Andres] Unify update-scripts with same content(md5sum) (bnc#773575)

[Michael Andres] changes 9.33.1 (8)

------------------------------------------
[...truncated 384 lines...]
<http://river.suse.de/job/libzypp-SLE11SP3/ws/checkout/zypp/sat/Transaction.h>:365:
instantiated from here
<http://river.suse.de/job/libzypp-SLE11SP3/ws/checkout/zypp/base/Flags.h>:102:
warning: comparison between signed and unsigned integer expressions
[ 43%] Building CXX object
zypp/CMakeFiles/zypp.dir/solver/detail/SolverQueueItemDelete.cc.o
[ 45%] Building CXX object
zypp/CMakeFiles/zypp.dir/solver/detail/SolverQueueItemUpdate.cc.o
[ 45%] Building CXX object
zypp/CMakeFiles/zypp.dir/solver/detail/SolverQueueItemInstallOneOf.cc.o
[ 45%] [ 45%] Building CXX object
zypp/CMakeFiles/zypp.dir/solver/detail/SATResolver.cc.o
Building CXX object
zypp/CMakeFiles/zypp.dir/solver/detail/SolverQueueItemLock.cc.o
[ 46%] Building CXX object
zypp/CMakeFiles/zypp.dir/solver/detail/SystemCheck.cc.o
[ 46%] Building CXX object zypp/CMakeFiles/zypp.dir/ui/Selectable.cc.o
<http://river.suse.de/job/libzypp-SLE11SP3/ws/checkout/zypp/base/Flags.h>: In
member function 'bool zypp::base::Flags<Enum>::testFlag(Enum) const [with Enum
= zypp::sat::Transaction::StepStage]':
<http://river.suse.de/job/libzypp-SLE11SP3/ws/checkout/zypp/sat/Transaction.h>:365:
instantiated from here
<http://river.suse.de/job/libzypp-SLE11SP3/ws/checkout/zypp/base/Flags.h>:102:
warning: comparison between signed and unsigned integer expressions
[ 46%] Building CXX object zypp/CMakeFiles/zypp.dir/ui/SelectableImpl.cc.o
<http://river.suse.de/job/libzypp-SLE11SP3/ws/checkout/zypp/solver/detail/SATResolver.cc>:
In member function ‘std::string
zypp::solver::detail::SATResolver::SATprobleminfoString(Id, std::string&, Id&)’:
<http://river.suse.de/job/libzypp-SLE11SP3/ws/checkout/zypp/solver/detail/SATResolver.cc>:952:
warning: enumeration value ‘SOLVER_RULE_UNKNOWN’ not handled in switch
<http://river.suse.de/job/libzypp-SLE11SP3/ws/checkout/zypp/solver/detail/SATResolver.cc>:952:
warning: enumeration value ‘SOLVER_RULE_RPM_IMPLICIT_OBSOLETES’ not handled in
switch
<http://river.suse.de/job/libzypp-SLE11SP3/ws/checkout/zypp/solver/detail/SATResolver.cc>:952:
warning: enumeration value ‘SOLVER_RULE_FEATURE’ not handled in switch
<http://river.suse.de/job/libzypp-SLE11SP3/ws/checkout/zypp/solver/detail/SATResolver.cc>:952:
warning: enumeration value ‘SOLVER_RULE_CHOICE’ not handled in switch
<http://river.suse.de/job/libzypp-SLE11SP3/ws/checkout/zypp/solver/detail/SATResolver.cc>:952:
warning: enumeration value ‘SOLVER_RULE_LEARNT’ not handled in switch
[ 46%] Building CXX object zypp/CMakeFiles/zypp.dir/ui/Status.cc.o
<http://river.suse.de/job/libzypp-SLE11SP3/ws/checkout/zypp/base/Flags.h>: In
member function ‘bool zypp::base::Flags<Enum>::testFlag(Enum) const [with Enum
= zypp::sat::Transaction::StepStage]’:
<http://river.suse.de/job/libzypp-SLE11SP3/ws/checkout/zypp/sat/Transaction.h>:365:
instantiated from here
<http://river.suse.de/job/libzypp-SLE11SP3/ws/checkout/zypp/base/Flags.h>:102:
warning: comparison between signed and unsigned integer expressions
[ 48%] Building CXX object zypp/CMakeFiles/zypp.dir/ui/UserWantedPackages.cc.o
<http://river.suse.de/job/libzypp-SLE11SP3/ws/checkout/zypp/ui/UserWantedPackages.cc>:130:2:
warning: #warning NEEDS FIX
[ 48%] Building CXX object zypp/CMakeFiles/zypp.dir/thread/Mutex.cc.o
[ 48%] Building CXX object zypp/CMakeFiles/zypp.dir/ws/WebpinResult.cc.o
[ 48%] Building CXX object zypp/CMakeFiles/zypp.dir/ByteCount.cc.o
<http://river.suse.de/job/libzypp-SLE11SP3/ws/checkout/zypp/base/Flags.h>: In
member function 'bool zypp::base::Flags<Enum>::testFlag(Enum) const [with Enum
= zypp::sat::Transaction::StepStage]':
<http://river.suse.de/job/libzypp-SLE11SP3/ws/checkout/zypp/sat/Transaction.h>:365:
instantiated from here
<http://river.suse.de/job/libzypp-SLE11SP3/ws/checkout/zypp/base/Flags.h>:102:
warning: comparison between signed and unsigned integer expressions
[ 50%] [ 50%] Building CXX object zypp/CMakeFiles/zypp.dir/Capability.cc.o
Building CXX object zypp/CMakeFiles/zypp.dir/Capabilities.cc.o
[ 50%] Building CXX object zypp/CMakeFiles/zypp.dir/CapMatch.cc.o
<http://river.suse.de/job/libzypp-SLE11SP3/ws/checkout/zypp/Capability.cc>:307:2:
warning: #warning MIGRATE TO SAT
<http://river.suse.de/job/libzypp-SLE11SP3/ws/checkout/zypp/Capability.cc>:308:2:
warning: #warning TESTCASE
[ 50%] Building CXX object zypp/CMakeFiles/zypp.dir/Changelog.cc.o
[ 51%] Building CXX object zypp/CMakeFiles/zypp.dir/CheckSum.cc.o
[ 51%] [ 51%] Building CXX object zypp/CMakeFiles/zypp.dir/Date.cc.o
Building CXX object zypp/CMakeFiles/zypp.dir/Dep.cc.o
[ 51%] Building CXX object zypp/CMakeFiles/zypp.dir/Digest.cc.o
[ 53%] Building CXX object zypp/CMakeFiles/zypp.dir/DiskUsage.cc.o
[ 53%] Building CXX object zypp/CMakeFiles/zypp.dir/DiskUsageCounter.cc.o
[ 53%] Building CXX object zypp/CMakeFiles/zypp.dir/DownloadMode.cc.o
[ 53%] Building CXX object zypp/CMakeFiles/zypp.dir/Edition.cc.o
[ 55%] Building CXX object zypp/CMakeFiles/zypp.dir/ExternalProgram.cc.o
[ 55%] Building CXX object zypp/CMakeFiles/zypp.dir/PluginFrame.cc.o
[ 55%] Building CXX object zypp/CMakeFiles/zypp.dir/PluginFrameException.cc.o
[ 56%] Building CXX object zypp/CMakeFiles/zypp.dir/PluginScript.cc.o
[ 56%] Building CXX object zypp/CMakeFiles/zypp.dir/PluginScriptException.cc.o
[ 56%] [ 56%] Building CXX object zypp/CMakeFiles/zypp.dir/Fetcher.cc.o
Building CXX object zypp/CMakeFiles/zypp.dir/FileChecker.cc.o
[ 58%] Building CXX object zypp/CMakeFiles/zypp.dir/Glob.cc.o
[ 58%] Building CXX object zypp/CMakeFiles/zypp.dir/HistoryLog.cc.o
<http://river.suse.de/job/libzypp-SLE11SP3/ws/checkout/zypp/base/Flags.h>: In
member function 'bool zypp::base::Flags<Enum>::testFlag(Enum) const [with Enum
= zypp::sat::Transaction::StepStage]':
<http://river.suse.de/job/libzypp-SLE11SP3/ws/checkout/zypp/sat/Transaction.h>:365:
instantiated from here
<http://river.suse.de/job/libzypp-SLE11SP3/ws/checkout/zypp/base/Flags.h>:102:
warning: comparison between signed and unsigned integer expressions
[ 58%] Building CXX object zypp/CMakeFiles/zypp.dir/HistoryLogData.cc.o
[ 58%] Building CXX object zypp/CMakeFiles/zypp.dir/IdString.cc.o
In file included from
<http://river.suse.de/job/libzypp-SLE11SP3/ws/checkout/zypp/HistoryLog.cc>:29:
<http://river.suse.de/job/libzypp-SLE11SP3/ws/checkout/zypp/HistoryLogData.h>:421:
warning: 'HistoryItemInstall' is deprecated (declared at
<http://river.suse.de/job/libzypp-SLE11SP3/ws/checkout/zypp/HistoryLogData.h>:419)
<http://river.suse.de/job/libzypp-SLE11SP3/ws/checkout/zypp/HistoryLogData.h>:448:
warning: 'HistoryItemRemove' is deprecated (declared at
<http://river.suse.de/job/libzypp-SLE11SP3/ws/checkout/zypp/HistoryLogData.h>:446)
<http://river.suse.de/job/libzypp-SLE11SP3/ws/checkout/zypp/HistoryLogData.h>:473:
warning: 'HistoryItemRepoAdd' is deprecated (declared at
<http://river.suse.de/job/libzypp-SLE11SP3/ws/checkout/zypp/HistoryLogData.h>:471)
<http://river.suse.de/job/libzypp-SLE11SP3/ws/checkout/zypp/HistoryLogData.h>:496:
warning: 'HistoryItemRepoRemove' is deprecated (declared at
<http://river.suse.de/job/libzypp-SLE11SP3/ws/checkout/zypp/HistoryLogData.h>:494)
<http://river.suse.de/job/libzypp-SLE11SP3/ws/checkout/zypp/HistoryLogData.h>:518:
warning: 'HistoryItemRepoAliasChange' is deprecated (declared at
<http://river.suse.de/job/libzypp-SLE11SP3/ws/checkout/zypp/HistoryLogData.h>:516)
<http://river.suse.de/job/libzypp-SLE11SP3/ws/checkout/zypp/HistoryLogData.h>:541:
warning: 'HistoryItemRepoUrlChange' is deprecated (declared at
<http://river.suse.de/job/libzypp-SLE11SP3/ws/checkout/zypp/HistoryLogData.h>:539)
[ 60%] Building CXX object zypp/CMakeFiles/zypp.dir/InstanceId.cc.o
<http://river.suse.de/job/libzypp-SLE11SP3/ws/checkout/zypp/base/Flags.h>: In
member function 'bool zypp::base::Flags<Enum>::testFlag(Enum) const [with Enum
= zypp::sat::Transaction::StepStage]':
<http://river.suse.de/job/libzypp-SLE11SP3/ws/checkout/zypp/sat/Transaction.h>:365:
instantiated from here
<http://river.suse.de/job/libzypp-SLE11SP3/ws/checkout/zypp/base/Flags.h>:102:
warning: comparison between signed and unsigned integer expressions
[ 60%] Building CXX object zypp/CMakeFiles/zypp.dir/KeyRing.cc.o
In file included from
<http://river.suse.de/job/libzypp-SLE11SP3/ws/checkout/zypp/HistoryLogData.cc>:21:
<http://river.suse.de/job/libzypp-SLE11SP3/ws/checkout/zypp/HistoryLogData.h>:421:
warning: 'HistoryItemInstall' is deprecated (declared at
<http://river.suse.de/job/libzypp-SLE11SP3/ws/checkout/zypp/HistoryLogData.h>:419)
<http://river.suse.de/job/libzypp-SLE11SP3/ws/checkout/zypp/HistoryLogData.h>:448:
warning: 'HistoryItemRemove' is deprecated (declared at
<http://river.suse.de/job/libzypp-SLE11SP3/ws/checkout/zypp/HistoryLogData.h>:446)
<http://river.suse.de/job/libzypp-SLE11SP3/ws/checkout/zypp/HistoryLogData.h>:473:
warning: 'HistoryItemRepoAdd' is deprecated (declared at
<http://river.suse.de/job/libzypp-SLE11SP3/ws/checkout/zypp/HistoryLogData.h>:471)
<http://river.suse.de/job/libzypp-SLE11SP3/ws/checkout/zypp/HistoryLogData.h>:496:
warning: 'HistoryItemRepoRemove' is deprecated (declared at
<http://river.suse.de/job/libzypp-SLE11SP3/ws/checkout/zypp/HistoryLogData.h>:494)
<http://river.suse.de/job/libzypp-SLE11SP3/ws/checkout/zypp/HistoryLogData.h>:518:
warning: 'HistoryItemRepoAliasChange' is deprecated (declared at
<http://river.suse.de/job/libzypp-SLE11SP3/ws/checkout/zypp/HistoryLogData.h>:516)
<http://river.suse.de/job/libzypp-SLE11SP3/ws/checkout/zypp/HistoryLogData.h>:541:
warning: 'HistoryItemRepoUrlChange' is deprecated (declared at
<http://river.suse.de/job/libzypp-SLE11SP3/ws/checkout/zypp/HistoryLogData.h>:539)
<http://river.suse.de/job/libzypp-SLE11SP3/ws/checkout/zypp/HistoryLogData.cc>:363:
warning: 'HistoryItemInstall' is deprecated (declared at
<http://river.suse.de/job/libzypp-SLE11SP3/ws/checkout/zypp/HistoryLogData.h>:419)
<http://river.suse.de/job/libzypp-SLE11SP3/ws/checkout/zypp/HistoryLogData.cc>:400:
warning: 'HistoryItemRemove' is deprecated (declared at
<http://river.suse.de/job/libzypp-SLE11SP3/ws/checkout/zypp/HistoryLogData.h>:446)
<http://river.suse.de/job/libzypp-SLE11SP3/ws/checkout/zypp/HistoryLogData.cc>:433:
warning: 'HistoryItemRepoAdd' is deprecated (declared at
<http://river.suse.de/job/libzypp-SLE11SP3/ws/checkout/zypp/HistoryLogData.h>:471)
<http://river.suse.de/job/libzypp-SLE11SP3/ws/checkout/zypp/HistoryLogData.cc>:463:
warning: 'HistoryItemRepoRemove' is deprecated (declared at
<http://river.suse.de/job/libzypp-SLE11SP3/ws/checkout/zypp/HistoryLogData.h>:494)
<http://river.suse.de/job/libzypp-SLE11SP3/ws/checkout/zypp/HistoryLogData.cc>:494:
warning: 'HistoryItemRepoAliasChange' is deprecated (declared at
<http://river.suse.de/job/libzypp-SLE11SP3/ws/checkout/zypp/HistoryLogData.h>:516)
<http://river.suse.de/job/libzypp-SLE11SP3/ws/checkout/zypp/HistoryLogData.cc>:525:
warning: 'HistoryItemRepoUrlChange' is deprecated (declared at
<http://river.suse.de/job/libzypp-SLE11SP3/ws/checkout/zypp/HistoryLogData.h>:539)
[ 60%] Building CXX object zypp/CMakeFiles/zypp.dir/Locks.cc.o
[ 60%] Building CXX object zypp/CMakeFiles/zypp.dir/MediaProducts.cc.o
[ 61%] Building CXX object zypp/CMakeFiles/zypp.dir/MediaSetAccess.cc.o
[ 61%] Building CXX object zypp/CMakeFiles/zypp.dir/OnMediaLocation.cc.o
[ 61%] Building CXX object zypp/CMakeFiles/zypp.dir/Package.cc.o
[ 61%] Building CXX object zypp/CMakeFiles/zypp.dir/Patch.cc.o
<http://river.suse.de/job/libzypp-SLE11SP3/ws/checkout/zypp/base/Flags.h>: In
member function 'bool zypp::base::Flags<Enum>::testFlag(Enum) const [with Enum
= zypp::sat::Transaction::StepStage]':
<http://river.suse.de/job/libzypp-SLE11SP3/ws/checkout/zypp/sat/Transaction.h>:365:
instantiated from here
<http://river.suse.de/job/libzypp-SLE11SP3/ws/checkout/zypp/base/Flags.h>:102:
warning: comparison between signed and unsigned integer expressions
<http://river.suse.de/job/libzypp-SLE11SP3/ws/checkout/zypp/base/Flags.h>: In
member function 'bool zypp::base::Flags<Enum>::testFlag(Enum) const [with Enum
= zypp::KeyRing::DefaultAcceptBits]':
<http://river.suse.de/job/libzypp-SLE11SP3/ws/checkout/zypp/KeyRing.cc>:63:
instantiated from here
<http://river.suse.de/job/libzypp-SLE11SP3/ws/checkout/zypp/base/Flags.h>:102:
warning: comparison between signed and unsigned integer expressions
[ 63%] Building CXX object zypp/CMakeFiles/zypp.dir/PathInfo.cc.o
[ 63%] Building CXX object zypp/CMakeFiles/zypp.dir/Pathname.cc.o
[ 63%] Building CXX object zypp/CMakeFiles/zypp.dir/Pattern.cc.o
[ 63%] Building CXX object zypp/CMakeFiles/zypp.dir/PoolItem.cc.o
<http://river.suse.de/job/libzypp-SLE11SP3/ws/checkout/zypp/base/Flags.h>: In
member function 'bool zypp::base::Flags<Enum>::testFlag(Enum) const [with Enum
= zypp::sat::Transaction::StepStage]':
<http://river.suse.de/job/libzypp-SLE11SP3/ws/checkout/zypp/sat/Transaction.h>:365:
instantiated from here
<http://river.suse.de/job/libzypp-SLE11SP3/ws/checkout/zypp/base/Flags.h>:102:
warning: comparison between signed and unsigned integer expressions
<http://river.suse.de/job/libzypp-SLE11SP3/ws/checkout/zypp/base/Flags.h>: In
member function 'bool zypp::base::Flags<Enum>::testFlag(Enum) const [with Enum
= zypp::VendorSupportOption]':
<http://river.suse.de/job/libzypp-SLE11SP3/ws/checkout/zypp/Package.cc>:95:
instantiated from here
<http://river.suse.de/job/libzypp-SLE11SP3/ws/checkout/zypp/base/Flags.h>:102:
warning: comparison between signed and unsigned integer expressions
[ 65%] Building CXX object zypp/CMakeFiles/zypp.dir/PoolItemBest.cc.o
[ 65%] Building CXX object zypp/CMakeFiles/zypp.dir/PoolQuery.cc.o
[ 65%] Building CXX object zypp/CMakeFiles/zypp.dir/PoolQueryResult.cc.o
[ 65%] Building CXX object zypp/CMakeFiles/zypp.dir/ProblemSolution.cc.o
<http://river.suse.de/job/libzypp-SLE11SP3/ws/checkout/zypp/PoolQuery.cc>: In
member function 'bool zypp::PoolQuery::Impl::operator==(const
zypp::PoolQuery::Impl&) const':
<http://river.suse.de/job/libzypp-SLE11SP3/ws/checkout/zypp/PoolQuery.cc>:411:
warning: suggest parentheses around && within ||
<http://river.suse.de/job/libzypp-SLE11SP3/ws/checkout/zypp/PoolQuery.cc>:414:
warning: suggest parentheses around && within ||
[ 66%] Building CXX object zypp/CMakeFiles/zypp.dir/Product.cc.o
[ 66%] [ 66%] Building CXX object zypp/CMakeFiles/zypp.dir/ProgressData.cc.o
Building CXX object zypp/CMakeFiles/zypp.dir/ProvideFilePolicy.cc.o
[ 66%] Building CXX object zypp/CMakeFiles/zypp.dir/PublicKey.cc.o
[ 68%] Building CXX object zypp/CMakeFiles/zypp.dir/Range.cc.o
[ 68%] Building CXX object zypp/CMakeFiles/zypp.dir/Rel.cc.o
[ 68%] Building CXX object zypp/CMakeFiles/zypp.dir/RepoInfo.cc.o
[ 68%] Building CXX object zypp/CMakeFiles/zypp.dir/RepoManager.cc.o
[ 70%] Building CXX object zypp/CMakeFiles/zypp.dir/Repository.cc.o
[ 70%] Building CXX object zypp/CMakeFiles/zypp.dir/RepoStatus.cc.o
[ 70%] Building CXX object zypp/CMakeFiles/zypp.dir/ResKind.cc.o
[ 70%] Building CXX object zypp/CMakeFiles/zypp.dir/ResObject.cc.o
[ 71%] Building CXX object zypp/CMakeFiles/zypp.dir/Resolvable.cc.o
<http://river.suse.de/job/libzypp-SLE11SP3/ws/checkout/zypp/ResObject.cc>:99:2:
warning: #warning DUMMY diskusage
[ 71%] Building CXX object zypp/CMakeFiles/zypp.dir/Resolver.cc.o
[ 71%] Building CXX object zypp/CMakeFiles/zypp.dir/ResolverProblem.cc.o
[ 71%] Building CXX object zypp/CMakeFiles/zypp.dir/ResPool.cc.o
<http://river.suse.de/job/libzypp-SLE11SP3/ws/checkout/zypp/base/Flags.h>: In
member function 'bool zypp::base::Flags<Enum>::testFlag(Enum) const [with Enum
= zypp::sat::Transaction::StepStage]':
<http://river.suse.de/job/libzypp-SLE11SP3/ws/checkout/zypp/sat/Transaction.h>:365:
instantiated from here
<http://river.suse.de/job/libzypp-SLE11SP3/ws/checkout/zypp/base/Flags.h>:102:
warning: comparison between signed and unsigned integer expressions
[ 73%] Building CXX object zypp/CMakeFiles/zypp.dir/ResPoolProxy.cc.o
<http://river.suse.de/job/libzypp-SLE11SP3/ws/checkout/zypp/base/Flags.h>: In
member function 'bool zypp::base::Flags<Enum>::testFlag(Enum) const [with Enum
= zypp::sat::Transaction::StepStage]':
<http://river.suse.de/job/libzypp-SLE11SP3/ws/checkout/zypp/sat/Transaction.h>:365:
instantiated from here
<http://river.suse.de/job/libzypp-SLE11SP3/ws/checkout/zypp/base/Flags.h>:102:
warning: comparison between signed and unsigned integer expressions
[ 73%] Building CXX object zypp/CMakeFiles/zypp.dir/ResStatus.cc.o
[ 73%] Building CXX object zypp/CMakeFiles/zypp.dir/ServiceInfo.cc.o
[ 75%] Building CXX object zypp/CMakeFiles/zypp.dir/Signature.cc.o
[ 75%] Building CXX object zypp/CMakeFiles/zypp.dir/SrcPackage.cc.o
[ 75%] Building CXX object zypp/CMakeFiles/zypp.dir/SysContent.cc.o
<http://river.suse.de/job/libzypp-SLE11SP3/ws/checkout/zypp/base/Flags.h>: In
member function 'bool zypp::base::Flags<Enum>::testFlag(Enum) const [with Enum
= zypp::sat::Transaction::StepStage]':
<http://river.suse.de/job/libzypp-SLE11SP3/ws/checkout/zypp/sat/Transaction.h>:365:
instantiated from here
<http://river.suse.de/job/libzypp-SLE11SP3/ws/checkout/zypp/base/Flags.h>:102:
warning: comparison between signed and unsigned integer expressions
[ 75%] Building CXX object zypp/CMakeFiles/zypp.dir/Target.cc.o
[ 76%] Building CXX object zypp/CMakeFiles/zypp.dir/TmpPath.cc.o
[ 76%] Building CXX object zypp/CMakeFiles/zypp.dir/Url.cc.o
[ 76%] Building CXX object zypp/CMakeFiles/zypp.dir/VendorAttr.cc.o
[ 76%] Building CXX object zypp/CMakeFiles/zypp.dir/VendorSupportOptions.cc.o
[ 78%] Building CXX object zypp/CMakeFiles/zypp.dir/ZYpp.cc.o
[ 78%] Building CXX object zypp/CMakeFiles/zypp.dir/ZYppCommitPolicy.cc.o
<http://river.suse.de/job/libzypp-SLE11SP3/ws/checkout/zypp/base/Flags.h>: In
member function 'bool zypp::base::Flags<Enum>::testFlag(Enum) const [with Enum
= zypp::sat::Transaction::StepStage]':
<http://river.suse.de/job/libzypp-SLE11SP3/ws/checkout/zypp/sat/Transaction.h>:365:
instantiated from here
<http://river.suse.de/job/libzypp-SLE11SP3/ws/checkout/zypp/base/Flags.h>:102:
warning: comparison between signed and unsigned integer expressions
[ 78%] Building CXX object zypp/CMakeFiles/zypp.dir/ZYppCommitResult.cc.o
<http://river.suse.de/job/libzypp-SLE11SP3/ws/checkout/zypp/base/Flags.h>: In
member function 'bool zypp::base::Flags<Enum>::testFlag(Enum) const [with Enum
= zypp::target::rpm::RpmInstFlag]':
<http://river.suse.de/job/libzypp-SLE11SP3/ws/checkout/zypp/ZYppCommitPolicy.cc>:99:
instantiated from here
<http://river.suse.de/job/libzypp-SLE11SP3/ws/checkout/zypp/base/Flags.h>:102:
warning: comparison between signed and unsigned integer expressions
[ 78%] Building CXX object zypp/CMakeFiles/zypp.dir/ZYppFactory.cc.o
<http://river.suse.de/job/libzypp-SLE11SP3/ws/checkout/zypp/base/Flags.h>: In
member function 'bool zypp::base::Flags<Enum>::testFlag(Enum) const [with Enum
= zypp::sat::Transaction::StepStage]':
<http://river.suse.de/job/libzypp-SLE11SP3/ws/checkout/zypp/sat/Transaction.h>:365:
instantiated from here
<http://river.suse.de/job/libzypp-SLE11SP3/ws/checkout/zypp/base/Flags.h>:102:
warning: comparison between signed and unsigned integer expressions
[ 80%] Building CXX object zypp/CMakeFiles/zypp.dir/zypp_detail/ZYppImpl.cc.o
<http://river.suse.de/job/libzypp-SLE11SP3/ws/checkout/zypp/ZYppCommitResult.h>:
In destructor 'zypp::ZYppCommitResult::~ZYppCommitResult()':
<http://river.suse.de/job/libzypp-SLE11SP3/ws/checkout/zypp/ZYppCommitResult.h>:63:
warning: 'zypp::ZYppCommitResult::_errors' is deprecated (declared at
<http://river.suse.de/job/libzypp-SLE11SP3/ws/checkout/zypp/ZYppCommitResult.h>:179)
<http://river.suse.de/job/libzypp-SLE11SP3/ws/checkout/zypp/ZYppCommitResult.h>:63:
warning: 'zypp::ZYppCommitResult::_remaining' is deprecated (declared at
<http://river.suse.de/job/libzypp-SLE11SP3/ws/checkout/zypp/ZYppCommitResult.h>:183)
<http://river.suse.de/job/libzypp-SLE11SP3/ws/checkout/zypp/ZYppCommitResult.h>:63:
warning: 'zypp::ZYppCommitResult::_srcremaining' is deprecated (declared at
<http://river.suse.de/job/libzypp-SLE11SP3/ws/checkout/zypp/ZYppCommitResult.h>:187)
<http://river.suse.de/job/libzypp-SLE11SP3/ws/checkout/zypp/ZYpp.cc>: In member
function 'zypp::ZYppCommitResult zypp::ZYpp::commit(const
zypp::ZYppCommitPolicy&)':
<http://river.suse.de/job/libzypp-SLE11SP3/ws/checkout/zypp/ZYpp.cc>:98: note:
synthesized method 'zypp::ZYppCommitResult::~ZYppCommitResult()' first required
here
<http://river.suse.de/job/libzypp-SLE11SP3/ws/checkout/zypp/ZYppCommitResult.h>:
In copy constructor 'zypp::ZYppCommitResult::ZYppCommitResult(const
zypp::ZYppCommitResult&)':
<http://river.suse.de/job/libzypp-SLE11SP3/ws/checkout/zypp/ZYppCommitResult.h>:63:
warning: 'zypp::ZYppCommitResult::_result' is deprecated (declared at
<http://river.suse.de/job/libzypp-SLE11SP3/ws/checkout/zypp/ZYppCommitResult.h>:175)
<http://river.suse.de/job/libzypp-SLE11SP3/ws/checkout/zypp/ZYppCommitResult.h>:63:
warning: 'zypp::ZYppCommitResult::_errors' is deprecated (declared at
<http://river.suse.de/job/libzypp-SLE11SP3/ws/checkout/zypp/ZYppCommitResult.h>:179)
<http://river.suse.de/job/libzypp-SLE11SP3/ws/checkout/zypp/ZYppCommitResult.h>:63:
warning: 'zypp::ZYppCommitResult::_errors' is deprecated (declared at
<http://river.suse.de/job/libzypp-SLE11SP3/ws/checkout/zypp/ZYppCommitResult.h>:179)
<http://river.suse.de/job/libzypp-SLE11SP3/ws/checkout/zypp/ZYppCommitResult.h>:63:
warning: 'zypp::ZYppCommitResult::_remaining' is deprecated (declared at
<http://river.suse.de/job/libzypp-SLE11SP3/ws/checkout/zypp/ZYppCommitResult.h>:183)
<http://river.suse.de/job/libzypp-SLE11SP3/ws/checkout/zypp/ZYppCommitResult.h>:63:
warning: 'zypp::ZYppCommitResult::_remaining' is deprecated (declared at
<http://river.suse.de/job/libzypp-SLE11SP3/ws/checkout/zypp/ZYppCommitResult.h>:183)
<http://river.suse.de/job/libzypp-SLE11SP3/ws/checkout/zypp/ZYppCommitResult.h>:63:
warning: 'zypp::ZYppCommitResult::_srcremaining' is deprecated (declared at
<http://river.suse.de/job/libzypp-SLE11SP3/ws/checkout/zypp/ZYppCommitResult.h>:187)
<http://river.suse.de/job/libzypp-SLE11SP3/ws/checkout/zypp/ZYppCommitResult.h>:63:
warning: 'zypp::ZYppCommitResult::_srcremaining' is deprecated (declared at
<http://river.suse.de/job/libzypp-SLE11SP3/ws/checkout/zypp/ZYppCommitResult.h>:187)
<http://river.suse.de/job/libzypp-SLE11SP3/ws/checkout/zypp/ZYpp.cc>: In member
function 'zypp::ZYppCommitResult zypp::ZYpp::commit(const
zypp::ZYppCommitPolicy&)':
<http://river.suse.de/job/libzypp-SLE11SP3/ws/checkout/zypp/ZYpp.cc>:98: note:
synthesized method 'zypp::ZYppCommitResult::ZYppCommitResult(const
zypp::ZYppCommitResult&)' first required here
<http://river.suse.de/job/libzypp-SLE11SP3/ws/checkout/zypp/base/Flags.h>: In
member function 'bool zypp::base::Flags<Enum>::testFlag(Enum) const [with Enum
= zypp::sat::Transaction::StepStage]':
<http://river.suse.de/job/libzypp-SLE11SP3/ws/checkout/zypp/sat/Transaction.h>:365:
instantiated from here
<http://river.suse.de/job/libzypp-SLE11SP3/ws/checkout/zypp/base/Flags.h>:102:
warning: comparison between signed and unsigned integer expressions
[ 80%] In file included from
<http://river.suse.de/job/libzypp-SLE11SP3/ws/checkout/zypp/ZYppFactory.cc>:27:
<http://river.suse.de/job/libzypp-SLE11SP3/ws/checkout/zypp/zypp_detail/ZYppReadOnlyHack.h>:15:2:
warning: #warning ZYPP_ZYPP_DETAIL_ZYPPREADONLYHACK_H
Building CXX object zypp/CMakeFiles/zypp.dir/sat/Pool.cc.o
<http://river.suse.de/job/libzypp-SLE11SP3/ws/checkout/zypp/ZYppCommitResult.cc>:
In constructor 'zypp::ZYppCommitResult::ZYppCommitResult()':
<http://river.suse.de/job/libzypp-SLE11SP3/ws/checkout/zypp/ZYppCommitResult.cc>:53:
warning: 'zypp::ZYppCommitResult::_result' is deprecated (declared at
<http://river.suse.de/job/libzypp-SLE11SP3/ws/checkout/zypp/ZYppCommitResult.h>:175)
<http://river.suse.de/job/libzypp-SLE11SP3/ws/checkout/zypp/ZYppCommitResult.cc>:53:
warning: 'zypp::ZYppCommitResult::_errors' is deprecated (declared at
<http://river.suse.de/job/libzypp-SLE11SP3/ws/checkout/zypp/ZYppCommitResult.h>:179)
<http://river.suse.de/job/libzypp-SLE11SP3/ws/checkout/zypp/ZYppCommitResult.cc>:53:
warning: 'zypp::ZYppCommitResult::_errors' is deprecated (declared at
<http://river.suse.de/job/libzypp-SLE11SP3/ws/checkout/zypp/ZYppCommitResult.h>:179)
<http://river.suse.de/job/libzypp-SLE11SP3/ws/checkout/zypp/ZYppCommitResult.cc>:53:
warning: 'zypp::ZYppCommitResult::_remaining' is deprecated (declared at
<http://river.suse.de/job/libzypp-SLE11SP3/ws/checkout/zypp/ZYppCommitResult.h>:183)
<http://river.suse.de/job/libzypp-SLE11SP3/ws/checkout/zypp/ZYppCommitResult.cc>:53:
warning: 'zypp::ZYppCommitResult::_remaining' is deprecated (declared at
<http://river.suse.de/job/libzypp-SLE11SP3/ws/checkout/zypp/ZYppCommitResult.h>:183)
<http://river.suse.de/job/libzypp-SLE11SP3/ws/checkout/zypp/ZYppCommitResult.cc>:53:
warning: 'zypp::ZYppCommitResult::_srcremaining' is deprecated (declared at
<http://river.suse.de/job/libzypp-SLE11SP3/ws/checkout/zypp/ZYppCommitResult.h>:187)
<http://river.suse.de/job/libzypp-SLE11SP3/ws/checkout/zypp/ZYppCommitResult.cc>:53:
warning: 'zypp::ZYppCommitResult::_srcremaining' is deprecated (declared at
<http://river.suse.de/job/libzypp-SLE11SP3/ws/checkout/zypp/ZYppCommitResult.h>:187)
<http://river.suse.de/job/libzypp-SLE11SP3/ws/checkout/zypp/ZYppCommitResult.cc>:
In constructor 'zypp::ZYppCommitResult::ZYppCommitResult(const
zypp::filesystem::Pathname&)':
<http://river.suse.de/job/libzypp-SLE11SP3/ws/checkout/zypp/ZYppCommitResult.cc>:57:
warning: 'zypp::ZYppCommitResult::_result' is deprecated (declared at
<http://river.suse.de/job/libzypp-SLE11SP3/ws/checkout/zypp/ZYppCommitResult.h>:175)
<http://river.suse.de/job/libzypp-SLE11SP3/ws/checkout/zypp/ZYppCommitResult.cc>:57:
warning: 'zypp::ZYppCommitResult::_errors' is deprecated (declared at
<http://river.suse.de/job/libzypp-SLE11SP3/ws/checkout/zypp/ZYppCommitResult.h>:179)
<http://river.suse.de/job/libzypp-SLE11SP3/ws/checkout/zypp/ZYppCommitResult.cc>:57:
warning: 'zypp::ZYppCommitResult::_errors' is deprecated (declared at
<http://river.suse.de/job/libzypp-SLE11SP3/ws/checkout/zypp/ZYppCommitResult.h>:179)
<http://river.suse.de/job/libzypp-SLE11SP3/ws/checkout/zypp/ZYppCommitResult.cc>:57:
warning: 'zypp::ZYppCommitResult::_remaining' is deprecated (declared at
<http://river.suse.de/job/libzypp-SLE11SP3/ws/checkout/zypp/ZYppCommitResult.h>:183)
<http://river.suse.de/job/libzypp-SLE11SP3/ws/checkout/zypp/ZYppCommitResult.cc>:57:
warning: 'zypp::ZYppCommitResult::_remaining' is deprecated (declared at
<http://river.suse.de/job/libzypp-SLE11SP3/ws/checkout/zypp/ZYppCommitResult.h>:183)
<http://river.suse.de/job/libzypp-SLE11SP3/ws/checkout/zypp/ZYppCommitResult.cc>:57:
warning: 'zypp::ZYppCommitResult::_srcremaining' is deprecated (declared at
<http://river.suse.de/job/libzypp-SLE11SP3/ws/checkout/zypp/ZYppCommitResult.h>:187)
<http://river.suse.de/job/libzypp-SLE11SP3/ws/checkout/zypp/ZYppCommitResult.cc>:57:
warning: 'zypp::ZYppCommitResult::_srcremaining' is deprecated (declared at
<http://river.suse.de/job/libzypp-SLE11SP3/ws/checkout/zypp/ZYppCommitResult.h>:187)
<http://river.suse.de/job/libzypp-SLE11SP3/ws/checkout/zypp/base/Flags.h>: In
member function 'bool zypp::base::Flags<Enum>::testFlag(Enum) const [with Enum
= zypp::sat::Transaction::StepStage]':
<http://river.suse.de/job/libzypp-SLE11SP3/ws/checkout/zypp/sat/Transaction.h>:365:
instantiated from here
<http://river.suse.de/job/libzypp-SLE11SP3/ws/checkout/zypp/base/Flags.h>:102:
warning: comparison between signed and unsigned integer expressions
[ 80%] Building CXX object zypp/CMakeFiles/zypp.dir/sat/Solvable.cc.o
<http://river.suse.de/job/libzypp-SLE11SP3/ws/checkout/zypp/ZYppFactory.cc>: In
constructor 'zypp::ZYppGlobalLock::ZYppGlobalLock()':
<http://river.suse.de/job/libzypp-SLE11SP3/ws/checkout/zypp/ZYppFactory.cc>:117:
warning: 'zypp::ZYppGlobalLock::_cleanLock' will be initialized after
<http://river.suse.de/job/libzypp-SLE11SP3/ws/checkout/zypp/ZYppFactory.cc>:111:
warning: 'zypp::filesystem::Pathname zypp::ZYppGlobalLock::_zyppLockFilePath'
<http://river.suse.de/job/libzypp-SLE11SP3/ws/checkout/zypp/ZYppFactory.cc>:74:
warning: when initialized here
/usr/include/boost/interprocess/sync/file_lock.hpp:41: error:
'boost::interprocess::file_lock::file_lock()' is private
<http://river.suse.de/job/libzypp-SLE11SP3/ws/checkout/zypp/ZYppFactory.cc>:78:
error: within this context
/usr/include/boost/interprocess/sync/file_lock.hpp: In member function 'void
zypp::ZYppGlobalLock::_openLockFile()':
/usr/include/boost/interprocess/sync/file_lock.hpp:43: error:
'boost::interprocess::file_lock&
boost::interprocess::file_lock::operator=(const
boost::interprocess::file_lock&)' is private
<http://river.suse.de/job/libzypp-SLE11SP3/ws/checkout/zypp/ZYppFactory.cc>:145:
error: within this context
/usr/include/boost/interprocess/sync/file_lock.hpp: In member function 'void
zypp::ZYppGlobalLock::_closeLockFile()':
/usr/include/boost/interprocess/sync/file_lock.hpp:41: error:
'boost::interprocess::file_lock::file_lock()' is private
<http://river.suse.de/job/libzypp-SLE11SP3/ws/checkout/zypp/ZYppFactory.cc>:161:
error: within this context
/usr/include/boost/interprocess/sync/file_lock.hpp:43: error:
'boost::interprocess::file_lock&
boost::interprocess::file_lock::operator=(const
boost::interprocess::file_lock&)' is private
<http://river.suse.de/job/libzypp-SLE11SP3/ws/checkout/zypp/ZYppFactory.cc>:161:
error: within this context
<http://river.suse.de/job/libzypp-SLE11SP3/ws/checkout/zypp/base/Flags.h>: In
member function 'bool zypp::base::Flags<Enum>::testFlag(Enum) const [with Enum
= zypp::sat::Transaction::StepStage]':
<http://river.suse.de/job/libzypp-SLE11SP3/ws/checkout/zypp/sat/Transaction.h>:365:
instantiated from here
<http://river.suse.de/job/libzypp-SLE11SP3/ws/checkout/zypp/base/Flags.h>:102:
warning: comparison between signed and unsigned integer expressions
ICECC[31746] 10:34:47: Compiled on 10.120.4.245
make[2]: *** [zypp/CMakeFiles/zypp.dir/ZYppFactory.cc.o] Error 1
make[2]: *** Waiting for unfinished jobs....
<http://river.suse.de/job/libzypp-SLE11SP3/ws/checkout/zypp/ZYppCommitResult.h>:
In destructor 'zypp::ZYppCommitResult::~ZYppCommitResult()':
<http://river.suse.de/job/libzypp-SLE11SP3/ws/checkout/zypp/ZYppCommitResult.h>:63:
warning: 'zypp::ZYppCommitResult::_errors' is deprecated (declared at
<http://river.suse.de/job/libzypp-SLE11SP3/ws/checkout/zypp/ZYppCommitResult.h>:179)
<http://river.suse.de/job/libzypp-SLE11SP3/ws/checkout/zypp/ZYppCommitResult.h>:63:
warning: 'zypp::ZYppCommitResult::_remaining' is deprecated (declared at
<http://river.suse.de/job/libzypp-SLE11SP3/ws/checkout/zypp/ZYppCommitResult.h>:183)
<http://river.suse.de/job/libzypp-SLE11SP3/ws/checkout/zypp/ZYppCommitResult.h>:63:
warning: 'zypp::ZYppCommitResult::_srcremaining' is deprecated (declared at
<http://river.suse.de/job/libzypp-SLE11SP3/ws/checkout/zypp/ZYppCommitResult.h>:187)
<http://river.suse.de/job/libzypp-SLE11SP3/ws/checkout/zypp/zypp_detail/ZYppImpl.cc>:
In member function 'zypp::ZYppCommitResult
zypp::zypp_detail::ZYppImpl::commit(const zypp::ZYppCommitPolicy&)':
<http://river.suse.de/job/libzypp-SLE11SP3/ws/checkout/zypp/zypp_detail/ZYppImpl.cc>:136:
note: synthesized method 'zypp::ZYppCommitResult::~ZYppCommitResult()' first
required here
<http://river.suse.de/job/libzypp-SLE11SP3/ws/checkout/zypp/ZYppCommitResult.h>:
In copy constructor 'zypp::ZYppCommitResult::ZYppCommitResult(const
zypp::ZYppCommitResult&)':
<http://river.suse.de/job/libzypp-SLE11SP3/ws/checkout/zypp/ZYppCommitResult.h>:63:
warning: 'zypp::ZYppCommitResult::_result' is deprecated (declared at
<http://river.suse.de/job/libzypp-SLE11SP3/ws/checkout/zypp/ZYppCommitResult.h>:175)
<http://river.suse.de/job/libzypp-SLE11SP3/ws/checkout/zypp/ZYppCommitResult.h>:63:
warning: 'zypp::ZYppCommitResult::_errors' is deprecated (declared at
<http://river.suse.de/job/libzypp-SLE11SP3/ws/checkout/zypp/ZYppCommitResult.h>:179)
<http://river.suse.de/job/libzypp-SLE11SP3/ws/checkout/zypp/ZYppCommitResult.h>:63:
warning: 'zypp::ZYppCommitResult::_errors' is deprecated (declared at
<http://river.suse.de/job/libzypp-SLE11SP3/ws/checkout/zypp/ZYppCommitResult.h>:179)
<http://river.suse.de/job/libzypp-SLE11SP3/ws/checkout/zypp/ZYppCommitResult.h>:63:
warning: 'zypp::ZYppCommitResult::_remaining' is deprecated (declared at
<http://river.suse.de/job/libzypp-SLE11SP3/ws/checkout/zypp/ZYppCommitResult.h>:183)
<http://river.suse.de/job/libzypp-SLE11SP3/ws/checkout/zypp/ZYppCommitResult.h>:63:
warning: 'zypp::ZYppCommitResult::_remaining' is deprecated (declared at
<http://river.suse.de/job/libzypp-SLE11SP3/ws/checkout/zypp/ZYppCommitResult.h>:183)
<http://river.suse.de/job/libzypp-SLE11SP3/ws/checkout/zypp/ZYppCommitResult.h>:63:
warning: 'zypp::ZYppCommitResult::_srcremaining' is deprecated (declared at
<http://river.suse.de/job/libzypp-SLE11SP3/ws/checkout/zypp/ZYppCommitResult.h>:187)
<http://river.suse.de/job/libzypp-SLE11SP3/ws/checkout/zypp/ZYppCommitResult.h>:63:
warning: 'zypp::ZYppCommitResult::_srcremaining' is deprecated (declared at
<http://river.suse.de/job/libzypp-SLE11SP3/ws/checkout/zypp/ZYppCommitResult.h>:187)
<http://river.suse.de/job/libzypp-SLE11SP3/ws/checkout/zypp/zypp_detail/ZYppImpl.cc>:
In member function 'zypp::ZYppCommitResult
zypp::zypp_detail::ZYppImpl::commit(const zypp::ZYppCommitPolicy&)':
<http://river.suse.de/job/libzypp-SLE11SP3/ws/checkout/zypp/zypp_detail/ZYppImpl.cc>:136:
note: synthesized method 'zypp::ZYppCommitResult::ZYppCommitResult(const
zypp::ZYppCommitResult&)' first required here
<http://river.suse.de/job/libzypp-SLE11SP3/ws/checkout/zypp/base/Flags.h>: In
member function 'bool zypp::base::Flags<Enum>::testFlag(Enum) const [with Enum
= zypp::sat::Transaction::StepStage]':
<http://river.suse.de/job/libzypp-SLE11SP3/ws/checkout/zypp/sat/Transaction.h>:365:
instantiated from here
<http://river.suse.de/job/libzypp-SLE11SP3/ws/checkout/zypp/base/Flags.h>:102:
warning: comparison between signed and unsigned integer expressions
make[1]: *** [zypp/CMakeFiles/zypp.dir/all] Error 2
make: *** [all] Error 2
Build step 'Execute shell' marked build as failure
Archiving artifacts
--
To unsubscribe, e-mail: zypp-commit+unsubscribe@xxxxxxxxxxxx
For additional commands, e-mail: zypp-commit+help@xxxxxxxxxxxx

< Previous Next >
This Thread
Follow Ups