Mailinglist Archive: zypp-commit (35 mails)

< Previous Next >
[zypp-commit] Build failed in Jenkins: libzypp-HEAD #1184
  • From: hudson@xxxxxxx
  • Date: Wed, 28 Mar 2012 16:42:39 +0200 (CEST)
  • Message-id: <910618474.101332945759248.JavaMail.jenkins@river>
See <http://river.suse.de/job/libzypp-HEAD/1184/changes>

Changes:

[Michael Schroeder] adapt to libsolv returning sizes no longer in kbytes, but
bytes (and also supporting unsigned long long)

------------------------------------------
[...truncated 239 lines...]
[ 13%] Building CXX object zypp/CMakeFiles/zypp.dir/media/MediaNFS.cc.o
[ 13%] Building CXX object zypp/CMakeFiles/zypp.dir/media/MediaCD.cc.o
[ 13%] Building CXX object zypp/CMakeFiles/zypp.dir/media/MediaDIR.cc.o
[ 15%] Building CXX object zypp/CMakeFiles/zypp.dir/media/MediaDISK.cc.o
[ 15%] Building CXX object zypp/CMakeFiles/zypp.dir/media/MediaCIFS.cc.o
[ 15%] Building CXX object zypp/CMakeFiles/zypp.dir/media/ProxyInfo.cc.o
[ 15%] Building CXX object zypp/CMakeFiles/zypp.dir/media/MediaCurl.cc.o
[ 16%] Building CXX object zypp/CMakeFiles/zypp.dir/media/MediaMultiCurl.cc.o
[ 16%] Building CXX object zypp/CMakeFiles/zypp.dir/media/MediaAria2c.cc.o
[ 16%] [ 16%] Building CXX object zypp/CMakeFiles/zypp.dir/media/MediaISO.cc.o
Building CXX object zypp/CMakeFiles/zypp.dir/media/MediaPlugin.cc.o
[ 18%] Building CXX object zypp/CMakeFiles/zypp.dir/media/MediaSource.cc.o
[ 18%] [ 18%] Building CXX object
zypp/CMakeFiles/zypp.dir/media/MediaManager.cc.o
Building CXX object zypp/CMakeFiles/zypp.dir/media/MediaUserAuth.cc.o
[ 18%] Building CXX object
zypp/CMakeFiles/zypp.dir/media/CredentialFileReader.cc.o
[ 20%] Building CXX object zypp/CMakeFiles/zypp.dir/media/CredentialManager.cc.o
[ 20%] Building CXX object zypp/CMakeFiles/zypp.dir/media/CurlConfig.cc.o
[ 20%] Building CXX object zypp/CMakeFiles/zypp.dir/media/TransferSettings.cc.o
[ 20%] [ 21%] Building CXX object
zypp/CMakeFiles/zypp.dir/media/MediaPriority.cc.o
Building CXX object zypp/CMakeFiles/zypp.dir/media/MetaLinkParser.cc.o
[ 21%] Building CXX object zypp/CMakeFiles/zypp.dir/media/ZsyncParser.cc.o
[ 21%] Building CXX object zypp/CMakeFiles/zypp.dir/media/MediaBlockList.cc.o
[ 21%] Building CXX object zypp/CMakeFiles/zypp.dir/media/UrlResolverPlugin.cc.o
[ 23%] Building CXX object zypp/CMakeFiles/zypp.dir/url/UrlUtils.cc.o
[ 23%] [ 23%] Building CXX object zypp/CMakeFiles/zypp.dir/url/UrlBase.cc.o
Building CXX object zypp/CMakeFiles/zypp.dir/repo/RepoException.cc.o
[ 23%] Building CXX object zypp/CMakeFiles/zypp.dir/repo/RepoMirrorList.cc.o
[ 25%] Building CXX object zypp/CMakeFiles/zypp.dir/repo/RepoType.cc.o
[ 25%] Building CXX object zypp/CMakeFiles/zypp.dir/repo/ServiceType.cc.o
[ 25%] Building CXX object zypp/CMakeFiles/zypp.dir/repo/PackageProvider.cc.o
[ 25%] Building CXX object zypp/CMakeFiles/zypp.dir/repo/SrcPackageProvider.cc.o
[ 26%] Building CXX object zypp/CMakeFiles/zypp.dir/repo/RepoProvideFile.cc.o
[ 26%] Building CXX object zypp/CMakeFiles/zypp.dir/repo/DeltaCandidates.cc.o
[ 26%] Building CXX object zypp/CMakeFiles/zypp.dir/repo/Applydeltarpm.cc.o
[ 26%] Building CXX object zypp/CMakeFiles/zypp.dir/repo/PackageDelta.cc.o
[ 28%] [ 28%] Building CXX object
zypp/CMakeFiles/zypp.dir/repo/SUSEMediaVerifier.cc.o
Building CXX object zypp/CMakeFiles/zypp.dir/repo/MediaInfoDownloader.cc.o
[ 28%] Building CXX object zypp/CMakeFiles/zypp.dir/repo/Downloader.cc.o
[ 30%] Building CXX object zypp/CMakeFiles/zypp.dir/repo/RepoVariables.cc.o
[ 30%] Building CXX object zypp/CMakeFiles/zypp.dir/repo/RepoInfoBase.cc.o
<http://river.suse.de/job/libzypp-HEAD/ws/checkout/zypp/repo/SUSEMediaVerifier.cc>:58:2:
warning: #warning check the stream status [-Wcpp]
[ 30%] Building CXX object zypp/CMakeFiles/zypp.dir/repo/PluginServices.cc.o
[ 30%] Building CXX object zypp/CMakeFiles/zypp.dir/repo/ServiceRepos.cc.o
[ 31%] Building CXX object zypp/CMakeFiles/zypp.dir/repo/yum/Downloader.cc.o
[ 31%] Building CXX object zypp/CMakeFiles/zypp.dir/repo/yum/ResourceType.cc.o
[ 31%] Building CXX object
zypp/CMakeFiles/zypp.dir/repo/susetags/Downloader.cc.o
[ 31%] [ 33%] Building CXX object
zypp/CMakeFiles/zypp.dir/target/rpm/RpmCallbacks.cc.o
Building CXX object zypp/CMakeFiles/zypp.dir/target/rpm/BinHeader.cc.o
[ 33%] [ 33%] [ 33%] Building CXX object
zypp/CMakeFiles/zypp.dir/target/rpm/RpmException.cc.o
Building CXX object zypp/CMakeFiles/zypp.dir/target/rpm/RpmDb.cc.o
Building CXX object zypp/CMakeFiles/zypp.dir/target/rpm/RpmHeader.cc.o
[ 35%] Building CXX object zypp/CMakeFiles/zypp.dir/target/rpm/librpmDb.cc.o
<http://river.suse.de/job/libzypp-HEAD/ws/checkout/zypp/repo/yum/Downloader.cc>:147:2:
warning: #warning Do we need SignatureFileChecker(string descr)? [-Wcpp]
[ 35%] [ 35%] Building CXX object
zypp/CMakeFiles/zypp.dir/target/rpm/librpmDb.cv3.cc.o
Building CXX object zypp/CMakeFiles/zypp.dir/target/modalias/Modalias.cc.o
[ 35%] Building CXX object
zypp/CMakeFiles/zypp.dir/target/RequestedLocalesFile.cc.o
<http://river.suse.de/job/libzypp-HEAD/ws/checkout/zypp/target/rpm/RpmHeader.cc>:391:2:
warning: #warning CHECK IF FILE REQUIRES HANDLING IS OBSOLETE [-Wcpp]
[ 36%]
<http://river.suse.de/job/libzypp-HEAD/ws/checkout/zypp/target/rpm/librpmDb.cc>:681:2:
warning: #warning TESTCASE: rpmdbAppendIterator and (non)sequential access?
[-Wcpp]
<http://river.suse.de/job/libzypp-HEAD/ws/checkout/zypp/target/rpm/librpmDb.cc>:696:2:
warning: #warning TESTCASE: rpmdbGetIteratorCount returns 0 on sequential
access? [-Wcpp]
<http://river.suse.de/job/libzypp-HEAD/ws/checkout/zypp/target/rpm/RpmDb.cc>:220:2:
warning: #warning Check for obsolete memebers [-Wcpp]
<http://river.suse.de/job/libzypp-HEAD/ws/checkout/zypp/target/rpm/RpmDb.cc>:388:2:
warning: #warning CHECK: notify root about conversion backup. [-Wcpp]
<http://river.suse.de/job/libzypp-HEAD/ws/checkout/zypp/target/rpm/RpmDb.cc>:646:2:
warning: #warning CHECK: compare vs existing v3 backup. notify root [-Wcpp]
Building CXX object zypp/CMakeFiles/zypp.dir/target/SoftLocksFile.cc.o
[ 36%] Building CXX object zypp/CMakeFiles/zypp.dir/target/HardLocksFile.cc.o
[ 36%] Building CXX object
zypp/CMakeFiles/zypp.dir/target/CommitPackageCache.cc.o
[ 36%] Building CXX object
zypp/CMakeFiles/zypp.dir/target/CommitPackageCacheImpl.cc.o
[ 38%] Building CXX object
zypp/CMakeFiles/zypp.dir/target/CommitPackageCacheReadAhead.cc.o
[ 38%] Building CXX object
zypp/CMakeFiles/zypp.dir/target/TargetCallbackReceiver.cc.o
[ 38%] Building CXX object zypp/CMakeFiles/zypp.dir/target/TargetException.cc.o
[ 38%] Building CXX object zypp/CMakeFiles/zypp.dir/target/TargetImpl.cc.o
[ 40%] Building CXX object zypp/CMakeFiles/zypp.dir/solver/detail/Helper.cc.o
[ 40%] Building CXX object
zypp/CMakeFiles/zypp.dir/solver/detail/InstallOrder.cc.o
[ 40%] Building CXX object
zypp/CMakeFiles/zypp.dir/solver/detail/ProblemSolutionIgnore.cc.o
[ 40%] Building CXX object
zypp/CMakeFiles/zypp.dir/solver/detail/ProblemSolutionCombi.cc.o
[ 41%]
<http://river.suse.de/job/libzypp-HEAD/ws/checkout/zypp/target/TargetImpl.cc>:1407:2:
warning: #warning Exception handling [-Wcpp]
Building CXX object zypp/CMakeFiles/zypp.dir/solver/detail/Resolver.cc.o
[ 41%] Building CXX object
zypp/CMakeFiles/zypp.dir/solver/detail/SolutionAction.cc.o
[ 41%] Building CXX object zypp/CMakeFiles/zypp.dir/solver/detail/Testcase.cc.o
[ 41%] Building CXX object
zypp/CMakeFiles/zypp.dir/solver/detail/SolverQueueItem.cc.o
[ 43%] Building CXX object
zypp/CMakeFiles/zypp.dir/solver/detail/SolverQueueItemInstall.cc.o
[ 43%] Building CXX object
zypp/CMakeFiles/zypp.dir/solver/detail/SolverQueueItemDelete.cc.o
[ 43%] Building CXX object
zypp/CMakeFiles/zypp.dir/solver/detail/SolverQueueItemUpdate.cc.o
[ 43%] Building CXX object
zypp/CMakeFiles/zypp.dir/solver/detail/SolverQueueItemInstallOneOf.cc.o
[ 45%] Building CXX object
zypp/CMakeFiles/zypp.dir/solver/detail/SolverQueueItemLock.cc.o
[ 45%] [ 45%] Building CXX object
zypp/CMakeFiles/zypp.dir/solver/detail/SATResolver.cc.o
Building CXX object zypp/CMakeFiles/zypp.dir/solver/detail/SystemCheck.cc.o
[ 45%] Building CXX object zypp/CMakeFiles/zypp.dir/ui/Selectable.cc.o
[ 46%] Building CXX object zypp/CMakeFiles/zypp.dir/ui/SelectableImpl.cc.o
In file included from
<http://river.suse.de/job/libzypp-HEAD/ws/checkout/zypp/target/TargetImpl.cc>:50:0:
<http://river.suse.de/job/libzypp-HEAD/ws/checkout/zypp/pool/GetResolvablesToInsDel.h>:65:87:
warning: 'GetResolvablesToInsDel' is deprecated [-Wdeprecated-declarations]
<http://river.suse.de/job/libzypp-HEAD/ws/checkout/zypp/target/TargetImpl.cc>:
In member function 'zypp::ZYppCommitResult
zypp::target::TargetImpl::commit(zypp::ResPool, const zypp::ZYppCommitPolicy&)':
<http://river.suse.de/job/libzypp-HEAD/ws/checkout/zypp/target/TargetImpl.cc>:1300:14:
warning: 'zypp::ZYppCommitResult::_errors' is deprecated (declared at
<http://river.suse.de/job/libzypp-HEAD/ws/checkout/zypp/ZYppCommitResult.h>:181)
[-Wdeprecated-declarations]
<http://river.suse.de/job/libzypp-HEAD/ws/checkout/zypp/target/TargetImpl.cc>:1300:14:
warning: 'zypp::ZYppCommitResult::_errors' is deprecated (declared at
<http://river.suse.de/job/libzypp-HEAD/ws/checkout/zypp/ZYppCommitResult.h>:181)
[-Wdeprecated-declarations]
<http://river.suse.de/job/libzypp-HEAD/ws/checkout/zypp/target/TargetImpl.cc>:1301:14:
warning: 'zypp::ZYppCommitResult::_remaining' is deprecated (declared at
<http://river.suse.de/job/libzypp-HEAD/ws/checkout/zypp/ZYppCommitResult.h>:185)
[-Wdeprecated-declarations]
<http://river.suse.de/job/libzypp-HEAD/ws/checkout/zypp/target/TargetImpl.cc>:1301:14:
warning: 'zypp::ZYppCommitResult::_remaining' is deprecated (declared at
<http://river.suse.de/job/libzypp-HEAD/ws/checkout/zypp/ZYppCommitResult.h>:185)
[-Wdeprecated-declarations]
<http://river.suse.de/job/libzypp-HEAD/ws/checkout/zypp/target/TargetImpl.cc>:1302:14:
warning: 'zypp::ZYppCommitResult::_srcremaining' is deprecated (declared at
<http://river.suse.de/job/libzypp-HEAD/ws/checkout/zypp/ZYppCommitResult.h>:189)
[-Wdeprecated-declarations]
<http://river.suse.de/job/libzypp-HEAD/ws/checkout/zypp/target/TargetImpl.cc>:1302:14:
warning: 'zypp::ZYppCommitResult::_srcremaining' is deprecated (declared at
<http://river.suse.de/job/libzypp-HEAD/ws/checkout/zypp/ZYppCommitResult.h>:189)
[-Wdeprecated-declarations]
<http://river.suse.de/job/libzypp-HEAD/ws/checkout/zypp/target/TargetImpl.cc>:1323:15:
warning: 'zypp::ZYppCommitResult::_remaining' is deprecated (declared at
<http://river.suse.de/job/libzypp-HEAD/ws/checkout/zypp/ZYppCommitResult.h>:185)
[-Wdeprecated-declarations]
<http://river.suse.de/job/libzypp-HEAD/ws/checkout/zypp/target/TargetImpl.cc>:1323:15:
warning: 'zypp::ZYppCommitResult::_remaining' is deprecated (declared at
<http://river.suse.de/job/libzypp-HEAD/ws/checkout/zypp/ZYppCommitResult.h>:185)
[-Wdeprecated-declarations]
<http://river.suse.de/job/libzypp-HEAD/ws/checkout/zypp/target/TargetImpl.cc>:1325:15:
warning: 'zypp::ZYppCommitResult::_srcremaining' is deprecated (declared at
<http://river.suse.de/job/libzypp-HEAD/ws/checkout/zypp/ZYppCommitResult.h>:189)
[-Wdeprecated-declarations]
<http://river.suse.de/job/libzypp-HEAD/ws/checkout/zypp/target/TargetImpl.cc>:1325:15:
warning: 'zypp::ZYppCommitResult::_srcremaining' is deprecated (declared at
<http://river.suse.de/job/libzypp-HEAD/ws/checkout/zypp/ZYppCommitResult.h>:189)
[-Wdeprecated-declarations]
<http://river.suse.de/job/libzypp-HEAD/ws/checkout/zypp/target/TargetImpl.cc>:1331:13:
warning: 'zypp::ZYppCommitResult::_errors' is deprecated (declared at
<http://river.suse.de/job/libzypp-HEAD/ws/checkout/zypp/ZYppCommitResult.h>:181)
[-Wdeprecated-declarations]
<http://river.suse.de/job/libzypp-HEAD/ws/checkout/zypp/target/TargetImpl.cc>:1331:13:
warning: 'zypp::ZYppCommitResult::_errors' is deprecated (declared at
<http://river.suse.de/job/libzypp-HEAD/ws/checkout/zypp/ZYppCommitResult.h>:181)
[-Wdeprecated-declarations]
<http://river.suse.de/job/libzypp-HEAD/ws/checkout/zypp/target/TargetImpl.cc>:1335:14:
warning: 'zypp::ZYppCommitResult::_result' is deprecated (declared at
<http://river.suse.de/job/libzypp-HEAD/ws/checkout/zypp/ZYppCommitResult.h>:177)
[-Wdeprecated-declarations]
<http://river.suse.de/job/libzypp-HEAD/ws/checkout/zypp/target/TargetImpl.cc>:1335:14:
warning: 'zypp::ZYppCommitResult::_result' is deprecated (declared at
<http://river.suse.de/job/libzypp-HEAD/ws/checkout/zypp/ZYppCommitResult.h>:177)
[-Wdeprecated-declarations]
<http://river.suse.de/job/libzypp-HEAD/ws/checkout/zypp/target/TargetImpl.cc>:1335:44:
warning: 'zypp::ZYppCommitResult::_remaining' is deprecated (declared at
<http://river.suse.de/job/libzypp-HEAD/ws/checkout/zypp/ZYppCommitResult.h>:185)
[-Wdeprecated-declarations]
<http://river.suse.de/job/libzypp-HEAD/ws/checkout/zypp/target/TargetImpl.cc>:1335:44:
warning: 'zypp::ZYppCommitResult::_remaining' is deprecated (declared at
<http://river.suse.de/job/libzypp-HEAD/ws/checkout/zypp/ZYppCommitResult.h>:185)
[-Wdeprecated-declarations]
[ 46%] [ 46%] Building CXX object
zypp/CMakeFiles/zypp.dir/ui/UserWantedPackages.cc.o
Building CXX object zypp/CMakeFiles/zypp.dir/ui/Status.cc.o
[ 46%] Building CXX object zypp/CMakeFiles/zypp.dir/thread/Mutex.cc.o
[ 48%] Building CXX object zypp/CMakeFiles/zypp.dir/ws/WebpinResult.cc.o
<http://river.suse.de/job/libzypp-HEAD/ws/checkout/zypp/ui/UserWantedPackages.cc>:130:2:
warning: #warning NEEDS FIX [-Wcpp]
[ 48%] [ 48%] Building CXX object zypp/CMakeFiles/zypp.dir/ByteCount.cc.o
Building CXX object zypp/CMakeFiles/zypp.dir/Capabilities.cc.o
[ 48%] Building CXX object zypp/CMakeFiles/zypp.dir/Capability.cc.o
[ 50%] Building CXX object zypp/CMakeFiles/zypp.dir/CapMatch.cc.o
[ 50%] [ 50%] Building CXX object zypp/CMakeFiles/zypp.dir/Changelog.cc.o
Building CXX object zypp/CMakeFiles/zypp.dir/CheckSum.cc.o
[ 50%]
<http://river.suse.de/job/libzypp-HEAD/ws/checkout/zypp/Capability.cc>:307:2:
warning: #warning MIGRATE TO SAT [-Wcpp]
<http://river.suse.de/job/libzypp-HEAD/ws/checkout/zypp/Capability.cc>:308:2:
warning: #warning TESTCASE [-Wcpp]
Building CXX object zypp/CMakeFiles/zypp.dir/Date.cc.o
[ 51%] Building CXX object zypp/CMakeFiles/zypp.dir/Dep.cc.o
[ 51%] Building CXX object zypp/CMakeFiles/zypp.dir/Digest.cc.o
[ 51%] Building CXX object zypp/CMakeFiles/zypp.dir/DiskUsage.cc.o
[ 51%] Building CXX object zypp/CMakeFiles/zypp.dir/DiskUsageCounter.cc.o
[ 51%] [ 53%] Building CXX object zypp/CMakeFiles/zypp.dir/DownloadMode.cc.o
Building CXX object zypp/CMakeFiles/zypp.dir/Edition.cc.o
[ 53%] [ 53%] Building CXX object zypp/CMakeFiles/zypp.dir/ExternalProgram.cc.o
Building CXX object zypp/CMakeFiles/zypp.dir/PluginFrame.cc.o
[ 55%] Building CXX object zypp/CMakeFiles/zypp.dir/PluginFrameException.cc.o
<http://river.suse.de/job/libzypp-HEAD/ws/checkout/zypp/solver/detail/SATResolver.cc>:
In member function 'std::string
zypp::solver::detail::SATResolver::SATprobleminfoString(Id, std::string&, Id&)':
<http://river.suse.de/job/libzypp-HEAD/ws/checkout/zypp/solver/detail/SATResolver.cc>:988:10:
warning: enumeration value 'SOLVER_RULE_UNKNOWN' not handled in switch
[-Wswitch]
<http://river.suse.de/job/libzypp-HEAD/ws/checkout/zypp/solver/detail/SATResolver.cc>:988:10:
warning: enumeration value 'SOLVER_RULE_RPM_IMPLICIT_OBSOLETES' not handled in
switch [-Wswitch]
<http://river.suse.de/job/libzypp-HEAD/ws/checkout/zypp/solver/detail/SATResolver.cc>:988:10:
warning: enumeration value 'SOLVER_RULE_FEATURE' not handled in switch
[-Wswitch]
<http://river.suse.de/job/libzypp-HEAD/ws/checkout/zypp/solver/detail/SATResolver.cc>:988:10:
warning: enumeration value 'SOLVER_RULE_CHOICE' not handled in switch
[-Wswitch]
<http://river.suse.de/job/libzypp-HEAD/ws/checkout/zypp/solver/detail/SATResolver.cc>:988:10:
warning: enumeration value 'SOLVER_RULE_LEARNT' not handled in switch
[-Wswitch]
[ 55%] [ 55%] [ 55%] Building CXX object
zypp/CMakeFiles/zypp.dir/PluginScript.cc.o
Building CXX object zypp/CMakeFiles/zypp.dir/PluginScriptException.cc.o
Building CXX object zypp/CMakeFiles/zypp.dir/Fetcher.cc.o
[ 56%] Building CXX object zypp/CMakeFiles/zypp.dir/FileChecker.cc.o
[ 56%] Building CXX object zypp/CMakeFiles/zypp.dir/Glob.cc.o
[ 56%] Building CXX object zypp/CMakeFiles/zypp.dir/HistoryLog.cc.o
[ 56%] Building CXX object zypp/CMakeFiles/zypp.dir/HistoryLogData.cc.o
[ 58%] Building CXX object zypp/CMakeFiles/zypp.dir/IdString.cc.o
[ 58%] Building CXX object zypp/CMakeFiles/zypp.dir/InstanceId.cc.o
[ 58%] Building CXX object zypp/CMakeFiles/zypp.dir/KeyRing.cc.o
[ 58%] Building CXX object zypp/CMakeFiles/zypp.dir/Locks.cc.o
[ 60%] Building CXX object zypp/CMakeFiles/zypp.dir/MediaProducts.cc.o
[ 60%] Building CXX object zypp/CMakeFiles/zypp.dir/MediaSetAccess.cc.o
[ 60%] Building CXX object zypp/CMakeFiles/zypp.dir/OnMediaLocation.cc.o
[ 60%] Building CXX object zypp/CMakeFiles/zypp.dir/Package.cc.o
[ 61%] Building CXX object zypp/CMakeFiles/zypp.dir/Patch.cc.o
[ 61%] Building CXX object zypp/CMakeFiles/zypp.dir/PathInfo.cc.o
<http://river.suse.de/job/libzypp-HEAD/ws/checkout/zypp/Patch.cc>:223:2:
warning: #warning definition of patch contents is poor - needs review [-Wcpp]
[ 61%] Building CXX object zypp/CMakeFiles/zypp.dir/Pathname.cc.o
[ 63%] Building CXX object zypp/CMakeFiles/zypp.dir/Pattern.cc.o
[ 63%] [ 63%] [ 63%] Building CXX object zypp/CMakeFiles/zypp.dir/PoolItem.cc.o
Building CXX object zypp/CMakeFiles/zypp.dir/PoolItemBest.cc.o
[ 65%] Building CXX object zypp/CMakeFiles/zypp.dir/PoolQuery.cc.o
Building CXX object zypp/CMakeFiles/zypp.dir/PoolQueryResult.cc.o
[ 65%] [ 65%] Building CXX object zypp/CMakeFiles/zypp.dir/ProblemSolution.cc.o
Building CXX object zypp/CMakeFiles/zypp.dir/Product.cc.o
[ 65%] Building CXX object zypp/CMakeFiles/zypp.dir/ProgressData.cc.o
[ 66%] Building CXX object zypp/CMakeFiles/zypp.dir/ProvideFilePolicy.cc.o
[ 66%] Building CXX object zypp/CMakeFiles/zypp.dir/PublicKey.cc.o
[ 66%] Building CXX object zypp/CMakeFiles/zypp.dir/Range.cc.o
[ 66%] Building CXX object zypp/CMakeFiles/zypp.dir/Rel.cc.o
[ 68%] Building CXX object zypp/CMakeFiles/zypp.dir/RepoInfo.cc.o
[ 68%] Building CXX object zypp/CMakeFiles/zypp.dir/RepoManager.cc.o
[ 68%] Building CXX object zypp/CMakeFiles/zypp.dir/Repository.cc.o
[ 68%] Building CXX object zypp/CMakeFiles/zypp.dir/RepoStatus.cc.o
[ 70%] Building CXX object zypp/CMakeFiles/zypp.dir/ResKind.cc.o
[ 70%] Building CXX object zypp/CMakeFiles/zypp.dir/ResObject.cc.o
[ 70%] Building CXX object zypp/CMakeFiles/zypp.dir/Resolvable.cc.o
[ 70%] [ 71%] Building CXX object zypp/CMakeFiles/zypp.dir/Resolver.cc.o
Building CXX object zypp/CMakeFiles/zypp.dir/ResolverProblem.cc.o
[ 71%] Building CXX object zypp/CMakeFiles/zypp.dir/ResPool.cc.o
<http://river.suse.de/job/libzypp-HEAD/ws/checkout/zypp/ResObject.cc>:99:2:
warning: #warning DUMMY diskusage [-Wcpp]
[ 71%] Building CXX object zypp/CMakeFiles/zypp.dir/ResPoolProxy.cc.o
[ 71%] Building CXX object zypp/CMakeFiles/zypp.dir/ResStatus.cc.o
[ 73%] Building CXX object zypp/CMakeFiles/zypp.dir/ServiceInfo.cc.o
[ 73%] Building CXX object zypp/CMakeFiles/zypp.dir/Signature.cc.o
[ 73%] Building CXX object zypp/CMakeFiles/zypp.dir/SrcPackage.cc.o
[ 73%] Building CXX object zypp/CMakeFiles/zypp.dir/SysContent.cc.o
[ 75%] Building CXX object zypp/CMakeFiles/zypp.dir/Target.cc.o
[ 75%] Building CXX object zypp/CMakeFiles/zypp.dir/TmpPath.cc.o
[ 75%] Building CXX object zypp/CMakeFiles/zypp.dir/Url.cc.o
[ 75%] [ 76%] Building CXX object zypp/CMakeFiles/zypp.dir/VendorAttr.cc.o
Building CXX object zypp/CMakeFiles/zypp.dir/VendorSupportOptions.cc.o
[ 76%] Building CXX object zypp/CMakeFiles/zypp.dir/ZYpp.cc.o
[ 76%] Building CXX object zypp/CMakeFiles/zypp.dir/ZYppCommitPolicy.cc.o
[ 76%] Building CXX object zypp/CMakeFiles/zypp.dir/ZYppCommitResult.cc.o
[ 78%] Building CXX object zypp/CMakeFiles/zypp.dir/ZYppFactory.cc.o
[ 78%] [ 78%] Building CXX object
zypp/CMakeFiles/zypp.dir/zypp_detail/ZYppImpl.cc.o
Building CXX object zypp/CMakeFiles/zypp.dir/sat/Pool.cc.o
[ 78%] Building CXX object zypp/CMakeFiles/zypp.dir/sat/Solvable.cc.o
[ 80%] Building CXX object zypp/CMakeFiles/zypp.dir/sat/SolvableSet.cc.o
[ 80%] Building CXX object zypp/CMakeFiles/zypp.dir/sat/SolvIterMixin.cc.o
[ 80%] Building CXX object zypp/CMakeFiles/zypp.dir/sat/Map.cc.o
In file included from
<http://river.suse.de/job/libzypp-HEAD/ws/checkout/zypp/ZYppFactory.cc>:26:0:
<http://river.suse.de/job/libzypp-HEAD/ws/checkout/zypp/zypp_detail/ZYppReadOnlyHack.h>:15:2:
warning: #warning ZYPP_ZYPP_DETAIL_ZYPPREADONLYHACK_H [-Wcpp]
<http://river.suse.de/job/libzypp-HEAD/ws/checkout/zypp/ZYppCommitResult.cc>:
In constructor 'zypp::ZYppCommitResult::ZYppCommitResult()':
<http://river.suse.de/job/libzypp-HEAD/ws/checkout/zypp/ZYppCommitResult.cc>:53:34:
warning: 'zypp::ZYppCommitResult::_result' is deprecated (declared at
<http://river.suse.de/job/libzypp-HEAD/ws/checkout/zypp/ZYppCommitResult.h>:177)
[-Wdeprecated-declarations]
<http://river.suse.de/job/libzypp-HEAD/ws/checkout/zypp/ZYppCommitResult.cc>:53:34:
warning: 'zypp::ZYppCommitResult::_errors' is deprecated (declared at
<http://river.suse.de/job/libzypp-HEAD/ws/checkout/zypp/ZYppCommitResult.h>:181)
[-Wdeprecated-declarations]
<http://river.suse.de/job/libzypp-HEAD/ws/checkout/zypp/ZYppCommitResult.cc>:53:34:
warning: 'zypp::ZYppCommitResult::_errors' is deprecated (declared at
<http://river.suse.de/job/libzypp-HEAD/ws/checkout/zypp/ZYppCommitResult.h>:181)
[-Wdeprecated-declarations]
<http://river.suse.de/job/libzypp-HEAD/ws/checkout/zypp/ZYppCommitResult.cc>:53:34:
warning: 'zypp::ZYppCommitResult::_remaining' is deprecated (declared at
<http://river.suse.de/job/libzypp-HEAD/ws/checkout/zypp/ZYppCommitResult.h>:185)
[-Wdeprecated-declarations]
<http://river.suse.de/job/libzypp-HEAD/ws/checkout/zypp/ZYppCommitResult.cc>:53:34:
warning: 'zypp::ZYppCommitResult::_remaining' is deprecated (declared at
<http://river.suse.de/job/libzypp-HEAD/ws/checkout/zypp/ZYppCommitResult.h>:185)
[-Wdeprecated-declarations]
<http://river.suse.de/job/libzypp-HEAD/ws/checkout/zypp/ZYppCommitResult.cc>:53:34:
warning: 'zypp::ZYppCommitResult::_srcremaining' is deprecated (declared at
<http://river.suse.de/job/libzypp-HEAD/ws/checkout/zypp/ZYppCommitResult.h>:189)
[-Wdeprecated-declarations]
<http://river.suse.de/job/libzypp-HEAD/ws/checkout/zypp/ZYppCommitResult.cc>:53:34:
warning: 'zypp::ZYppCommitResult::_srcremaining' is deprecated (declared at
<http://river.suse.de/job/libzypp-HEAD/ws/checkout/zypp/ZYppCommitResult.h>:189)
[-Wdeprecated-declarations]
<http://river.suse.de/job/libzypp-HEAD/ws/checkout/zypp/ZYppCommitResult.cc>:
In copy constructor 'zypp::ZYppCommitResult::ZYppCommitResult(const
zypp::ZYppCommitResult&)':
<http://river.suse.de/job/libzypp-HEAD/ws/checkout/zypp/ZYppCommitResult.cc>:58:20:
warning: 'zypp::ZYppCommitResult::_errors' is deprecated (declared at
<http://river.suse.de/job/libzypp-HEAD/ws/checkout/zypp/ZYppCommitResult.h>:181)
[-Wdeprecated-declarations]
<http://river.suse.de/job/libzypp-HEAD/ws/checkout/zypp/ZYppCommitResult.cc>:58:20:
warning: 'zypp::ZYppCommitResult::_errors' is deprecated (declared at
<http://river.suse.de/job/libzypp-HEAD/ws/checkout/zypp/ZYppCommitResult.h>:181)
[-Wdeprecated-declarations]
<http://river.suse.de/job/libzypp-HEAD/ws/checkout/zypp/ZYppCommitResult.cc>:59:23:
warning: 'zypp::ZYppCommitResult::_remaining' is deprecated (declared at
<http://river.suse.de/job/libzypp-HEAD/ws/checkout/zypp/ZYppCommitResult.h>:185)
[-Wdeprecated-declarations]
<http://river.suse.de/job/libzypp-HEAD/ws/checkout/zypp/ZYppCommitResult.cc>:59:23:
warning: 'zypp::ZYppCommitResult::_remaining' is deprecated (declared at
<http://river.suse.de/job/libzypp-HEAD/ws/checkout/zypp/ZYppCommitResult.h>:185)
[-Wdeprecated-declarations]
<http://river.suse.de/job/libzypp-HEAD/ws/checkout/zypp/ZYppCommitResult.cc>:60:26:
warning: 'zypp::ZYppCommitResult::_srcremaining' is deprecated (declared at
<http://river.suse.de/job/libzypp-HEAD/ws/checkout/zypp/ZYppCommitResult.h>:189)
[-Wdeprecated-declarations]
<http://river.suse.de/job/libzypp-HEAD/ws/checkout/zypp/ZYppCommitResult.cc>:60:26:
warning: 'zypp::ZYppCommitResult::_srcremaining' is deprecated (declared at
<http://river.suse.de/job/libzypp-HEAD/ws/checkout/zypp/ZYppCommitResult.h>:189)
[-Wdeprecated-declarations]
<http://river.suse.de/job/libzypp-HEAD/ws/checkout/zypp/ZYppCommitResult.cc>:61:26:
warning: 'zypp::ZYppCommitResult::_result' is deprecated (declared at
<http://river.suse.de/job/libzypp-HEAD/ws/checkout/zypp/ZYppCommitResult.h>:177)
[-Wdeprecated-declarations]
<http://river.suse.de/job/libzypp-HEAD/ws/checkout/zypp/ZYppCommitResult.cc>:61:26:
warning: 'zypp::ZYppCommitResult::_errors' is deprecated (declared at
<http://river.suse.de/job/libzypp-HEAD/ws/checkout/zypp/ZYppCommitResult.h>:181)
[-Wdeprecated-declarations]
<http://river.suse.de/job/libzypp-HEAD/ws/checkout/zypp/ZYppCommitResult.cc>:61:26:
warning: 'zypp::ZYppCommitResult::_errors' is deprecated (declared at
<http://river.suse.de/job/libzypp-HEAD/ws/checkout/zypp/ZYppCommitResult.h>:181)
[-Wdeprecated-declarations]
<http://river.suse.de/job/libzypp-HEAD/ws/checkout/zypp/ZYppCommitResult.cc>:61:26:
warning: 'zypp::ZYppCommitResult::_remaining' is deprecated (declared at
<http://river.suse.de/job/libzypp-HEAD/ws/checkout/zypp/ZYppCommitResult.h>:185)
[-Wdeprecated-declarations]
<http://river.suse.de/job/libzypp-HEAD/ws/checkout/zypp/ZYppCommitResult.cc>:61:26:
warning: 'zypp::ZYppCommitResult::_remaining' is deprecated (declared at
<http://river.suse.de/job/libzypp-HEAD/ws/checkout/zypp/ZYppCommitResult.h>:185)
[-Wdeprecated-declarations]
<http://river.suse.de/job/libzypp-HEAD/ws/checkout/zypp/ZYppCommitResult.cc>:61:26:
warning: 'zypp::ZYppCommitResult::_srcremaining' is deprecated (declared at
<http://river.suse.de/job/libzypp-HEAD/ws/checkout/zypp/ZYppCommitResult.h>:189)
[-Wdeprecated-declarations]
<http://river.suse.de/job/libzypp-HEAD/ws/checkout/zypp/ZYppCommitResult.cc>:61:26:
warning: 'zypp::ZYppCommitResult::_srcremaining' is deprecated (declared at
<http://river.suse.de/job/libzypp-HEAD/ws/checkout/zypp/ZYppCommitResult.h>:189)
[-Wdeprecated-declarations]
<http://river.suse.de/job/libzypp-HEAD/ws/checkout/zypp/ZYppCommitResult.cc>:
In constructor 'zypp::ZYppCommitResult::ZYppCommitResult(const
zypp::filesystem::Pathname&)':
<http://river.suse.de/job/libzypp-HEAD/ws/checkout/zypp/ZYppCommitResult.cc>:65:34:
warning: 'zypp::ZYppCommitResult::_result' is deprecated (declared at
<http://river.suse.de/job/libzypp-HEAD/ws/checkout/zypp/ZYppCommitResult.h>:177)
[-Wdeprecated-declarations]
<http://river.suse.de/job/libzypp-HEAD/ws/checkout/zypp/ZYppCommitResult.cc>:65:34:
warning: 'zypp::ZYppCommitResult::_errors' is deprecated (declared at
<http://river.suse.de/job/libzypp-HEAD/ws/checkout/zypp/ZYppCommitResult.h>:181)
[-Wdeprecated-declarations]
<http://river.suse.de/job/libzypp-HEAD/ws/checkout/zypp/ZYppCommitResult.cc>:65:34:
warning: 'zypp::ZYppCommitResult::_errors' is deprecated (declared at
<http://river.suse.de/job/libzypp-HEAD/ws/checkout/zypp/ZYppCommitResult.h>:181)
[-Wdeprecated-declarations]
<http://river.suse.de/job/libzypp-HEAD/ws/checkout/zypp/ZYppCommitResult.cc>:65:34:
warning: 'zypp::ZYppCommitResult::_remaining' is deprecated (declared at
<http://river.suse.de/job/libzypp-HEAD/ws/checkout/zypp/ZYppCommitResult.h>:185)
[-Wdeprecated-declarations]
<http://river.suse.de/job/libzypp-HEAD/ws/checkout/zypp/ZYppCommitResult.cc>:65:34:
warning: 'zypp::ZYppCommitResult::_remaining' is deprecated (declared at
<http://river.suse.de/job/libzypp-HEAD/ws/checkout/zypp/ZYppCommitResult.h>:185)
[-Wdeprecated-declarations]
<http://river.suse.de/job/libzypp-HEAD/ws/checkout/zypp/ZYppCommitResult.cc>:65:34:
warning: 'zypp::ZYppCommitResult::_srcremaining' is deprecated (declared at
<http://river.suse.de/job/libzypp-HEAD/ws/checkout/zypp/ZYppCommitResult.h>:189)
[-Wdeprecated-declarations]
<http://river.suse.de/job/libzypp-HEAD/ws/checkout/zypp/ZYppCommitResult.cc>:65:34:
warning: 'zypp::ZYppCommitResult::_srcremaining' is deprecated (declared at
<http://river.suse.de/job/libzypp-HEAD/ws/checkout/zypp/ZYppCommitResult.h>:189)
[-Wdeprecated-declarations]
<http://river.suse.de/job/libzypp-HEAD/ws/checkout/zypp/ZYppCommitResult.cc>:
In destructor 'zypp::ZYppCommitResult::~ZYppCommitResult()':
<http://river.suse.de/job/libzypp-HEAD/ws/checkout/zypp/ZYppCommitResult.cc>:68:39:
warning: 'zypp::ZYppCommitResult::_errors' is deprecated (declared at
<http://river.suse.de/job/libzypp-HEAD/ws/checkout/zypp/ZYppCommitResult.h>:181)
[-Wdeprecated-declarations]
<http://river.suse.de/job/libzypp-HEAD/ws/checkout/zypp/ZYppCommitResult.cc>:68:39:
warning: 'zypp::ZYppCommitResult::_remaining' is deprecated (declared at
<http://river.suse.de/job/libzypp-HEAD/ws/checkout/zypp/ZYppCommitResult.h>:185)
[-Wdeprecated-declarations]
<http://river.suse.de/job/libzypp-HEAD/ws/checkout/zypp/ZYppCommitResult.cc>:68:39:
warning: 'zypp::ZYppCommitResult::_srcremaining' is deprecated (declared at
<http://river.suse.de/job/libzypp-HEAD/ws/checkout/zypp/ZYppCommitResult.h>:189)
[-Wdeprecated-declarations]
[ 80%] Building CXX object zypp/CMakeFiles/zypp.dir/sat/Queue.cc.o
[ 81%] Building CXX object zypp/CMakeFiles/zypp.dir/sat/Transaction.cc.o
[ 81%] Building CXX object zypp/CMakeFiles/zypp.dir/sat/WhatProvides.cc.o
[ 81%] Building CXX object zypp/CMakeFiles/zypp.dir/sat/WhatObsoletes.cc.o
[ 81%] Building CXX object zypp/CMakeFiles/zypp.dir/sat/LocaleSupport.cc.o
<http://river.suse.de/job/libzypp-HEAD/ws/checkout/zypp/sat/Solvable.cc>:196:24:
error: prototype for 'long long unsigned int
zypp::sat::Solvable::lookupNumAttribute(const zypp::sat::SolvAttr&) const' does
not match any in class 'zypp::sat::Solvable'
<http://river.suse.de/job/libzypp-HEAD/ws/checkout/zypp/sat/Solvable.h>:124:18:
error: candidate is: unsigned int zypp::sat::Solvable::lookupNumAttribute(const
zypp::sat::SolvAttr&) const
ICECC[12504] 16:42:45: Compiled on 10.11.0.161
make[2]: *** [zypp/CMakeFiles/zypp.dir/sat/Solvable.cc.o] Error 1
make[2]: *** Waiting for unfinished jobs....
make[1]: *** [zypp/CMakeFiles/zypp.dir/all] Error 2
make: *** [all] Error 2
Build step 'Execute shell' marked build as failure
Archiving artifacts

--
To unsubscribe, e-mail: zypp-commit+unsubscribe@xxxxxxxxxxxx
For additional commands, e-mail: zypp-commit+help@xxxxxxxxxxxx

< Previous Next >
List Navigation
This Thread
Follow Ups
References