Mailinglist Archive: zypp-commit (34 mails)

< Previous Next >
[zypp-commit] Build failed in Jenkins: libzypp-HEAD #1177
  • From: hudson@xxxxxxx
  • Date: Tue, 27 Mar 2012 14:57:13 +0200 (CEST)
  • Message-id: <36903822.01332853033483.JavaMail.jenkins@river>
See <http://river.suse.de/job/libzypp-HEAD/1177/changes>

Changes:

[Michael Andres] Don't cache defaultCandidate as it depends on
solver::allowVendorChange flag (bnc#754286)

------------------------------------------
[...truncated 730 lines...]
[ 88%] [ 88%] Linking CXX executable InterProcessMutex_test
Built target ResStatus_test
Built target Selectable_test
[ 88%] Scanning dependencies of target Sysconfig_test
Built target Target_test
[ 88%] Scanning dependencies of target ProductFileReader_test
Building CXX object
tests/zypp/base/CMakeFiles/Sysconfig_test.dir/Sysconfig_test.cc.o
[ 89%] Building CXX object
tests/parser/CMakeFiles/ProductFileReader_test.dir/ProductFileReader_test.cc.o
Scanning dependencies of target RepoFileReader_test
[ 89%] Built target Url_test
[ 89%] Building CXX object
tests/parser/CMakeFiles/RepoFileReader_test.dir/RepoFileReader_test.cc.o
Linking CXX executable String_test
Scanning dependencies of target RepoindexFileReader_test
[ 89%] Building CXX object
tests/parser/CMakeFiles/RepoindexFileReader_test.dir/RepoindexFileReader_test.cc.o
[ 89%] Built target Vendor2_test
Scanning dependencies of target PatchesFileReader_test
[ 90%] Building CXX object
tests/parser/yum/CMakeFiles/PatchesFileReader_test.dir/PatchesFileReader_test.cc.o
[ 90%] Built target Vendor_test
Scanning dependencies of target RepomdFileReader_test
[ 92%] Building CXX object
tests/parser/yum/CMakeFiles/RepomdFileReader_test.dir/RepomdFileReader_test.cc.o
Linking CXX executable Sysconfig_test
[ 92%] Built target InterProcessMutex2_test
Scanning dependencies of target inidict_test
[ 92%] [ 92%] [ 92%] Built target InterProcessMutex_test
Built target Glob_test
Building CXX object
tests/parser/inifile/CMakeFiles/inidict_test.dir/inidict_test.cc.o
Scanning dependencies of target iniparser_test
[ 93%] Scanning dependencies of target WebpinResultFileReader_test
Building CXX object
tests/parser/inifile/CMakeFiles/iniparser_test.dir/iniparser_test.cc.o
[ 93%] Built target String_test
[ 94%] Building CXX object
tests/parser/ws/CMakeFiles/WebpinResultFileReader_test.dir/WebpinResultFileReader_test.cc.o
Linking CXX executable RepoFileReader_test
Linking CXX executable ProductFileReader_test
Scanning dependencies of target ExtendedMetadata_test
[ 94%] Linking CXX executable RepoindexFileReader_test
Building CXX object
tests/repo/CMakeFiles/ExtendedMetadata_test.dir/ExtendedMetadata_test.cc.o
Linking CXX executable PatchesFileReader_test
Linking CXX executable RepomdFileReader_test
Linking CXX executable inidict_test
[ 94%] Built target Sysconfig_test
Scanning dependencies of target MirrorList_test
Linking CXX executable iniparser_test
[ 96%] Building CXX object
tests/repo/CMakeFiles/MirrorList_test.dir/MirrorList_test.cc.o
Linking CXX executable WebpinResultFileReader_test
[ 96%] Built target RepoFileReader_test
[ 96%] Built target ProductFileReader_test
Scanning dependencies of target PluginServices_test
[ 96%] Built target RepoindexFileReader_test
Scanning dependencies of target RepoVariables_test
[ 97%] Linking CXX executable ExtendedMetadata_test
Building CXX object
tests/repo/CMakeFiles/PluginServices_test.dir/PluginServices_test.cc.o
[ 97%] Building CXX object
tests/repo/CMakeFiles/RepoVariables_test.dir/RepoVariables_test.cc.o
Scanning dependencies of target YUMDownloader_test
[ 98%] [ 98%] Built target PatchesFileReader_test
Building CXX object
tests/repo/yum/CMakeFiles/YUMDownloader_test.dir/YUMDownloader_test.cc.o
[ 98%] Scanning dependencies of target Downloader_test
Built target RepomdFileReader_test
[ 98%] Building CXX object
tests/repo/susetags/CMakeFiles/Downloader_test.dir/Downloader_test.cc.o
Scanning dependencies of target AttrMatcher_test
[ 98%] Building CXX object
tests/sat/CMakeFiles/AttrMatcher_test.dir/AttrMatcher_test.cc.o
[ 98%] Built target inidict_test
Scanning dependencies of target IdString_test
[ 98%] Building CXX object
tests/sat/CMakeFiles/IdString_test.dir/IdString_test.cc.o
[ 98%] Built target iniparser_test
Scanning dependencies of target LookupAttr_test
[ 98%] Built target WebpinResultFileReader_test
[ 98%] Building CXX object
tests/sat/CMakeFiles/LookupAttr_test.dir/LookupAttr_test.cc.o
Scanning dependencies of target Map_test
Linking CXX executable MirrorList_test
[ 98%] Building CXX object tests/sat/CMakeFiles/Map_test.dir/Map_test.cc.o
Linking CXX executable YUMDownloader_test
[ 98%] Built target ExtendedMetadata_test
Scanning dependencies of target Pool_test
Linking CXX executable Downloader_test
[ 98%] Building CXX object tests/sat/CMakeFiles/Pool_test.dir/Pool_test.cc.o
Linking CXX executable RepoVariables_test
Linking CXX executable PluginServices_test
Linking CXX executable Map_test
Linking CXX executable AttrMatcher_test
Linking CXX executable IdString_test
[ 98%] Built target MirrorList_test
[ 98%] Built target YUMDownloader_test
[ 98%] Scanning dependencies of target SolvParsing_test
[ 98%] [ 98%] [ 98%] Scanning dependencies of target Solvable_test
[ 98%] [ 98%] Built target RepoVariables_test
Built target Downloader_test
Built target PluginServices_test
Built target AttrMatcher_test
[ 98%] Built target IdString_test
Built target Map_test
[100%] Building CXX object
tests/sat/CMakeFiles/SolvParsing_test.dir/SolvParsing_test.cc.o
Building CXX object tests/sat/CMakeFiles/Solvable_test.dir/Solvable_test.cc.o
Scanning dependencies of target WhatProvides_test
Scanning dependencies of target WhatObsoletes_test
[100%] [100%] Building CXX object
tests/sat/CMakeFiles/WhatProvides_test.dir/WhatProvides_test.cc.o
Building CXX object
tests/sat/CMakeFiles/WhatObsoletes_test.dir/WhatObsoletes_test.cc.o
Linking CXX executable Pool_test
Linking CXX executable LookupAttr_test
[100%] Built target LookupAttr_test
[100%] Built target Pool_test
Linking CXX executable SolvParsing_test
Linking CXX executable Solvable_test
[100%] Built target SolvParsing_test
Linking CXX executable WhatProvides_test
Linking CXX executable WhatObsoletes_test
[100%] Built target Solvable_test
[100%] Built target WhatProvides_test
[100%] Built target WhatObsoletes_test
+ ctest -A
Test project <http://river.suse.de/job/libzypp-HEAD/ws/build/tests>
Start 1: CredentialManager_test
1/64 Test #1: CredentialManager_test ........... Passed 0.17 sec
Start 2: CredentialFileReader_test
2/64 Test #2: CredentialFileReader_test ........ Passed 0.03 sec
Start 3: MetaLinkParser_test
3/64 Test #3: MetaLinkParser_test .............. Passed 0.60 sec
Start 4: Arch_test
4/64 Test #4: Arch_test ........................ Passed 0.03 sec
Start 5: Capabilities_test
5/64 Test #5: Capabilities_test ................ Passed 0.91 sec
Start 6: CheckSum_test
6/64 Test #6: CheckSum_test .................... Passed 0.03 sec
Start 7: Date_test
7/64 Test #7: Date_test ........................ Passed 0.03 sec
Start 8: Dup_test
8/64 Test #8: Dup_test .........................***Exception: SegFault 0.08
sec
Start 9: Digest_test
9/64 Test #9: Digest_test ...................... Passed 0.03 sec
Start 10: Deltarpm_test
10/64 Test #10: Deltarpm_test .................... Passed 0.58 sec
Start 11: Edition_test
11/64 Test #11: Edition_test ..................... Passed 0.03 sec
Start 12: Fetcher_test
12/64 Test #12: Fetcher_test ..................... Passed 7.04 sec
Start 13: FileChecker_test
13/64 Test #13: FileChecker_test ................. Passed 0.93 sec
Start 14: Flags_test
14/64 Test #14: Flags_test ....................... Passed 0.03 sec
Start 15: InstanceId_test
15/64 Test #15: InstanceId_test .................. Passed 1.49 sec
Start 16: KeyRing_test
16/64 Test #16: KeyRing_test ..................... Passed 0.76 sec
Start 17: Locks_test
17/64 Test #17: Locks_test ....................... Passed 8.55 sec
Start 18: MediaSetAccess_test
18/64 Test #18: MediaSetAccess_test .............. Passed 1.09 sec
Start 19: PathInfo_test
19/64 Test #19: PathInfo_test .................... Passed 0.03 sec
Start 20: Pathname_test
20/64 Test #20: Pathname_test .................... Passed 0.03 sec
Start 21: PluginFrame_test
21/64 Test #21: PluginFrame_test ................. Passed 6.06 sec
Start 22: PoolQuery_test
22/64 Test #22: PoolQuery_test ................... Passed 2.88 sec
Start 23: ProgressData_test
23/64 Test #23: ProgressData_test ................ Passed 0.03 sec
Start 24: PtrTypes_test
24/64 Test #24: PtrTypes_test .................... Passed 0.03 sec
Start 25: PublicKey_test
25/64 Test #25: PublicKey_test ................... Passed 0.05 sec
Start 26: RWPtr_test
26/64 Test #26: RWPtr_test ....................... Passed 0.01 sec
Start 27: RepoInfo_test
27/64 Test #27: RepoInfo_test .................... Passed 1.03 sec
Start 28: RepoManager_test
28/64 Test #28: RepoManager_test ................. Passed 1.50 sec
Start 29: RepoStatus_test
29/64 Test #29: RepoStatus_test .................. Passed 0.03 sec
Start 30: ResKind_test
30/64 Test #30: ResKind_test ..................... Passed 0.03 sec
Start 31: ResStatus_test
31/64 Test #31: ResStatus_test ................... Passed 0.03 sec
Start 32: Selectable_test
32/64 Test #32: Selectable_test ..................***Exception: SegFault 0.09
sec
Start 33: Target_test
33/64 Test #33: Target_test ...................... Passed 0.55 sec
Start 34: Url_test
34/64 Test #34: Url_test ......................... Passed 0.04 sec
Start 35: Vendor_test
35/64 Test #35: Vendor_test ...................... Passed 0.03 sec
Start 36: Vendor2_test
36/64 Test #36: Vendor2_test ..................... Passed 0.04 sec
Start 37: Glob_test
37/64 Test #37: Glob_test ........................ Passed 0.03 sec
Start 38: Sysconfig_test
38/64 Test #38: Sysconfig_test ................... Passed 0.03 sec
Start 39: String_test
39/64 Test #39: String_test ...................... Passed 0.03 sec
Start 40: InterProcessMutex_test
40/64 Test #40: InterProcessMutex_test ........... Passed 6.03 sec
Start 41: InterProcessMutex2_test
41/64 Test #41: InterProcessMutex2_test .......... Passed 6.03 sec
Start 42: ProductFileReader_test
42/64 Test #42: ProductFileReader_test ........... Passed 0.03 sec
Start 43: RepoFileReader_test
43/64 Test #43: RepoFileReader_test .............. Passed 0.03 sec
Start 44: RepoindexFileReader_test
44/64 Test #44: RepoindexFileReader_test ......... Passed 0.03 sec
Start 45: RepomdFileReader_test
45/64 Test #45: RepomdFileReader_test ............ Passed 0.03 sec
Start 46: PatchesFileReader_test
46/64 Test #46: PatchesFileReader_test ........... Passed 0.03 sec
Start 47: inidict_test
47/64 Test #47: inidict_test ..................... Passed 0.03 sec
Start 48: iniparser_test
48/64 Test #48: iniparser_test ................... Passed 0.03 sec
Start 49: WebpinResultFileReader_test
49/64 Test #49: WebpinResultFileReader_test ...... Passed 0.04 sec
Start 50: RepoVariables_test
50/64 Test #50: RepoVariables_test ............... Passed 0.20 sec
Start 51: ExtendedMetadata_test
51/64 Test #51: ExtendedMetadata_test ............ Passed 0.20 sec
Start 52: PluginServices_test
52/64 Test #52: PluginServices_test .............. Passed 0.03 sec
Start 53: MirrorList_test
53/64 Test #53: MirrorList_test .................. Passed 1.04 sec
Start 54: YUMDownloader_test
54/64 Test #54: YUMDownloader_test ............... Passed 0.16 sec
Start 55: Downloader_test
55/64 Test #55: Downloader_test .................. Passed 0.28 sec
Start 56: AttrMatcher_test
56/64 Test #56: AttrMatcher_test ................. Passed 0.03 sec
Start 57: IdString_test
57/64 Test #57: IdString_test .................... Passed 0.03 sec
Start 58: LookupAttr_test
58/64 Test #58: LookupAttr_test .................. Passed 4.77 sec
Start 59: Pool_test
59/64 Test #59: Pool_test ........................ Passed 2.07 sec
Start 60: Map_test
60/64 Test #60: Map_test ......................... Passed 0.03 sec
Start 61: Solvable_test
61/64 Test #61: Solvable_test .................... Passed 1.90 sec
Start 62: SolvParsing_test
62/64 Test #62: SolvParsing_test ................. Passed 0.31 sec
Start 63: WhatObsoletes_test
63/64 Test #63: WhatObsoletes_test ............... Passed 0.04 sec
Start 64: WhatProvides_test
64/64 Test #64: WhatProvides_test ................ Passed 0.80 sec

97% tests passed, 2 tests failed out of 64

Total Test time (real) = 59.39 sec

The following tests FAILED:
8 - Dup_test (SEGFAULT)
32 - Selectable_test (SEGFAULT)
Errors while running CTest
Build step 'Execute shell' marked build as failure
Archiving artifacts

--
To unsubscribe, e-mail: zypp-commit+unsubscribe@xxxxxxxxxxxx
For additional commands, e-mail: zypp-commit+help@xxxxxxxxxxxx

< Previous Next >
This Thread
  • No further messages