Mailinglist Archive: zypp-commit (19 mails)

< Previous Next >
[zypp-commit] Build failed in Jenkins: zypper-HEAD #328
  • From: hudson@xxxxxxx
  • Date: Wed, 23 Nov 2011 11:32:39 +0100 (CET)
  • Message-id: <1747671313.2581322044359997.JavaMail.jenkins@river>
See <http://river.suse.de/job/zypper-HEAD/328/changes>

Changes:

[Michael Andres] Update zypper-po.tar.bz2

[Michael Andres] Never evaluate package support status on openSUSE (bnc#715057)

[Michael Andres] Update zypper-po.tar.bz2

[Michael Andres] Update zypper-po.tar.bz2

[Dominik Heidler] zypper-log: fixed bug #732065

[Dominik Heidler] changes 1.6.17

------------------------------------------
[...truncated 66 lines...]
++ export ICECC_ENV=087ff5a279fee8774688992fb54ad8fc.tar.gz
++ ICECC_ENV=087ff5a279fee8774688992fb54ad8fc.tar.gz
++ export
ICECC_VERSION=<http://river.suse.de/job/zypper-HEAD/ws/ICECC/087ff5a279fee8774688992fb54ad8fc.tar.gz>
++
ICECC_VERSION=<http://river.suse.de/job/zypper-HEAD/ws/ICECC/087ff5a279fee8774688992fb54ad8fc.tar.gz>
++ popd
~/hudson/workspace/zypper-HEAD
++ pushd <http://river.suse.de/job/zypper-HEAD/ws/>
~/hudson/workspace/zypper-HEAD ~/hudson/workspace/zypper-HEAD
++ export ICECREAM=-DCMAKE_CXX_COMPILER=/opt/icecream/bin/g++
++ ICECREAM=-DCMAKE_CXX_COMPILER=/opt/icecream/bin/g++
++ export CXX=/opt/icecream/bin/g++
++ CXX=/opt/icecream/bin/g++
++ export 'MAKECMD=make -j 4'
++ MAKECMD='make -j 4'
++ export MAKEBIN=make
++ MAKEBIN=make
++ export
PATH=/opt/icecream/bin:/sbin:/usr/sbin:/usr/local/sbin:/root/bin:/usr/local/bin:/usr/bin:/bin:/usr/X11R6/bin:/usr/games
++
PATH=/opt/icecream/bin:/sbin:/usr/sbin:/usr/local/sbin:/root/bin:/usr/local/bin:/usr/bin:/bin:/usr/X11R6/bin:/usr/games
++ popd
~/hudson/workspace/zypper-HEAD
++ export CHECKOUTDIR=<http://river.suse.de/job/zypper-HEAD/ws/checkout>
++ CHECKOUTDIR=<http://river.suse.de/job/zypper-HEAD/ws/checkout>
++ export BUILDDIR=<http://river.suse.de/job/zypper-HEAD/ws/build>
++ BUILDDIR=<http://river.suse.de/job/zypper-HEAD/ws/build>
++ export PACKAGEDIR=<http://river.suse.de/job/zypper-HEAD/ws/build/package>
++ PACKAGEDIR=<http://river.suse.de/job/zypper-HEAD/ws/build/package>
++ export
ARTIFACTS=<http://river.suse.de/job/zypper-HEAD/328/artifact/.artifacts>
++ ARTIFACTS=<http://river.suse.de/job/zypper-HEAD/328/artifact/.artifacts>
++ export OBSDIR=<http://river.suse.de/job/zypper-HEAD/ws/OBS>
++ OBSDIR=<http://river.suse.de/job/zypper-HEAD/ws/OBS>
++ export RPMTOPDIR=<http://river.suse.de/job/zypper-HEAD/ws/rpm>
++ RPMTOPDIR=<http://river.suse.de/job/zypper-HEAD/ws/rpm>
++ export RPMOUT=<http://river.suse.de/job/zypper-HEAD/ws/rpm/rpms>
++ RPMOUT=<http://river.suse.de/job/zypper-HEAD/ws/rpm/rpms>
++ export RPMBUILDDIR=<http://river.suse.de/job/zypper-HEAD/ws/rpm/rpmbuild>
++ RPMBUILDDIR=<http://river.suse.de/job/zypper-HEAD/ws/rpm/rpmbuild>
++ export
RPMBUILDROOT=<http://river.suse.de/job/zypper-HEAD/ws/rpm/rpmbuildroot>
++ RPMBUILDROOT=<http://river.suse.de/job/zypper-HEAD/ws/rpm/rpmbuildroot>
++ rm -rf <http://river.suse.de/job/zypper-HEAD/ws/rpm/rpms>
++ rm -rf <http://river.suse.de/job/zypper-HEAD/ws/rpm/rpmbuild>
++ rm -rf <http://river.suse.de/job/zypper-HEAD/ws/rpm/rpmbuildroot>
++ rm -rf <http://river.suse.de/job/zypper-HEAD/328/artifact/.artifacts>
++ rm -rf <http://river.suse.de/job/zypper-HEAD/ws/OBS>
++ rm -rf '<http://river.suse.de/job/zypper-HEAD/ws/copy-to-slave*.dir'>
++ [[ '' == 1 ]]
++ rm -rf <http://river.suse.de/job/zypper-HEAD/ws/build>
++ mkdir -p <http://river.suse.de/job/zypper-HEAD/ws/build>
++ mkdir -p <http://river.suse.de/job/zypper-HEAD/ws/rpm>
++ mkdir -p <http://river.suse.de/job/zypper-HEAD/ws/rpm/rpms>
++ mkdir -p <http://river.suse.de/job/zypper-HEAD/ws/rpm/rpmbuild>
++ mkdir -p <http://river.suse.de/job/zypper-HEAD/ws/rpm/rpmbuildroot>
++ mkdir -p <http://river.suse.de/job/zypper-HEAD/328/artifact/.artifacts>
++ mkdir -p <http://river.suse.de/job/zypper-HEAD/ws/OBS>
++ cat
+ build_cmake
+ echo '==> Building'
==> Building
+ pushd <http://river.suse.de/job/zypper-HEAD/ws/build>
~/hudson/workspace/zypper-HEAD/build ~/hudson/workspace/zypper-HEAD
+ cmake -DBUILDNAME=x86_64 -DSITE=app5 -DCMAKE_INSTALL_PREFIX=/usr
-DCMAKE_CXX_COMPILER=/opt/icecream/bin/g++
<http://river.suse.de/job/zypper-HEAD/ws/checkout>
-- The C compiler identification is GNU
-- The CXX compiler identification is GNU
-- Check for working C compiler: /opt/icecream/bin/gcc
-- Check for working C compiler: /opt/icecream/bin/gcc -- works
-- Detecting C compiler ABI info
-- Detecting C compiler ABI info - done
-- Check for working CXX compiler: /opt/icecream/bin/g++
-- Check for working CXX compiler: /opt/icecream/bin/g++ -- works
-- Detecting CXX compiler ABI info
-- Detecting CXX compiler ABI info - done
-- Libraries will be installed in /usr/lib64
-- Config files will be installed in /etc
** Manual files will be installed in /usr/share/man
-- Writing spec file...
-- I hate you rpm-lint...!!!
-- ZYpp path not set. Looking for it.
-- ZYpp found: includes in /usr/include, library in /usr/lib64/libzypp.so
-- readline found: includes in /usr/include, library in
/usr/lib64/libreadline.so
-- augeas found: includes in /usr/include, library in /usr/lib64/libaugeas.so
** Locale dir is /usr/share/locale
** ZYpper binary will be installed in /usr/bin
-- Translation set: zypper-po.tar.bz2
-- Translations:
sk.po;sl.po;el.po;tr.po;ja.po;ru.po;es.po;km.po;th.po;wa.po;en_GB.po;lt.po;be.po;ko.po;hr.po;sr.po;hi.po;en_US.po;mk.po;af.po;ta.po;fi.po;pl.po;uk.po;vi.po;cy.po;bn.po;zh_TW.po;id.po;de.po;sv.po;zu.po;si.po;zh_CN.po;da.po;nb.po;hu.po;et.po;cs.po;ar.po;mr.po;gu.po;ka.po;ca.po;nl.po;lo.po;he.po;gl.po;fr.po;pa.po;tg.po;it.po;ro.po;nds.po;xh.po;nn.po;bg.po;pt_BR.po;bs.po;pt.po;
-- Configuring done
-- Generating done
-- Build files have been written to:
<http://river.suse.de/job/zypper-HEAD/ws/build>
+ make -j 4
Scanning dependencies of target zypp-refresh-wrapper
Scanning dependencies of target zypp-refresh
Scanning dependencies of target translations
[ 1%] [ 2%] Building C object
src/CMakeFiles/zypp-refresh-wrapper.dir/zypp-refresh-wrapper.c.o
[ 2%] Building CXX object src/CMakeFiles/zypp-refresh.dir/zypp-refresh.cc.o
Generating sk.po, sl.po, el.po, tr.po, ja.po, ru.po, es.po, km.po, th.po,
wa.po, en_GB.po, lt.po, be.po, ko.po, hr.po, sr.po, hi.po, en_US.po, mk.po,
af.po, ta.po, fi.po, pl.po, uk.po, vi.po, cy.po, bn.po, zh_TW.po, id.po, de.po,
sv.po, zu.po, si.po, zh_CN.po, da.po, nb.po, hu.po, et.po, cs.po, ar.po, mr.po,
gu.po, ka.po, ca.po, nl.po, lo.po, he.po, gl.po, fr.po, pa.po, tg.po, it.po,
ro.po, nds.po, xh.po, nn.po, bg.po, pt_BR.po, bs.po, pt.po
Scanning dependencies of target zypper_lib
[ 3%] Building CXX object src/CMakeFiles/zypper_lib.dir/Zypper.cc.o
Linking C executable zypp-refresh-wrapper
In file included from
<http://river.suse.de/job/zypper-HEAD/ws/checkout/src/Zypper.cc>:26:0:
/usr/include/zypp/zypp_detail/ZYppReadOnlyHack.h:15:2: warning: #warning
ZYPP_ZYPP_DETAIL_ZYPPREADONLYHACK_H [-Wcpp]
[ 3%] Built target zypp-refresh-wrapper
[ 4%] Building CXX object src/CMakeFiles/zypper_lib.dir/Command.cc.o
[ 4%] Generating sk.gmo
[ 4%] Generating sl.gmo
[ 4%] Generating el.gmo
[ 4%] Generating tr.gmo
[ 4%] Generating ja.gmo
[ 4%] Generating ru.gmo
[ 4%] Generating es.gmo
[ 4%] Generating km.gmo
[ 4%] Generating th.gmo
[ 4%] Generating wa.gmo
[ 4%] Generating en_GB.gmo
[ 4%] Generating lt.gmo
[ 4%] Generating be.gmo
[ 4%] Generating ko.gmo
[ 4%] Generating hr.gmo
[ 4%] Generating sr.gmo
[ 4%] Generating hi.gmo
[ 4%] Generating en_US.gmo
[ 4%] Generating mk.gmo
[ 4%] Generating af.gmo
[ 4%] Generating ta.gmo
[ 4%] Generating fi.gmo
[ 4%] Generating pl.gmo
[ 4%] Generating uk.gmo
[ 4%] Generating vi.gmo
[ 4%] Generating cy.gmo
[ 4%] Generating bn.gmo
[ 4%] Generating zh_TW.gmo
[ 4%] Generating id.gmo
[ 4%] Generating de.gmo
[ 4%] Generating sv.gmo
[ 4%] Generating zu.gmo
[ 4%] Generating si.gmo
[ 4%] Generating zh_CN.gmo
[ 4%] Generating da.gmo
[ 4%] Generating nb.gmo
[ 4%] Generating hu.gmo
[ 4%] Generating et.gmo
[ 4%] Generating cs.gmo
[ 4%] Generating ar.gmo
[ 4%] Generating mr.gmo
[ 4%] Linking CXX executable zypp-refresh
Generating gu.gmo
[ 4%] Generating ka.gmo
[ 4%] Generating ca.gmo
[ 5%] [ 5%] Building CXX object src/CMakeFiles/zypper_lib.dir/Config.cc.o
Generating nl.gmo
[ 5%] Generating lo.gmo
[ 5%] Generating he.gmo
[ 5%] Generating gl.gmo
[ 5%] Built target zypp-refresh
[ 5%] [ 5%] Generating fr.gmo
Generating pa.gmo
[ 5%] [ 5%] Generating tg.gmo
Generating it.gmo
[ 5%] Generating ro.gmo
[ 5%] Generating nds.gmo
[ 5%] [ 5%] Generating xh.gmo
Generating nn.gmo
[ 5%] [ 5%] Generating bg.gmo
Generating pt_BR.gmo
[ 5%] Generating bs.gmo
[ 5%] Generating pt.gmo
[ 6%] Building CXX object src/CMakeFiles/zypper_lib.dir/repos.cc.o
[ 72%] Built target translations
[ 73%] Building CXX object src/CMakeFiles/zypper_lib.dir/misc.cc.o
[ 74%] Building CXX object src/CMakeFiles/zypper_lib.dir/search.cc.o
[ 75%] Building CXX object src/CMakeFiles/zypper_lib.dir/info.cc.o
[ 76%] Building CXX object src/CMakeFiles/zypper_lib.dir/Table.cc.o
[ 77%] Building CXX object src/CMakeFiles/zypper_lib.dir/locks.cc.o
<http://river.suse.de/job/zypper-HEAD/ws/checkout/src/Zypper.cc>: In member
function 'void Zypper::doCommand()':
<http://river.suse.de/job/zypper-HEAD/ws/checkout/src/Zypper.cc>:2519:27:
warning: 'void zypp::zypp_readonly_hack::IWantIt()' is deprecated (declared at
/usr/include/zypp/zypp_detail/ZYppReadOnlyHack.h:26) [-Wdeprecated-declarations]
<http://river.suse.de/job/zypper-HEAD/ws/checkout/src/Zypper.cc>:2519:36:
warning: 'void zypp::zypp_readonly_hack::IWantIt()' is deprecated (declared at
/usr/include/zypp/zypp_detail/ZYppReadOnlyHack.h:26) [-Wdeprecated-declarations]
<http://river.suse.de/job/zypper-HEAD/ws/checkout/src/Zypper.cc>:2524:27:
warning: 'void zypp::zypp_readonly_hack::IWantIt()' is deprecated (declared at
/usr/include/zypp/zypp_detail/ZYppReadOnlyHack.h:26) [-Wdeprecated-declarations]
<http://river.suse.de/job/zypper-HEAD/ws/checkout/src/Zypper.cc>:2524:36:
warning: 'void zypp::zypp_readonly_hack::IWantIt()' is deprecated (declared at
/usr/include/zypp/zypp_detail/ZYppReadOnlyHack.h:26) [-Wdeprecated-declarations]
[ 78%] Building CXX object src/CMakeFiles/zypper_lib.dir/update.cc.o
[ 79%] Building CXX object src/CMakeFiles/zypper_lib.dir/solve-commit.cc.o
[ 80%] [ 81%] Building CXX object
src/CMakeFiles/zypper_lib.dir/RequestFeedback.cc.o
Building CXX object src/CMakeFiles/zypper_lib.dir/PackageArgs.cc.o
[ 82%] Building CXX object src/CMakeFiles/zypper_lib.dir/SolverRequester.cc.o
<http://river.suse.de/job/zypper-HEAD/ws/checkout/src/SolverRequester.cc>:484:2:
warning: #warning TODO handle pseudoinstalled objects [-Wcpp]
[ 83%] Building CXX object src/CMakeFiles/zypper_lib.dir/Summary.cc.o
[ 84%] Building CXX object src/CMakeFiles/zypper_lib.dir/callbacks/media.cc.o
[ 86%] Building CXX object src/CMakeFiles/zypper_lib.dir/output/Out.cc.o
[ 87%] Building CXX object src/CMakeFiles/zypper_lib.dir/output/OutNormal.cc.o
[ 88%] Building CXX object src/CMakeFiles/zypper_lib.dir/output/OutXML.cc.o
[ 89%] Building CXX object src/CMakeFiles/zypper_lib.dir/utils/Augeas.cc.o
[ 90%] Building CXX object src/CMakeFiles/zypper_lib.dir/utils/colors.cc.o
[ 91%] Building CXX object src/CMakeFiles/zypper_lib.dir/utils/console.cc.o
[ 92%] Building CXX object src/CMakeFiles/zypper_lib.dir/utils/getopt.cc.o
[ 93%] Building CXX object src/CMakeFiles/zypper_lib.dir/utils/messages.cc.o
[ 94%] Building CXX object src/CMakeFiles/zypper_lib.dir/utils/misc.cc.o
[ 95%] Building CXX object src/CMakeFiles/zypper_lib.dir/utils/pager.cc.o
[ 96%] Building CXX object src/CMakeFiles/zypper_lib.dir/utils/prompt.cc.o
[ 97%] Building CXX object src/CMakeFiles/zypper_lib.dir/utils/richtext.cc.o
[ 98%] Building CXX object src/CMakeFiles/zypper_lib.dir/utils/text.cc.o
Linking CXX static library libzypper_lib.a
[ 98%] Built target zypper_lib
Scanning dependencies of target zypper
[100%] Building CXX object src/CMakeFiles/zypper.dir/main.cc.o
Linking CXX executable zypper
[100%] Built target zypper
+ popd
~/hudson/workspace/zypper-HEAD
+ build_and_run_cmake_tests
+ echo '==> Building and running tests'
==> Building and running tests
+ pushd <http://river.suse.de/job/zypper-HEAD/ws/build>
~/hudson/workspace/zypper-HEAD/build ~/hudson/workspace/zypper-HEAD
+ '[' -e ./CTestTestfile.cmake ']'
+ '[' -e tests ']'
+ pushd tests
~/hudson/workspace/zypper-HEAD/build/tests ~/hudson/workspace/zypper-HEAD/build
~/hudson/workspace/zypper-HEAD
+ make -j 4
Scanning dependencies of target zypper_test_utils
Linking CXX static library libzypper_test_utils.a
[ 90%] Built target zypper_lib
[ 90%] Built target zypper_test_utils
Scanning dependencies of target PackageArgs_test
Scanning dependencies of target SolverRequester_test
Scanning dependencies of target text_test
[ 93%] Building CXX object
tests/CMakeFiles/PackageArgs_test.dir/PackageArgs_test.cc.o
[ 96%] [100%] Building CXX object
tests/utils/CMakeFiles/text_test.dir/text_test.cc.o
Building CXX object
tests/CMakeFiles/SolverRequester_test.dir/SolverRequester_test.cc.o
Linking CXX executable text_test
[100%] Built target text_test
Linking CXX executable PackageArgs_test
Linking CXX executable SolverRequester_test
[100%] Built target PackageArgs_test
[100%] Built target SolverRequester_test
+ ctest -A
Test project <http://river.suse.de/job/zypper-HEAD/ws/build/tests>
Start 1: PackageArgs_test
1/3 Test #1: PackageArgs_test .................***Exception: SegFault 0.14 sec
Start 2: SolverRequester_test
2/3 Test #2: SolverRequester_test .............***Exception: SegFault 0.03 sec
Start 3: text_test
3/3 Test #3: text_test ........................ Passed 0.05 sec

33% tests passed, 2 tests failed out of 3

Total Test time (real) = 0.25 sec

The following tests FAILED:
1 - PackageArgs_test (SEGFAULT)
2 - SolverRequester_test (SEGFAULT)
Errors while running CTest
Build step 'Execute shell' marked build as failure
Archiving artifacts

--
To unsubscribe, e-mail: zypp-commit+unsubscribe@xxxxxxxxxxxx
For additional commands, e-mail: zypp-commit+help@xxxxxxxxxxxx

< Previous Next >
This Thread
Follow Ups