Mailinglist Archive: zypp-commit (907 mails)

< Previous Next >
[zypp-commit] Build failed in Jenkins: libzypp-HEAD #997
  • From: hudson@xxxxxxx
  • Date: Thu, 6 Oct 2011 17:19:13 +0200 (CEST)
  • Message-id: <624606631.81317914353762.JavaMail.jenkins@river>
See <http://river.suse.de/job/libzypp-HEAD/997/changes>

Changes:

[Michael Andres] sketch

[Michael Andres] Use gcc-c++ >= 4.5

------------------------------------------
[...truncated 456 lines...]
<http://river.suse.de/job/libzypp-HEAD/ws/checkout/zypp/ZYppCommitResult.cc>:57:34:
warning: ‘zypp::ZYppCommitResult::_result’ is deprecated (declared at
<http://river.suse.de/job/libzypp-HEAD/ws/checkout/zypp/ZYppCommitResult.h>:175)
[-Wdeprecated-declarations]
<http://river.suse.de/job/libzypp-HEAD/ws/checkout/zypp/ZYppCommitResult.cc>:57:34:
warning: ‘zypp::ZYppCommitResult::_errors’ is deprecated (declared at
<http://river.suse.de/job/libzypp-HEAD/ws/checkout/zypp/ZYppCommitResult.h>:179)
[-Wdeprecated-declarations]
<http://river.suse.de/job/libzypp-HEAD/ws/checkout/zypp/ZYppCommitResult.cc>:57:34:
warning: ‘zypp::ZYppCommitResult::_errors’ is deprecated (declared at
<http://river.suse.de/job/libzypp-HEAD/ws/checkout/zypp/ZYppCommitResult.h>:179)
[-Wdeprecated-declarations]
<http://river.suse.de/job/libzypp-HEAD/ws/checkout/zypp/ZYppCommitResult.cc>:57:34:
warning: ‘zypp::ZYppCommitResult::_remaining’ is deprecated (declared at
<http://river.suse.de/job/libzypp-HEAD/ws/checkout/zypp/ZYppCommitResult.h>:183)
[-Wdeprecated-declarations]
<http://river.suse.de/job/libzypp-HEAD/ws/checkout/zypp/ZYppCommitResult.cc>:57:34:
warning: ‘zypp::ZYppCommitResult::_remaining’ is deprecated (declared at
<http://river.suse.de/job/libzypp-HEAD/ws/checkout/zypp/ZYppCommitResult.h>:183)
[-Wdeprecated-declarations]
<http://river.suse.de/job/libzypp-HEAD/ws/checkout/zypp/ZYppCommitResult.cc>:57:34:
warning: ‘zypp::ZYppCommitResult::_srcremaining’ is deprecated (declared at
<http://river.suse.de/job/libzypp-HEAD/ws/checkout/zypp/ZYppCommitResult.h>:187)
[-Wdeprecated-declarations]
<http://river.suse.de/job/libzypp-HEAD/ws/checkout/zypp/ZYppCommitResult.cc>:57:34:
warning: ‘zypp::ZYppCommitResult::_srcremaining’ is deprecated (declared at
<http://river.suse.de/job/libzypp-HEAD/ws/checkout/zypp/ZYppCommitResult.h>:187)
[-Wdeprecated-declarations]
[ 78%] Building CXX object zypp/CMakeFiles/zypp.dir/sat/Pool.cc.o
In file included from
<http://river.suse.de/job/libzypp-HEAD/ws/checkout/zypp/ZYppCommit.h>:18:0,
from
<http://river.suse.de/job/libzypp-HEAD/ws/checkout/zypp/ZYpp.h>:24,
from
<http://river.suse.de/job/libzypp-HEAD/ws/checkout/zypp/ZYpp.cc>:15:
<http://river.suse.de/job/libzypp-HEAD/ws/checkout/zypp/ZYppCommitResult.h>: In
destructor ‘zypp::ZYppCommitResult::~ZYppCommitResult()’:
<http://river.suse.de/job/libzypp-HEAD/ws/checkout/zypp/ZYppCommitResult.h>:62:9:
warning: ‘zypp::ZYppCommitResult::_errors’ is deprecated (declared at
<http://river.suse.de/job/libzypp-HEAD/ws/checkout/zypp/ZYppCommitResult.h>:179)
[-Wdeprecated-declarations]
<http://river.suse.de/job/libzypp-HEAD/ws/checkout/zypp/ZYppCommitResult.h>:62:9:
warning: ‘zypp::ZYppCommitResult::_remaining’ is deprecated (declared at
<http://river.suse.de/job/libzypp-HEAD/ws/checkout/zypp/ZYppCommitResult.h>:183)
[-Wdeprecated-declarations]
<http://river.suse.de/job/libzypp-HEAD/ws/checkout/zypp/ZYppCommitResult.h>:62:9:
warning: ‘zypp::ZYppCommitResult::_srcremaining’ is deprecated (declared at
<http://river.suse.de/job/libzypp-HEAD/ws/checkout/zypp/ZYppCommitResult.h>:187)
[-Wdeprecated-declarations]
<http://river.suse.de/job/libzypp-HEAD/ws/checkout/zypp/ZYpp.cc>: In member
function ‘zypp::ZYppCommitResult zypp::ZYpp::commit(const
zypp::ZYppCommitPolicy&)’:
<http://river.suse.de/job/libzypp-HEAD/ws/checkout/zypp/ZYpp.cc>:98:37: note:
synthesized method ‘zypp::ZYppCommitResult::~ZYppCommitResult()’ first required
here
In file included from
<http://river.suse.de/job/libzypp-HEAD/ws/checkout/zypp/ZYppCommit.h>:18:0,
from
<http://river.suse.de/job/libzypp-HEAD/ws/checkout/zypp/ZYpp.h>:24,
from
<http://river.suse.de/job/libzypp-HEAD/ws/checkout/zypp/ZYpp.cc>:15:
<http://river.suse.de/job/libzypp-HEAD/ws/checkout/zypp/ZYppCommitResult.h>: In
constructor
‘zypp::ZYppCommitResult::ZYppCommitResult(zypp::ZYppCommitResult&&)’:
<http://river.suse.de/job/libzypp-HEAD/ws/checkout/zypp/ZYppCommitResult.h>:62:9:
warning: ‘zypp::ZYppCommitResult::_result’ is deprecated (declared at
<http://river.suse.de/job/libzypp-HEAD/ws/checkout/zypp/ZYppCommitResult.h>:175)
[-Wdeprecated-declarations]
<http://river.suse.de/job/libzypp-HEAD/ws/checkout/zypp/ZYppCommitResult.h>:62:9:
warning: ‘zypp::ZYppCommitResult::_errors’ is deprecated (declared at
<http://river.suse.de/job/libzypp-HEAD/ws/checkout/zypp/ZYppCommitResult.h>:179)
[-Wdeprecated-declarations]
<http://river.suse.de/job/libzypp-HEAD/ws/checkout/zypp/ZYppCommitResult.h>:62:9:
warning: ‘zypp::ZYppCommitResult::_errors’ is deprecated (declared at
<http://river.suse.de/job/libzypp-HEAD/ws/checkout/zypp/ZYppCommitResult.h>:179)
[-Wdeprecated-declarations]
<http://river.suse.de/job/libzypp-HEAD/ws/checkout/zypp/ZYppCommitResult.h>:62:9:
warning: ‘zypp::ZYppCommitResult::_remaining’ is deprecated (declared at
<http://river.suse.de/job/libzypp-HEAD/ws/checkout/zypp/ZYppCommitResult.h>:183)
[-Wdeprecated-declarations]
<http://river.suse.de/job/libzypp-HEAD/ws/checkout/zypp/ZYppCommitResult.h>:62:9:
warning: ‘zypp::ZYppCommitResult::_remaining’ is deprecated (declared at
<http://river.suse.de/job/libzypp-HEAD/ws/checkout/zypp/ZYppCommitResult.h>:183)
[-Wdeprecated-declarations]
<http://river.suse.de/job/libzypp-HEAD/ws/checkout/zypp/ZYppCommitResult.h>:62:9:
warning: ‘zypp::ZYppCommitResult::_srcremaining’ is deprecated (declared at
<http://river.suse.de/job/libzypp-HEAD/ws/checkout/zypp/ZYppCommitResult.h>:187)
[-Wdeprecated-declarations]
<http://river.suse.de/job/libzypp-HEAD/ws/checkout/zypp/ZYppCommitResult.h>:62:9:
warning: ‘zypp::ZYppCommitResult::_srcremaining’ is deprecated (declared at
<http://river.suse.de/job/libzypp-HEAD/ws/checkout/zypp/ZYppCommitResult.h>:187)
[-Wdeprecated-declarations]
<http://river.suse.de/job/libzypp-HEAD/ws/checkout/zypp/ZYpp.cc>: In member
function ‘zypp::ZYppCommitResult zypp::ZYpp::commit(const
zypp::ZYppCommitPolicy&)’:
<http://river.suse.de/job/libzypp-HEAD/ws/checkout/zypp/ZYpp.cc>:98:37: note:
synthesized method
‘zypp::ZYppCommitResult::ZYppCommitResult(zypp::ZYppCommitResult&&)’ first
required here
[ 78%] Building CXX object zypp/CMakeFiles/zypp.dir/sat/Solvable.cc.o
In file included from
<http://river.suse.de/job/libzypp-HEAD/ws/checkout/zypp/ZYppFactory.cc>:26:0:
<http://river.suse.de/job/libzypp-HEAD/ws/checkout/zypp/zypp_detail/ZYppReadOnlyHack.h>:15:2:
warning: #warning ZYPP_ZYPP_DETAIL_ZYPPREADONLYHACK_H [-Wcpp]
[ 80%] Building CXX object zypp/CMakeFiles/zypp.dir/sat/SolvableSet.cc.o
In file included from
<http://river.suse.de/job/libzypp-HEAD/ws/checkout/zypp/ZYppCommit.h>:18:0,
from
<http://river.suse.de/job/libzypp-HEAD/ws/checkout/zypp/zypp_detail/ZYppImpl.h>:21,
from
<http://river.suse.de/job/libzypp-HEAD/ws/checkout/zypp/zypp_detail/ZYppImpl.cc>:18:
<http://river.suse.de/job/libzypp-HEAD/ws/checkout/zypp/ZYppCommitResult.h>: In
destructor ‘zypp::ZYppCommitResult::~ZYppCommitResult()’:
<http://river.suse.de/job/libzypp-HEAD/ws/checkout/zypp/ZYppCommitResult.h>:62:9:
warning: ‘zypp::ZYppCommitResult::_errors’ is deprecated (declared at
<http://river.suse.de/job/libzypp-HEAD/ws/checkout/zypp/ZYppCommitResult.h>:179)
[-Wdeprecated-declarations]
<http://river.suse.de/job/libzypp-HEAD/ws/checkout/zypp/ZYppCommitResult.h>:62:9:
warning: ‘zypp::ZYppCommitResult::_remaining’ is deprecated (declared at
<http://river.suse.de/job/libzypp-HEAD/ws/checkout/zypp/ZYppCommitResult.h>:183)
[-Wdeprecated-declarations]
<http://river.suse.de/job/libzypp-HEAD/ws/checkout/zypp/ZYppCommitResult.h>:62:9:
warning: ‘zypp::ZYppCommitResult::_srcremaining’ is deprecated (declared at
<http://river.suse.de/job/libzypp-HEAD/ws/checkout/zypp/ZYppCommitResult.h>:187)
[-Wdeprecated-declarations]
<http://river.suse.de/job/libzypp-HEAD/ws/checkout/zypp/zypp_detail/ZYppImpl.cc>:
In member function ‘zypp::ZYppCommitResult
zypp::zypp_detail::ZYppImpl::commit(const zypp::ZYppCommitPolicy&)’:
<http://river.suse.de/job/libzypp-HEAD/ws/checkout/zypp/zypp_detail/ZYppImpl.cc>:134:72:
note: synthesized method ‘zypp::ZYppCommitResult::~ZYppCommitResult()’ first
required here
In file included from
<http://river.suse.de/job/libzypp-HEAD/ws/checkout/zypp/ZYppCommit.h>:18:0,
from
<http://river.suse.de/job/libzypp-HEAD/ws/checkout/zypp/zypp_detail/ZYppImpl.h>:21,
from
<http://river.suse.de/job/libzypp-HEAD/ws/checkout/zypp/zypp_detail/ZYppImpl.cc>:18:
<http://river.suse.de/job/libzypp-HEAD/ws/checkout/zypp/ZYppCommitResult.h>: In
constructor
‘zypp::ZYppCommitResult::ZYppCommitResult(zypp::ZYppCommitResult&&)’:
<http://river.suse.de/job/libzypp-HEAD/ws/checkout/zypp/ZYppCommitResult.h>:62:9:
warning: ‘zypp::ZYppCommitResult::_result’ is deprecated (declared at
<http://river.suse.de/job/libzypp-HEAD/ws/checkout/zypp/ZYppCommitResult.h>:175)
[-Wdeprecated-declarations]
<http://river.suse.de/job/libzypp-HEAD/ws/checkout/zypp/ZYppCommitResult.h>:62:9:
warning: ‘zypp::ZYppCommitResult::_errors’ is deprecated (declared at
<http://river.suse.de/job/libzypp-HEAD/ws/checkout/zypp/ZYppCommitResult.h>:179)
[-Wdeprecated-declarations]
<http://river.suse.de/job/libzypp-HEAD/ws/checkout/zypp/ZYppCommitResult.h>:62:9:
warning: ‘zypp::ZYppCommitResult::_errors’ is deprecated (declared at
<http://river.suse.de/job/libzypp-HEAD/ws/checkout/zypp/ZYppCommitResult.h>:179)
[-Wdeprecated-declarations]
<http://river.suse.de/job/libzypp-HEAD/ws/checkout/zypp/ZYppCommitResult.h>:62:9:
warning: ‘zypp::ZYppCommitResult::_remaining’ is deprecated (declared at
<http://river.suse.de/job/libzypp-HEAD/ws/checkout/zypp/ZYppCommitResult.h>:183)
[-Wdeprecated-declarations]
<http://river.suse.de/job/libzypp-HEAD/ws/checkout/zypp/ZYppCommitResult.h>:62:9:
warning: ‘zypp::ZYppCommitResult::_remaining’ is deprecated (declared at
<http://river.suse.de/job/libzypp-HEAD/ws/checkout/zypp/ZYppCommitResult.h>:183)
[-Wdeprecated-declarations]
<http://river.suse.de/job/libzypp-HEAD/ws/checkout/zypp/ZYppCommitResult.h>:62:9:
warning: ‘zypp::ZYppCommitResult::_srcremaining’ is deprecated (declared at
<http://river.suse.de/job/libzypp-HEAD/ws/checkout/zypp/ZYppCommitResult.h>:187)
[-Wdeprecated-declarations]
<http://river.suse.de/job/libzypp-HEAD/ws/checkout/zypp/ZYppCommitResult.h>:62:9:
warning: ‘zypp::ZYppCommitResult::_srcremaining’ is deprecated (declared at
<http://river.suse.de/job/libzypp-HEAD/ws/checkout/zypp/ZYppCommitResult.h>:187)
[-Wdeprecated-declarations]
<http://river.suse.de/job/libzypp-HEAD/ws/checkout/zypp/zypp_detail/ZYppImpl.cc>:
In member function ‘zypp::ZYppCommitResult
zypp::zypp_detail::ZYppImpl::commit(const zypp::ZYppCommitPolicy&)’:
<http://river.suse.de/job/libzypp-HEAD/ws/checkout/zypp/zypp_detail/ZYppImpl.cc>:134:72:
note: synthesized method
‘zypp::ZYppCommitResult::ZYppCommitResult(zypp::ZYppCommitResult&&)’ first
required here
[ 80%] Building CXX object zypp/CMakeFiles/zypp.dir/sat/SolvIterMixin.cc.o
[ 80%] Building CXX object zypp/CMakeFiles/zypp.dir/sat/Queue.cc.o
[ 81%] Building CXX object zypp/CMakeFiles/zypp.dir/sat/Transaction.cc.o
[ 81%] Building CXX object zypp/CMakeFiles/zypp.dir/sat/WhatProvides.cc.o
[ 81%] Building CXX object zypp/CMakeFiles/zypp.dir/sat/WhatObsoletes.cc.o
[ 81%] Building CXX object zypp/CMakeFiles/zypp.dir/sat/LocaleSupport.cc.o
[ 83%] Building CXX object zypp/CMakeFiles/zypp.dir/sat/LookupAttr.cc.o
[ 83%] Building CXX object zypp/CMakeFiles/zypp.dir/sat/SolvAttr.cc.o
[ 83%] Building CXX object zypp/CMakeFiles/zypp.dir/sat/AttrMatcher.cc.o
[ 83%] Building CXX object zypp/CMakeFiles/zypp.dir/sat/detail/PoolImpl.cc.o
[ 85%] Building CXX object zypp/CMakeFiles/zypp.dir/ZConfig.cc.o
<http://river.suse.de/job/libzypp-HEAD/ws/checkout/zypp/sat/detail/PoolImpl.cc>:504:2:
warning: #warning immediately build LocaleSet as soon as Loale is an Id based
type [-Wcpp]
[ 85%] Building CXX object zypp/CMakeFiles/zypp.dir/Arch.cc.o
[ 85%] Building CXX object zypp/CMakeFiles/zypp.dir/Locale.cc.o
<http://river.suse.de/job/libzypp-HEAD/ws/checkout/zypp/sat/SolvAttr.cc>:33:2:
warning: #warning STILL ATTRIBUTES HERE WHICH ARE NOT PROVIDED BY SOLV FILES
[-Wcpp]
[ 85%] Building CXX object zypp/CMakeFiles/zypp.dir/CountryCode.cc.o
[ 86%] Building CXX object zypp/CMakeFiles/zypp.dir/LanguageCode.cc.o
[ 86%] Building CXX object zypp/CMakeFiles/zypp.dir/base/InterProcessMutex.cc.o
[ 86%] Building CXX object zypp/CMakeFiles/zypp.dir/base/SerialNumber.cc.o
[ 86%] Building CXX object zypp/CMakeFiles/zypp.dir/base/Random.cc.o
<http://river.suse.de/job/libzypp-HEAD/ws/checkout/zypp/ZConfig.cc>:165:2:
warning: #warning HACK AROUND BOOST_TEST_CATCH_SYSTEM_ERRORS [-Wcpp]
<http://river.suse.de/job/libzypp-HEAD/ws/checkout/zypp/ZConfig.cc>:631:2:
warning: #warning prefer signal [-Wcpp]
[ 88%] Building CXX object zypp/CMakeFiles/zypp.dir/base/Measure.cc.o
[ 88%] Building CXX object zypp/CMakeFiles/zypp.dir/base/Fd.cc.o
[ 88%] Building CXX object zypp/CMakeFiles/zypp.dir/base/Gettext.cc.o
[ 88%] Building CXX object zypp/CMakeFiles/zypp.dir/base/GzStream.cc.o
[ 90%] Building CXX object zypp/CMakeFiles/zypp.dir/base/IOStream.cc.o
[ 90%] Building CXX object zypp/CMakeFiles/zypp.dir/base/InputStream.cc.o
[ 90%] Building CXX object zypp/CMakeFiles/zypp.dir/base/ReferenceCounted.cc.o
[ 90%] Building CXX object zypp/CMakeFiles/zypp.dir/base/String.cc.o
[ 91%] Building CXX object zypp/CMakeFiles/zypp.dir/base/Regex.cc.o
[ 91%] Building CXX object zypp/CMakeFiles/zypp.dir/base/Unit.cc.o
[ 91%] Building CXX object zypp/CMakeFiles/zypp.dir/base/ExternalDataSource.cc.o
[ 91%] Building CXX object zypp/CMakeFiles/zypp.dir/base/Exception.cc.o
[ 93%] Building CXX object
zypp/CMakeFiles/zypp.dir/base/UserRequestException.cc.o
[ 93%] Building CXX object zypp/CMakeFiles/zypp.dir/base/Sysconfig.cc.o
[ 93%] Building CXX object zypp/CMakeFiles/zypp.dir/base/ProfilingFormater.cc.o
[ 93%] Building CXX object zypp/CMakeFiles/zypp.dir/base/LogControl.cc.o
Linking CXX shared library libzypp.so
[ 93%] Built target zypp
Scanning dependencies of target patch_find_bug
[ 93%] Scanning dependencies of target DumpSelectable
Building CXX object tools/CMakeFiles/patch_find_bug.dir/patch_find_bug.cc.o
Scanning dependencies of target NameReqPrv
Scanning dependencies of target ToolScanRepos
[ 95%] [ 96%] [ 96%] Building CXX object
tools/CMakeFiles/DumpSelectable.dir/DumpSelectable.cc.o
Building CXX object tools/CMakeFiles/NameReqPrv.dir/NameReqPrv.cc.o
Building CXX object tools/CMakeFiles/ToolScanRepos.dir/ToolScanRepos.cc.o
Linking CXX executable patch_find_bug
Linking CXX executable DumpSelectable
[ 96%] Built target patch_find_bug
Scanning dependencies of target percent-encode
[ 96%] Building CXX object
tools/CMakeFiles/percent-encode.dir/percent-encode.cc.o
Linking CXX executable NameReqPrv
Linking CXX executable percent-encode
Linking CXX executable ToolScanRepos
[ 96%] Built target percent-encode
Scanning dependencies of target zypp-CheckAccessDeleted
[ 98%] Building CXX object
tools/CMakeFiles/zypp-CheckAccessDeleted.dir/zypp-CheckAccessDeleted.cc.o
[ 98%] Built target DumpSelectable
Scanning dependencies of target zypp-list
[ 98%] Building CXX object tools/CMakeFiles/zypp-list.dir/zypp-list.cc.o
[ 98%] Built target NameReqPrv
Scanning dependencies of target zypp-pubkey
[ 98%] Building CXX object tools/CMakeFiles/zypp-pubkey.dir/zypp-pubkey.cc.o
[ 98%] Built target ToolScanRepos
Scanning dependencies of target COW_debug
[ 98%] Building CXX object examples/CMakeFiles/COW_debug.dir/COW_debug.cc.o
Linking CXX executable zypp-list
<http://river.suse.de/job/libzypp-HEAD/ws/checkout/tools/zypp-pubkey.cc>: In
function ‘int main(int, char**)’:
<http://river.suse.de/job/libzypp-HEAD/ws/checkout/tools/zypp-pubkey.cc>:92:36:
warning: unused variable ‘keyFiles’ [-Wunused-variable]
Linking CXX executable zypp-pubkey
In file included from
<http://river.suse.de/job/libzypp-HEAD/ws/checkout/examples/COW_debug.cc>:41:0:
<http://river.suse.de/job/libzypp-HEAD/ws/checkout/zypp/base/Debug.h>:13:2:
warning: #warning ZYPP_BASE_DEBUG_H included [-Wcpp]
Linking CXX executable COW_debug
[ 98%] Built target zypp-list
Scanning dependencies of target EditionCompare
[ 98%] Building CXX object
examples/CMakeFiles/EditionCompare.dir/EditionCompare.cc.o
Linking CXX executable zypp-CheckAccessDeleted
[ 98%] Built target zypp-pubkey
Scanning dependencies of target whatprovides
[100%] Building CXX object
examples/CMakeFiles/whatprovides.dir/whatprovides.cc.o
[100%] Built target COW_debug
Linking CXX executable EditionCompare
Linking CXX executable whatprovides
[100%] Built target EditionCompare
[100%] Built target zypp-CheckAccessDeleted
[100%] Built target whatprovides
+ popd
~/hudson/workspace/libzypp-HEAD
+ build_and_run_cmake_tests
+ echo '==> Building and running tests'
==> Building and running tests
+ pushd <http://river.suse.de/job/libzypp-HEAD/ws/build>
~/hudson/workspace/libzypp-HEAD/build ~/hudson/workspace/libzypp-HEAD
+ '[' -e ./CTestTestfile.cmake ']'
+ '[' -e tests ']'
+ pushd tests
~/hudson/workspace/libzypp-HEAD/build/tests
~/hudson/workspace/libzypp-HEAD/build ~/hudson/workspace/libzypp-HEAD
+ make -j 4
[ 0%] Built target mongoose
[ 80%] Built target zypp
Scanning dependencies of target zypp_test_utils
[ 81%] Building CXX object
tests/lib/CMakeFiles/zypp_test_utils.dir/WebServer.cc.o
Linking CXX static library libzypp_test_utils.a
[ 81%] Built target zypp_test_utils
Scanning dependencies of target CredentialManager_test
Scanning dependencies of target CredentialFileReader_test
Scanning dependencies of target MetaLinkParser_test
Scanning dependencies of target Arch_test
[ 81%] [ 81%] [ 81%] [ 81%] Building CXX object
tests/media/CMakeFiles/CredentialManager_test.dir/CredentialManager_test.cc.o
Building CXX object
tests/media/CMakeFiles/CredentialFileReader_test.dir/CredentialFileReader_test.cc.o
Building CXX object
tests/media/CMakeFiles/MetaLinkParser_test.dir/MetaLinkParser_test.cc.o
Building CXX object tests/zypp/CMakeFiles/Arch_test.dir/Arch_test.cc.o
Linking CXX executable CredentialManager_test
Linking CXX executable CredentialFileReader_test
[ 81%] Built target CredentialManager_test
Scanning dependencies of target Capabilities_test
[ 81%] Building CXX object
tests/zypp/CMakeFiles/Capabilities_test.dir/Capabilities_test.cc.o
[ 81%] Built target CredentialFileReader_test
Scanning dependencies of target CheckSum_test
[ 81%] Building CXX object
tests/zypp/CMakeFiles/CheckSum_test.dir/CheckSum_test.cc.o
Linking CXX executable Arch_test
Linking CXX executable CheckSum_test
Linking CXX executable Capabilities_test
[ 81%] Built target Arch_test
Scanning dependencies of target Date_test
[ 83%] Building CXX object tests/zypp/CMakeFiles/Date_test.dir/Date_test.cc.o
[ 83%] Built target CheckSum_test
Scanning dependencies of target Deltarpm_test
[ 83%] Building CXX object
tests/zypp/CMakeFiles/Deltarpm_test.dir/Deltarpm_test.cc.o
[ 83%] Built target Capabilities_test
Scanning dependencies of target Digest_test
[ 83%] Building CXX object
tests/zypp/CMakeFiles/Digest_test.dir/Digest_test.cc.o
Linking CXX executable MetaLinkParser_test
Linking CXX executable Deltarpm_test
[ 83%] Built target MetaLinkParser_test
Scanning dependencies of target Dup_test
[ 83%] Building CXX object tests/zypp/CMakeFiles/Dup_test.dir/Dup_test.cc.o
[ 83%] Built target Deltarpm_test
Scanning dependencies of target Edition_test
[ 84%] Building CXX object
tests/zypp/CMakeFiles/Edition_test.dir/Edition_test.cc.o
Linking CXX executable Digest_test
Linking CXX executable Dup_test
Linking CXX executable Edition_test
Linking CXX executable Date_test
[ 84%] Built target Edition_test
Scanning dependencies of target Fetcher_test
[ 84%] Building CXX object
tests/zypp/CMakeFiles/Fetcher_test.dir/Fetcher_test.cc.o
[ 84%] Built target Dup_test
Scanning dependencies of target FileChecker_test
[ 84%] Building CXX object
tests/zypp/CMakeFiles/FileChecker_test.dir/FileChecker_test.cc.o
[ 84%] Built target Digest_test
Scanning dependencies of target InstanceId_test
[ 84%] Building CXX object
tests/zypp/CMakeFiles/InstanceId_test.dir/InstanceId_test.cc.o
Linking CXX executable Fetcher_test
[ 84%] Built target Date_test
Scanning dependencies of target KeyRing_test
[ 84%] Building CXX object
tests/zypp/CMakeFiles/KeyRing_test.dir/KeyRing_test.cc.o
Linking CXX executable InstanceId_test
Linking CXX executable FileChecker_test
[ 84%] Built target InstanceId_test
Scanning dependencies of target Locks_test
[ 84%] Building CXX object tests/zypp/CMakeFiles/Locks_test.dir/Locks_test.cc.o
[ 84%] Built target Fetcher_test
Scanning dependencies of target MediaSetAccess_test
[ 84%] Building CXX object
tests/zypp/CMakeFiles/MediaSetAccess_test.dir/MediaSetAccess_test.cc.o
Linking CXX executable KeyRing_test
Linking CXX executable Locks_test
[ 84%] Built target FileChecker_test
Scanning dependencies of target PathInfo_test
[ 85%] Building CXX object
tests/zypp/CMakeFiles/PathInfo_test.dir/PathInfo_test.cc.o
[ 85%] Built target KeyRing_test
Scanning dependencies of target PluginFrame_test
[ 85%] Building CXX object
tests/zypp/CMakeFiles/PluginFrame_test.dir/PluginFrame_test.cc.o
[ 85%] Built target Locks_test
Scanning dependencies of target PoolQuery_test
[ 87%] Building CXX object
tests/zypp/CMakeFiles/PoolQuery_test.dir/PoolQuery_test.cc.o
Linking CXX executable MediaSetAccess_test
Linking CXX executable PluginFrame_test
Linking CXX executable PathInfo_test
<http://river.suse.de/job/libzypp-HEAD/ws/checkout/tests/zypp/PoolQuery_test.cc>:
In member function ‘void pool_query_equal::test_method()’:
<http://river.suse.de/job/libzypp-HEAD/ws/checkout/tests/zypp/PoolQuery_test.cc>:707:3:
error: inconsistent deduction for ‘auto’: ‘unsigned int’ and then ‘long
unsigned int’
<http://river.suse.de/job/libzypp-HEAD/ws/checkout/tests/zypp/PoolQuery_test.cc>:709:5:
error: inconsistent deduction for ‘auto’: ‘unsigned int’ and then ‘long
unsigned int’
make[2]: *** [tests/zypp/CMakeFiles/PoolQuery_test.dir/PoolQuery_test.cc.o]
Error 1
make[1]: *** [tests/zypp/CMakeFiles/PoolQuery_test.dir/all] Error 2
make[1]: *** Waiting for unfinished jobs....
[ 87%] Built target PluginFrame_test
[ 87%] Built target MediaSetAccess_test
[ 87%] Built target PathInfo_test
make: *** [all] Error 2
Build step 'Execute shell' marked build as failure
Archiving artifacts

--
To unsubscribe, e-mail: zypp-commit+unsubscribe@xxxxxxxxxxxx
For additional commands, e-mail: zypp-commit+help@xxxxxxxxxxxx

< Previous Next >
List Navigation
Follow Ups