Mailinglist Archive: zypp-commit (32 mails)

< Previous Next >
[zypp-commit] Build failed in Hudson: zypper-11.4 #18
  • From: hudson@xxxxxxx
  • Date: Sun, 12 Jun 2011 01:16:50 +0200 (CEST)
  • Message-id: <135344250.191307834210312.JavaMail.hudson@river>
See <http://river.suse.de/job/zypper-11.4/18/changes>

Changes:

[Michael Andres] Update zypper-po.tar.bz2

------------------------------------------
[...truncated 3 lines...]
Using strategy: Default
Last Built Revision: Revision d8b8b07cf6060051b17c0af5eaf1303788319126
(origin/SuSE-Code-11_4-Branch)
Checkout:checkout / <http://river.suse.de/job/zypper-11.4/ws/checkout> -
hudson.remoting.LocalChannel@30677ae4
GitAPI created
Fetching changes from the remote Git repository
Fetching upstream changes from git://gitorious.org/opensuse/zypper.git
[checkout] $ git fetch -t git://gitorious.org/opensuse/zypper.git
+refs/heads/*:refs/remotes/origin/*
[checkout] $ git ls-tree HEAD
[checkout] $ git tag -l SuSE-Code-11_4-Branch
[checkout] $ git rev-parse origin/SuSE-Code-11_4-Branch
Commencing build of Revision fb24ede8bafa8656c9806d8e50bd463f738b93c1
(origin/SuSE-Code-11_4-Branch)
GitAPI created
Checking out Revision fb24ede8bafa8656c9806d8e50bd463f738b93c1
(origin/SuSE-Code-11_4-Branch)
[checkout] $ git checkout -f fb24ede8bafa8656c9806d8e50bd463f738b93c1
[checkout] $ git tag -a -f -m "Hudson Build #18" hudson-zypper-11.4-18
Recording changes in branch origin/SuSE-Code-11_4-Branch
[checkout] $ git whatchanged --no-abbrev -M --pretty=raw
d8b8b07cf6060051b17c0af5eaf1303788319126..fb24ede8bafa8656c9806d8e50bd463f738b93c1
[zypper-11.4] $ /bin/sh -xe /tmp/hudson6555334276866259521.sh
+ echo '### BUILD ###'
### BUILD ###
+ echo '==> Reading build configuration'
==> Reading build configuration
+ . .hudson-scripts/base-functions
++ . .hudson-scripts/ascii_art
++ trap 'error_exit $?' ERR
++ echo 'Job running as user: root'
Job running as user: root
+++ date '+%F %T'
++ echo 'Started at: 2011-06-11 23:11:08'
Started at: 2011-06-11 23:11:08
+++ hostname --fqdn
++ export SITENAME=app4
++ SITENAME=app4
++ export TARGET_DIST=11.4
++ TARGET_DIST=11.4
++ export PROJECT=zypper
++ PROJECT=zypper
++ case $TARGET_DIST in
++ echo 'Warning: The target distribution can not be identified.'
Warning: The target distribution can not be identified.
++ echo 'Please name this job with a trailing '\''-<dist>'\'' like:
'\''zypper-11.3'\''.'
Please name this job with a trailing '-<dist>' like: 'zypper-11.3'.
++ TARGET_DIST=
+ . .hudson-scripts/build-functions
+ . .hudson-scripts/obs-functions
++ trap 'error_exit $?' ERR
++ export ALLOW_OBS_SUBMIT=yes
++ ALLOW_OBS_SUBMIT=yes
+ . .hudson-scripts/setup-buildenvironment
++ export RUNTESTS=1
++ RUNTESTS=1
++ export ICEJOBS=4
++ ICEJOBS=4
++ export CMAKE_INSTALL_PREFIX=/usr
++ CMAKE_INSTALL_PREFIX=/usr
+++ uname -m
+++ hostname -f
++ export 'CMAKEPARAS=-DBUILDNAME=x86_64 -DSITE=app4
-DCMAKE_INSTALL_PREFIX=/usr'
++ CMAKEPARAS='-DBUILDNAME=x86_64 -DSITE=app4 -DCMAKE_INSTALL_PREFIX=/usr'
++ echo 'Configuring cmake for Icecream ...'
Configuring cmake for Icecream ...
++ pushd <http://river.suse.de/job/zypper-11.4/ws/>
~/hudson/workspace/zypper-11.4 ~/hudson/workspace/zypper-11.4
+++ icecc --build-native
+++ tail -1
+++ sed -e 's/creating //'
+++ grep .tar.gz
++ export ICECC_ENV=d2c9e515f28630c59306721a3045cc2c.tar.gz
++ ICECC_ENV=d2c9e515f28630c59306721a3045cc2c.tar.gz
++ export ICECC_ENV=d2c9e515f28630c59306721a3045cc2c.tar.gz
++ ICECC_ENV=d2c9e515f28630c59306721a3045cc2c.tar.gz
++ export
ICECC_VERSION=<http://river.suse.de/job/zypper-11.4/ws/d2c9e515f28630c59306721a3045cc2c.tar.gz>
++
ICECC_VERSION=<http://river.suse.de/job/zypper-11.4/ws/d2c9e515f28630c59306721a3045cc2c.tar.gz>
++ export ICECREAM=-DCMAKE_CXX_COMPILER=/opt/icecream/bin/g++
++ ICECREAM=-DCMAKE_CXX_COMPILER=/opt/icecream/bin/g++
++ export CXX=/opt/icecream/bin/g++
++ CXX=/opt/icecream/bin/g++
++ export 'MAKECMD=make -j 4'
++ MAKECMD='make -j 4'
++ export MAKEBIN=make
++ MAKEBIN=make
++ export
PATH=/opt/icecream/bin:/usr/lib64/mpi/gcc/openmpi/bin:/sbin:/usr/sbin:/usr/local/sbin:/root/bin:/usr/local/bin:/usr/bin:/bin:/usr/X11R6/bin:/usr/games
++
PATH=/opt/icecream/bin:/usr/lib64/mpi/gcc/openmpi/bin:/sbin:/usr/sbin:/usr/local/sbin:/root/bin:/usr/local/bin:/usr/bin:/bin:/usr/X11R6/bin:/usr/games
++ popd
~/hudson/workspace/zypper-11.4
++ export CHECKOUTDIR=<http://river.suse.de/job/zypper-11.4/ws/checkout>
++ CHECKOUTDIR=<http://river.suse.de/job/zypper-11.4/ws/checkout>
++ export BUILDDIR=<http://river.suse.de/job/zypper-11.4/ws/build>
++ BUILDDIR=<http://river.suse.de/job/zypper-11.4/ws/build>
++ export PACKAGEDIR=<http://river.suse.de/job/zypper-11.4/ws/build/package>
++ PACKAGEDIR=<http://river.suse.de/job/zypper-11.4/ws/build/package>
++ export
ARTIFACTS=<http://river.suse.de/job/zypper-11.4/18/artifact/.artifacts>
++ ARTIFACTS=<http://river.suse.de/job/zypper-11.4/18/artifact/.artifacts>
++ export OBSDIR=<http://river.suse.de/job/zypper-11.4/ws/OBS>
++ OBSDIR=<http://river.suse.de/job/zypper-11.4/ws/OBS>
++ export RPMTOPDIR=<http://river.suse.de/job/zypper-11.4/ws/rpm>
++ RPMTOPDIR=<http://river.suse.de/job/zypper-11.4/ws/rpm>
++ export RPMOUT=<http://river.suse.de/job/zypper-11.4/ws/rpm/rpms>
++ RPMOUT=<http://river.suse.de/job/zypper-11.4/ws/rpm/rpms>
++ export RPMBUILDDIR=<http://river.suse.de/job/zypper-11.4/ws/rpm/rpmbuild>
++ RPMBUILDDIR=<http://river.suse.de/job/zypper-11.4/ws/rpm/rpmbuild>
++ export
RPMBUILDROOT=<http://river.suse.de/job/zypper-11.4/ws/rpm/rpmbuildroot>
++ RPMBUILDROOT=<http://river.suse.de/job/zypper-11.4/ws/rpm/rpmbuildroot>
++ rm -rf <http://river.suse.de/job/zypper-11.4/ws/rpm/rpms>
++ rm -rf <http://river.suse.de/job/zypper-11.4/ws/rpm/rpmbuild>
++ rm -rf <http://river.suse.de/job/zypper-11.4/ws/rpm/rpmbuildroot>
++ rm -rf <http://river.suse.de/job/zypper-11.4/18/artifact/.artifacts>
++ rm -rf <http://river.suse.de/job/zypper-11.4/ws/OBS>
++ rm -rf '<http://river.suse.de/job/zypper-11.4/ws/copy-to-slave*.dir'>
++ [[ '' == 1 ]]
++ rm -rf <http://river.suse.de/job/zypper-11.4/ws/build>
++ mkdir -p <http://river.suse.de/job/zypper-11.4/ws/build>
++ mkdir -p <http://river.suse.de/job/zypper-11.4/ws/rpm>
++ mkdir -p <http://river.suse.de/job/zypper-11.4/ws/rpm/rpms>
++ mkdir -p <http://river.suse.de/job/zypper-11.4/ws/rpm/rpmbuild>
++ mkdir -p <http://river.suse.de/job/zypper-11.4/ws/rpm/rpmbuildroot>
++ mkdir -p <http://river.suse.de/job/zypper-11.4/18/artifact/.artifacts>
++ mkdir -p <http://river.suse.de/job/zypper-11.4/ws/OBS>
++ cat
+ build_cmake
+ echo '==> Building'
==> Building
+ pushd <http://river.suse.de/job/zypper-11.4/ws/build>
~/hudson/workspace/zypper-11.4/build ~/hudson/workspace/zypper-11.4
+ cmake -DBUILDNAME=x86_64 -DSITE=app4 -DCMAKE_INSTALL_PREFIX=/usr
-DCMAKE_CXX_COMPILER=/opt/icecream/bin/g++
<http://river.suse.de/job/zypper-11.4/ws/checkout>
-- The C compiler identification is GNU
-- The CXX compiler identification is GNU
-- Check for working C compiler: /opt/icecream/bin/gcc
-- Check for working C compiler: /opt/icecream/bin/gcc -- works
-- Detecting C compiler ABI info
-- Detecting C compiler ABI info - done
-- Check for working CXX compiler: /opt/icecream/bin/g++
-- Check for working CXX compiler: /opt/icecream/bin/g++ -- works
-- Detecting CXX compiler ABI info
-- Detecting CXX compiler ABI info - done
-- Libraries will be installed in /usr/lib64
-- Config files will be installed in /etc
** Manual files will be installed in /usr/share/man
-- Writing spec file...
-- I hate you rpm-lint...!!!
-- ZYpp path not set. Looking for it.
-- ZYpp found: includes in /usr/include, library in /usr/lib64/libzypp.so
-- readline found: includes in /usr/include, library in
/usr/lib64/libreadline.so
-- augeas found: includes in /usr/include, library in /usr/lib64/libaugeas.so
** Locale dir is /usr/share/locale
** ZYpper binary will be installed in /usr/bin
-- Translation set: zypper-po.tar.bz2
-- Translations:
sk.po;sl.po;el.po;tr.po;ja.po;ru.po;es.po;km.po;th.po;wa.po;en_GB.po;lt.po;be.po;ko.po;hr.po;sr.po;hi.po;en_US.po;mk.po;af.po;ta.po;fi.po;pl.po;uk.po;vi.po;cy.po;bn.po;zh_TW.po;id.po;de.po;sv.po;zu.po;si.po;zh_CN.po;da.po;nb.po;hu.po;et.po;cs.po;ar.po;mr.po;gu.po;ka.po;ca.po;nl.po;lo.po;he.po;gl.po;fr.po;pa.po;tg.po;it.po;ro.po;nds.po;xh.po;bg.po;pt_BR.po;bs.po;pt.po;
-- Configuring done
-- Generating done
-- Build files have been written to:
<http://river.suse.de/job/zypper-11.4/ws/build>
+ make -j 4
Scanning dependencies of target translations
[ 0%] Generating sk.po, sl.po, el.po, tr.po, ja.po, ru.po, es.po, km.po,
th.po, wa.po, en_GB.po, lt.po, be.po, ko.po, hr.po, sr.po, hi.po, en_US.po,
mk.po, af.po, ta.po, fi.po, pl.po, uk.po, vi.po, cy.po, bn.po, zh_TW.po, id.po,
de.po, sv.po, zu.po, si.po, zh_CN.po, da.po, nb.po, hu.po, et.po, cs.po, ar.po,
mr.po, gu.po, ka.po, ca.po, nl.po, lo.po, he.po, gl.po, fr.po, pa.po, tg.po,
it.po, ro.po, nds.po, xh.po, bg.po, pt_BR.po, bs.po, pt.po
Scanning dependencies of target zypp-refresh
Scanning dependencies of target zypp-refresh-wrapper
[ 1%] [ 2%] Building CXX object
src/CMakeFiles/zypp-refresh.dir/zypp-refresh.cc.o
Building C object
src/CMakeFiles/zypp-refresh-wrapper.dir/zypp-refresh-wrapper.c.o
Scanning dependencies of target zypper_lib
[ 3%] Building CXX object src/CMakeFiles/zypper_lib.dir/Zypper.cc.o
Linking C executable zypp-refresh-wrapper
tar: ./nl.po: time stamp 2011-06-11 23:13:45 is 132.753181779 s in the future
tar: .: time stamp 2011-06-11 23:14:23 is 170.500546461 s in the future
[ 3%] Generating sk.gmo
[ 3%] Generating sl.gmo
[ 3%] Generating el.gmo
[ 3%] Generating tr.gmo
[ 3%] Generating ja.gmo
[ 3%] Generating ru.gmo
[ 3%] Generating es.gmo
[ 3%] Generating km.gmo
[ 3%] Generating th.gmo
[ 3%] Generating wa.gmo
[ 3%] Generating en_GB.gmo
[ 3%] Generating lt.gmo
[ 3%] Generating be.gmo
[ 3%] Generating ko.gmo
[ 3%] Generating hr.gmo
[ 3%] Built target zypp-refresh-wrapper
[ 3%] [ 4%] Generating sr.gmo
Building CXX object src/CMakeFiles/zypper_lib.dir/Command.cc.o
[ 4%] Generating hi.gmo
[ 4%] Generating en_US.gmo
[ 4%] Generating mk.gmo
In file included from
<http://river.suse.de/job/zypper-11.4/ws/checkout/src/Zypper.cc>:26:0:
/usr/include/zypp/zypp_detail/ZYppReadOnlyHack.h:15:2: warning: #warning
ZYPP_ZYPP_DETAIL_ZYPPREADONLYHACK_H
[ 4%] Generating af.gmo
[ 4%] Generating ta.gmo
[ 4%] Generating fi.gmo
[ 4%] Generating pl.gmo
[ 4%] Generating uk.gmo
[ 4%] Generating vi.gmo
[ 4%] Generating cy.gmo
[ 4%] Generating bn.gmo
[ 4%] Generating zh_TW.gmo
[ 4%] Generating id.gmo
[ 4%] Generating de.gmo
[ 4%] Generating sv.gmo
[ 4%] Generating zu.gmo
[ 4%] Generating si.gmo
[ 4%] Generating zh_CN.gmo
[ 4%] Generating da.gmo
[ 4%] Generating nb.gmo
[ 4%] Generating hu.gmo
[ 4%] Generating et.gmo
[ 4%] Generating cs.gmo
[ 4%] Generating ar.gmo
[ 4%] Generating mr.gmo
[ 4%] Generating gu.gmo
Linking CXX executable zypp-refresh
[ 4%] Generating ka.gmo
[ 4%] Generating ca.gmo
[ 4%] Generating nl.gmo
[ 4%] Generating lo.gmo
[ 4%] Generating he.gmo
[ 4%] Generating gl.gmo
[ 4%] Generating fr.gmo
[ 4%] [ 4%] Generating pa.gmo
Built target zypp-refresh
[ 4%] Generating tg.gmo
[ 4%] Generating it.gmo
[ 4%] Generating ro.gmo
[ 4%] Generating nds.gmo
[ 4%] Generating xh.gmo
[ 4%] Generating bg.gmo
[ 4%] Generating pt_BR.gmo
[ 4%] Generating bs.gmo
[ 4%] Generating pt.gmo
[ 5%] Building CXX object src/CMakeFiles/zypper_lib.dir/Config.cc.o
[ 70%] Built target translations
[ 71%] Building CXX object src/CMakeFiles/zypper_lib.dir/repos.cc.o
[ 72%] Building CXX object src/CMakeFiles/zypper_lib.dir/misc.cc.o
[ 73%] Building CXX object src/CMakeFiles/zypper_lib.dir/search.cc.o
<http://river.suse.de/job/zypper-11.4/ws/checkout/src/Zypper.cc>: In member
function 'void Zypper::doCommand()':
<http://river.suse.de/job/zypper-11.4/ws/checkout/src/Zypper.cc>:2484:27:
warning: 'void zypp::zypp_readonly_hack::IWantIt()' is deprecated (declared at
/usr/include/zypp/zypp_detail/ZYppReadOnlyHack.h:26)
<http://river.suse.de/job/zypper-11.4/ws/checkout/src/Zypper.cc>:2484:36:
warning: 'void zypp::zypp_readonly_hack::IWantIt()' is deprecated (declared at
/usr/include/zypp/zypp_detail/ZYppReadOnlyHack.h:26)
<http://river.suse.de/job/zypper-11.4/ws/checkout/src/Zypper.cc>:2489:27:
warning: 'void zypp::zypp_readonly_hack::IWantIt()' is deprecated (declared at
/usr/include/zypp/zypp_detail/ZYppReadOnlyHack.h:26)
<http://river.suse.de/job/zypper-11.4/ws/checkout/src/Zypper.cc>:2489:36:
warning: 'void zypp::zypp_readonly_hack::IWantIt()' is deprecated (declared at
/usr/include/zypp/zypp_detail/ZYppReadOnlyHack.h:26)
[ 75%] Building CXX object src/CMakeFiles/zypper_lib.dir/info.cc.o
[ 76%] Building CXX object src/CMakeFiles/zypper_lib.dir/Table.cc.o

cc1plus: out of memory allocating 262144 bytes after a total of 2793472 bytes
ICECC[17044] 23:11:44: Compiled on 10.11.0.18
make[2]: *** [src/CMakeFiles/zypper_lib.dir/search.cc.o] Error 1
make[2]: *** Waiting for unfinished jobs....
ICECC[17050] 23:11:46: got exception 17 (10.11.0.18)
make[1]: *** [src/CMakeFiles/zypper_lib.dir/all] Error 2
make: *** [all] Error 2
Archiving artifacts

--
To unsubscribe, e-mail: zypp-commit+unsubscribe@xxxxxxxxxxxx
For additional commands, e-mail: zypp-commit+help@xxxxxxxxxxxx

< Previous Next >
This Thread
Follow Ups