Mailinglist Archive: zypp-commit (39 mails)

< Previous Next >
[zypp-commit] Build failed in Hudson: libzypp-HEAD #226
  • From: hudson@xxxxxxx
  • Date: Fri, 8 Apr 2011 13:43:09 +0200 (CEST)
  • Message-id: <1394451078.61302262990029.JavaMail.hudson@river>
See <http://river.suse.de/job/libzypp-HEAD/226/>

------------------------------------------
[...truncated 211 lines...]
[ 14%] Building CXX object zypp/CMakeFiles/zypp.dir/media/MediaAccess.cc.o
[ 16%] Building CXX object zypp/CMakeFiles/zypp.dir/media/MediaHandler.cc.o
[ 16%] Building CXX object zypp/CMakeFiles/zypp.dir/media/Mount.cc.o
<http://river.suse.de/job/libzypp-HEAD/ws/checkout/zypp/media/MediaHandler.cc>:398:2:
warning: #warning Use class TmpDir from TmpPath.h
[ 16%] Building CXX object zypp/CMakeFiles/zypp.dir/media/MediaNFS.cc.o
[ 16%] Building CXX object zypp/CMakeFiles/zypp.dir/media/MediaCD.cc.o
[ 18%] Building CXX object zypp/CMakeFiles/zypp.dir/media/MediaDIR.cc.o
[ 18%] Building CXX object zypp/CMakeFiles/zypp.dir/media/MediaDISK.cc.o
[ 18%] ICECC[2884] 13:42:13: got exception 17 (10.11.0.42)
Building CXX object zypp/CMakeFiles/zypp.dir/media/MediaCIFS.cc.o
[ 18%] Building CXX object zypp/CMakeFiles/zypp.dir/media/ProxyInfo.cc.o
[ 19%] Building CXX object zypp/CMakeFiles/zypp.dir/media/MediaCurl.cc.o
[ 19%] Building CXX object zypp/CMakeFiles/zypp.dir/media/MediaMultiCurl.cc.o
ICECC[2927] 13:42:15: got exception 17 (10.11.0.42)
[ 19%] Building CXX object zypp/CMakeFiles/zypp.dir/media/MediaAria2c.cc.o
ICECC[2945] 13:42:17: got exception 17 (10.11.0.42)
[ 19%] Building CXX object zypp/CMakeFiles/zypp.dir/media/MediaISO.cc.o
ICECC[2953] 13:42:17: got exception 17 (10.11.0.42)
[ 21%] Building CXX object zypp/CMakeFiles/zypp.dir/media/MediaPlugin.cc.o
[ 21%] Building CXX object zypp/CMakeFiles/zypp.dir/media/MediaSource.cc.o
[ 21%] Building CXX object zypp/CMakeFiles/zypp.dir/media/MediaManager.cc.o
[ 21%] Building CXX object zypp/CMakeFiles/zypp.dir/media/MediaUserAuth.cc.o
<http://river.suse.de/job/libzypp-HEAD/ws/checkout/zypp/media/MediaMultiCurl.cc>:
In member function ‘void zypp::media::multifetchworker::nextjob()’:
<http://river.suse.de/job/libzypp-HEAD/ws/checkout/zypp/media/MediaMultiCurl.cc>:718:49:
warning: comparison between signed and unsigned integer expressions
[ 22%] Building CXX object
zypp/CMakeFiles/zypp.dir/media/CredentialFileReader.cc.o
[ 22%] Building CXX object zypp/CMakeFiles/zypp.dir/media/CredentialManager.cc.o
[ 22%] [ 24%] Building CXX object zypp/CMakeFiles/zypp.dir/media/CurlConfig.cc.o
Building CXX object zypp/CMakeFiles/zypp.dir/media/TransferSettings.cc.o
[ 24%] Building CXX object zypp/CMakeFiles/zypp.dir/media/MediaPriority.cc.o
<http://river.suse.de/job/libzypp-HEAD/ws/checkout/zypp/media/CurlConfig.cc>:
In static member function 'static int
zypp::media::CurlConfig::parseConfig(zypp::media::CurlConfig&, const
std::string&)':
<http://river.suse.de/job/libzypp-HEAD/ws/checkout/zypp/media/CurlConfig.cc>:48:29:
warning: converting to non-pointer type 'char' from NULL
[ 24%] Building CXX object zypp/CMakeFiles/zypp.dir/media/MetaLinkParser.cc.o
[ 24%] Building CXX object zypp/CMakeFiles/zypp.dir/media/ZsyncParser.cc.o
[ 26%] Building CXX object zypp/CMakeFiles/zypp.dir/media/MediaBlockList.cc.o
[ 26%] Building CXX object zypp/CMakeFiles/zypp.dir/media/UrlResolverPlugin.cc.o
[ 26%] Building CXX object zypp/CMakeFiles/zypp.dir/url/UrlUtils.cc.o
[ 26%] Building CXX object zypp/CMakeFiles/zypp.dir/url/UrlBase.cc.o
[ 27%] Building CXX object zypp/CMakeFiles/zypp.dir/repo/RepoException.cc.o
[ 27%] Building CXX object zypp/CMakeFiles/zypp.dir/repo/RepoMirrorList.cc.o
[ 27%] Building CXX object zypp/CMakeFiles/zypp.dir/repo/RepoType.cc.o
[ 27%] Building CXX object zypp/CMakeFiles/zypp.dir/repo/ServiceType.cc.o
[ 29%] Building CXX object zypp/CMakeFiles/zypp.dir/repo/PackageProvider.cc.o
[ 29%] Building CXX object zypp/CMakeFiles/zypp.dir/repo/SrcPackageProvider.cc.o
[ 29%] Building CXX object zypp/CMakeFiles/zypp.dir/repo/RepoProvideFile.cc.o
[ 29%] Building CXX object zypp/CMakeFiles/zypp.dir/repo/DeltaCandidates.cc.o
ICECC[3084] 13:42:26: got exception 17 (10.11.0.42)
[ 31%] Building CXX object zypp/CMakeFiles/zypp.dir/repo/Applydeltarpm.cc.o
ICECC[3096] 13:42:27: got exception 17 (10.11.0.42)
[ 31%] Building CXX object zypp/CMakeFiles/zypp.dir/repo/PackageDelta.cc.o
[ 31%] Building CXX object zypp/CMakeFiles/zypp.dir/repo/SUSEMediaVerifier.cc.o
<http://river.suse.de/job/libzypp-HEAD/ws/checkout/zypp/repo/SUSEMediaVerifier.cc>:58:2:
warning: #warning check the stream status
[ 31%] Building CXX object
zypp/CMakeFiles/zypp.dir/repo/MediaInfoDownloader.cc.o
[ 32%] Building CXX object zypp/CMakeFiles/zypp.dir/repo/Downloader.cc.o
[ 32%] Building CXX object zypp/CMakeFiles/zypp.dir/repo/RepoVariables.cc.o
[ 32%] Building CXX object zypp/CMakeFiles/zypp.dir/repo/RepoInfoBase.cc.o
[ 32%] Building CXX object zypp/CMakeFiles/zypp.dir/repo/PluginServices.cc.o
[ 34%] Building CXX object zypp/CMakeFiles/zypp.dir/repo/ServiceRepos.cc.o
[ 34%] Building CXX object zypp/CMakeFiles/zypp.dir/repo/yum/Downloader.cc.o
[ 34%] Building CXX object zypp/CMakeFiles/zypp.dir/repo/yum/ResourceType.cc.o
<http://river.suse.de/job/libzypp-HEAD/ws/checkout/zypp/repo/yum/Downloader.cc>:147:2:
warning: #warning Do we need SignatureFileChecker(string descr)?
[ 34%] Building CXX object
zypp/CMakeFiles/zypp.dir/repo/susetags/Downloader.cc.o
[ 36%] [ 36%] Building CXX object
zypp/CMakeFiles/zypp.dir/target/rpm/RpmCallbacks.cc.o
Building CXX object zypp/CMakeFiles/zypp.dir/target/rpm/BinHeader.cc.o
[ 36%] Building CXX object zypp/CMakeFiles/zypp.dir/target/rpm/RpmDb.cc.o
<http://river.suse.de/job/libzypp-HEAD/ws/checkout/zypp/target/rpm/BinHeader.cc>:
In member function 'int
zypp::target::rpm::BinHeader::intList::operator[](unsigned int) const':
<http://river.suse.de/job/libzypp-HEAD/ws/checkout/zypp/target/rpm/BinHeader.cc>:69:12:
warning: enumeration value 'RPM_NULL_TYPE' not handled in switch
<http://river.suse.de/job/libzypp-HEAD/ws/checkout/zypp/target/rpm/BinHeader.cc>:69:12:
warning: enumeration value 'RPM_CHAR_TYPE' not handled in switch
<http://river.suse.de/job/libzypp-HEAD/ws/checkout/zypp/target/rpm/BinHeader.cc>:69:12:
warning: enumeration value 'RPM_INT64_TYPE' not handled in switch
<http://river.suse.de/job/libzypp-HEAD/ws/checkout/zypp/target/rpm/BinHeader.cc>:69:12:
warning: enumeration value 'RPM_STRING_TYPE' not handled in switch
<http://river.suse.de/job/libzypp-HEAD/ws/checkout/zypp/target/rpm/BinHeader.cc>:69:12:
warning: enumeration value 'RPM_BIN_TYPE' not handled in switch
<http://river.suse.de/job/libzypp-HEAD/ws/checkout/zypp/target/rpm/BinHeader.cc>:69:12:
warning: enumeration value 'RPM_STRING_ARRAY_TYPE' not handled in switch
<http://river.suse.de/job/libzypp-HEAD/ws/checkout/zypp/target/rpm/BinHeader.cc>:69:12:
warning: enumeration value 'RPM_I18NSTRING_TYPE' not handled in switch
<http://river.suse.de/job/libzypp-HEAD/ws/checkout/zypp/target/rpm/BinHeader.cc>:
In member function 'unsigned int
zypp::target::rpm::BinHeader::int_list(zypp::target::rpm::BinHeader::tag,
zypp::target::rpm::BinHeader::intList&) const':
<http://river.suse.de/job/libzypp-HEAD/ws/checkout/zypp/target/rpm/BinHeader.cc>:221:7:
warning: 'int headerGetEntry(headerToken_s*, rpmTag, rpmTagType*, void**,
rpm_count_t*)' is deprecated (declared at /usr/include/rpm/rpmlegacy.h:48)
<http://river.suse.de/job/libzypp-HEAD/ws/checkout/zypp/target/rpm/BinHeader.cc>:221:60:
warning: 'int headerGetEntry(headerToken_s*, rpmTag, rpmTagType*, void**,
rpm_count_t*)' is deprecated (declared at /usr/include/rpm/rpmlegacy.h:48)
<http://river.suse.de/job/libzypp-HEAD/ws/checkout/zypp/target/rpm/BinHeader.cc>:
In member function 'unsigned int
zypp::target::rpm::BinHeader::string_list(zypp::target::rpm::BinHeader::tag,
zypp::target::rpm::BinHeader::stringList&) const':
<http://river.suse.de/job/libzypp-HEAD/ws/checkout/zypp/target/rpm/BinHeader.cc>:263:7:
warning: 'int headerGetEntry(headerToken_s*, rpmTag, rpmTagType*, void**,
rpm_count_t*)' is deprecated (declared at /usr/include/rpm/rpmlegacy.h:48)
<http://river.suse.de/job/libzypp-HEAD/ws/checkout/zypp/target/rpm/BinHeader.cc>:263:60:
warning: 'int headerGetEntry(headerToken_s*, rpmTag, rpmTagType*, void**,
rpm_count_t*)' is deprecated (declared at /usr/include/rpm/rpmlegacy.h:48)
<http://river.suse.de/job/libzypp-HEAD/ws/checkout/zypp/target/rpm/BinHeader.cc>:
In member function 'int
zypp::target::rpm::BinHeader::int_val(zypp::target::rpm::BinHeader::tag) const':
<http://river.suse.de/job/libzypp-HEAD/ws/checkout/zypp/target/rpm/BinHeader.cc>:297:7:
warning: 'int headerGetEntry(headerToken_s*, rpmTag, rpmTagType*, void**,
rpm_count_t*)' is deprecated (declared at /usr/include/rpm/rpmlegacy.h:48)
<http://river.suse.de/job/libzypp-HEAD/ws/checkout/zypp/target/rpm/BinHeader.cc>:297:60:
warning: 'int headerGetEntry(headerToken_s*, rpmTag, rpmTagType*, void**,
rpm_count_t*)' is deprecated (declared at /usr/include/rpm/rpmlegacy.h:48)
<http://river.suse.de/job/libzypp-HEAD/ws/checkout/zypp/target/rpm/BinHeader.cc>:
In member function 'std::string
zypp::target::rpm::BinHeader::string_val(zypp::target::rpm::BinHeader::tag)
const':
<http://river.suse.de/job/libzypp-HEAD/ws/checkout/zypp/target/rpm/BinHeader.cc>:342:7:
warning: 'int headerGetEntry(headerToken_s*, rpmTag, rpmTagType*, void**,
rpm_count_t*)' is deprecated (declared at /usr/include/rpm/rpmlegacy.h:48)
<http://river.suse.de/job/libzypp-HEAD/ws/checkout/zypp/target/rpm/BinHeader.cc>:342:60:
warning: 'int headerGetEntry(headerToken_s*, rpmTag, rpmTagType*, void**,
rpm_count_t*)' is deprecated (declared at /usr/include/rpm/rpmlegacy.h:48)
[ 37%] Building CXX object zypp/CMakeFiles/zypp.dir/target/rpm/RpmException.cc.o
<http://river.suse.de/job/libzypp-HEAD/ws/checkout/zypp/target/rpm/RpmDb.cc>:220:2:
warning: #warning Check for obsolete memebers
<http://river.suse.de/job/libzypp-HEAD/ws/checkout/zypp/target/rpm/RpmDb.cc>:388:2:
warning: #warning CHECK: notify root about conversion backup.
<http://river.suse.de/job/libzypp-HEAD/ws/checkout/zypp/target/rpm/RpmDb.cc>:646:2:
warning: #warning CHECK: compare vs existing v3 backup. notify root
[ 37%] Building CXX object zypp/CMakeFiles/zypp.dir/target/rpm/RpmHeader.cc.o
[ 37%] [ 37%] Building CXX object
zypp/CMakeFiles/zypp.dir/target/rpm/librpmDb.cc.o
Building CXX object zypp/CMakeFiles/zypp.dir/target/rpm/librpmDb.cv3.cc.o
<http://river.suse.de/job/libzypp-HEAD/ws/checkout/zypp/target/rpm/RpmHeader.cc>:391:2:
warning: #warning CHECK IF FILE REQUIRES HANDLING IS OBSOLETE
<http://river.suse.de/job/libzypp-HEAD/ws/checkout/zypp/target/rpm/librpmDb.cc>:704:2:
warning: #warning TESTCASE: rpmdbAppendIterator and (non)sequential access?
<http://river.suse.de/job/libzypp-HEAD/ws/checkout/zypp/target/rpm/librpmDb.cc>:719:2:
warning: #warning TESTCASE: rpmdbGetIteratorCount returns 0 on sequential
access?
<http://river.suse.de/job/libzypp-HEAD/ws/checkout/zypp/target/rpm/librpmDb.cv3.cc>:448:2:
warning: #warning Add CBSuggest handling if needed, also on lines below
ICECC[3196] 13:42:34: got exception 17 (10.11.0.42)
[ 39%] Building CXX object
zypp/CMakeFiles/zypp.dir/target/modalias/Modalias.cc.o
<http://river.suse.de/job/libzypp-HEAD/ws/checkout/zypp/target/rpm/RpmDb.cc>:220:2:
warning: #warning Check for obsolete memebers
<http://river.suse.de/job/libzypp-HEAD/ws/checkout/zypp/target/rpm/RpmDb.cc>:388:2:
warning: #warning CHECK: notify root about conversion backup.
<http://river.suse.de/job/libzypp-HEAD/ws/checkout/zypp/target/rpm/RpmDb.cc>:646:2:
warning: #warning CHECK: compare vs existing v3 backup. notify root
[ 39%] Building CXX object
zypp/CMakeFiles/zypp.dir/target/RequestedLocalesFile.cc.o
[ 39%] Building CXX object zypp/CMakeFiles/zypp.dir/target/SoftLocksFile.cc.o
<http://river.suse.de/job/libzypp-HEAD/ws/checkout/zypp/target/rpm/librpmDb.cv3.cc>:
In function 'void zypp::target::rpm::compressFilelist(headerToken_s*)':
<http://river.suse.de/job/libzypp-HEAD/ws/checkout/zypp/target/rpm/librpmDb.cv3.cc>:181:12:
warning: 'int_32' is deprecated (declared at /usr/include/rpm/rpmlegacy.h:18)
<http://river.suse.de/job/libzypp-HEAD/ws/checkout/zypp/target/rpm/librpmDb.cv3.cc>:195:10:
warning: 'int headerRemoveEntry(headerToken_s*, rpmTag)' is deprecated
(declared at /usr/include/rpm/rpmlegacy.h:142)
<http://river.suse.de/job/libzypp-HEAD/ws/checkout/zypp/target/rpm/librpmDb.cv3.cc>:195:50:
warning: 'int headerRemoveEntry(headerToken_s*, rpmTag)' is deprecated
(declared at /usr/include/rpm/rpmlegacy.h:142)
<http://river.suse.de/job/libzypp-HEAD/ws/checkout/zypp/target/rpm/librpmDb.cv3.cc>:200:8:
warning: 'int headerGetEntryMinMemory(headerToken_s*, rpmTag, rpmTagType*,
void**, rpm_count_t*)' is deprecated (declared at
/usr/include/rpm/rpmlegacy.h:66)
<http://river.suse.de/job/libzypp-HEAD/ws/checkout/zypp/target/rpm/librpmDb.cv3.cc>:200:85:
warning: 'int headerGetEntryMinMemory(headerToken_s*, rpmTag, rpmTagType*,
void**, rpm_count_t*)' is deprecated (declared at
/usr/include/rpm/rpmlegacy.h:66)
<http://river.suse.de/job/libzypp-HEAD/ws/checkout/zypp/target/rpm/librpmDb.cv3.cc>:208:24:
warning: 'int_32' is deprecated (declared at /usr/include/rpm/rpmlegacy.h:18)
<http://river.suse.de/job/libzypp-HEAD/ws/checkout/zypp/target/rpm/librpmDb.cv3.cc>:260:10:
warning: 'int headerAddEntry(headerToken_s*, rpmTag, rpmTagType, const void*,
rpm_count_t)' is deprecated (declared at /usr/include/rpm/rpmlegacy.h:85)
<http://river.suse.de/job/libzypp-HEAD/ws/checkout/zypp/target/rpm/librpmDb.cv3.cc>:260:80:
warning: 'int headerAddEntry(headerToken_s*, rpmTag, rpmTagType, const void*,
rpm_count_t)' is deprecated (declared at /usr/include/rpm/rpmlegacy.h:85)
<http://river.suse.de/job/libzypp-HEAD/ws/checkout/zypp/target/rpm/librpmDb.cv3.cc>:261:10:
warning: 'int headerAddEntry(headerToken_s*, rpmTag, rpmTagType, const void*,
rpm_count_t)' is deprecated (declared at /usr/include/rpm/rpmlegacy.h:85)
<http://river.suse.de/job/libzypp-HEAD/ws/checkout/zypp/target/rpm/librpmDb.cv3.cc>:262:30:
warning: 'int headerAddEntry(headerToken_s*, rpmTag, rpmTagType, const void*,
rpm_count_t)' is deprecated (declared at /usr/include/rpm/rpmlegacy.h:85)
<http://river.suse.de/job/libzypp-HEAD/ws/checkout/zypp/target/rpm/librpmDb.cv3.cc>:263:10:
warning: 'int headerAddEntry(headerToken_s*, rpmTag, rpmTagType, const void*,
rpm_count_t)' is deprecated (declared at /usr/include/rpm/rpmlegacy.h:85)
<http://river.suse.de/job/libzypp-HEAD/ws/checkout/zypp/target/rpm/librpmDb.cv3.cc>:264:36:
warning: 'int headerAddEntry(headerToken_s*, rpmTag, rpmTagType, const void*,
rpm_count_t)' is deprecated (declared at /usr/include/rpm/rpmlegacy.h:85)
<http://river.suse.de/job/libzypp-HEAD/ws/checkout/zypp/target/rpm/librpmDb.cv3.cc>:267:23:
warning: 'void* headerFreeData(void*, rpmTagType)' is deprecated (declared at
/usr/include/rpm/rpmlegacy.h:195)
<http://river.suse.de/job/libzypp-HEAD/ws/checkout/zypp/target/rpm/librpmDb.cv3.cc>:267:52:
warning: 'void* headerFreeData(void*, rpmTagType)' is deprecated (declared at
/usr/include/rpm/rpmlegacy.h:195)
<http://river.suse.de/job/libzypp-HEAD/ws/checkout/zypp/target/rpm/librpmDb.cv3.cc>:269:8:
warning: 'int headerRemoveEntry(headerToken_s*, rpmTag)' is deprecated
(declared at /usr/include/rpm/rpmlegacy.h:142)
<http://river.suse.de/job/libzypp-HEAD/ws/checkout/zypp/target/rpm/librpmDb.cv3.cc>:269:48:
warning: 'int headerRemoveEntry(headerToken_s*, rpmTag)' is deprecated
(declared at /usr/include/rpm/rpmlegacy.h:142)
<http://river.suse.de/job/libzypp-HEAD/ws/checkout/zypp/target/rpm/librpmDb.cv3.cc>:
In function 'void zypp::target::rpm::providePackageNVR(headerToken_s*)':
<http://river.suse.de/job/libzypp-HEAD/ws/checkout/zypp/target/rpm/librpmDb.cv3.cc>:281:12:
warning: 'int_32' is deprecated (declared at /usr/include/rpm/rpmlegacy.h:18)
<http://river.suse.de/job/libzypp-HEAD/ws/checkout/zypp/target/rpm/librpmDb.cv3.cc>:284:10:
warning: 'int_32' is deprecated (declared at /usr/include/rpm/rpmlegacy.h:18)
<http://river.suse.de/job/libzypp-HEAD/ws/checkout/zypp/target/rpm/librpmDb.cv3.cc>:288:12:
warning: 'int_32' is deprecated (declared at /usr/include/rpm/rpmlegacy.h:18)
<http://river.suse.de/job/libzypp-HEAD/ws/checkout/zypp/target/rpm/librpmDb.cv3.cc>:294:8:
warning: 'int headerNVR(headerToken_s*, const char**, const char**, const
char**)' is deprecated (declared at /usr/include/rpm/header.h:335)
<http://river.suse.de/job/libzypp-HEAD/ws/checkout/zypp/target/rpm/librpmDb.cv3.cc>:294:46:
warning: 'int headerNVR(headerToken_s*, const char**, const char**, const
char**)' is deprecated (declared at /usr/include/rpm/header.h:335)
<http://river.suse.de/job/libzypp-HEAD/ws/checkout/zypp/target/rpm/librpmDb.cv3.cc>:299:7:
warning: 'int headerGetEntryMinMemory(headerToken_s*, rpmTag, rpmTagType*,
void**, rpm_count_t*)' is deprecated (declared at
/usr/include/rpm/rpmlegacy.h:66)
<http://river.suse.de/job/libzypp-HEAD/ws/checkout/zypp/target/rpm/librpmDb.cv3.cc>:299:71:
warning: 'int headerGetEntryMinMemory(headerToken_s*, rpmTag, rpmTagType*,
void**, rpm_count_t*)' is deprecated (declared at
/usr/include/rpm/rpmlegacy.h:66)
<http://river.suse.de/job/libzypp-HEAD/ws/checkout/zypp/target/rpm/librpmDb.cv3.cc>:301:21:
warning: 'int_32' is deprecated (declared at /usr/include/rpm/rpmlegacy.h:18)
<http://river.suse.de/job/libzypp-HEAD/ws/checkout/zypp/target/rpm/librpmDb.cv3.cc>:312:8:
warning: 'int headerGetEntryMinMemory(headerToken_s*, rpmTag, rpmTagType*,
void**, rpm_count_t*)' is deprecated (declared at
/usr/include/rpm/rpmlegacy.h:66)
<http://river.suse.de/job/libzypp-HEAD/ws/checkout/zypp/target/rpm/librpmDb.cv3.cc>:312:92:
warning: 'int headerGetEntryMinMemory(headerToken_s*, rpmTag, rpmTagType*,
void**, rpm_count_t*)' is deprecated (declared at
/usr/include/rpm/rpmlegacy.h:66)
<http://river.suse.de/job/libzypp-HEAD/ws/checkout/zypp/target/rpm/librpmDb.cv3.cc>:319:8:
warning: 'int headerGetEntryMinMemory(headerToken_s*, rpmTag, rpmTagType*,
void**, rpm_count_t*)' is deprecated (declared at
/usr/include/rpm/rpmlegacy.h:66)
<http://river.suse.de/job/libzypp-HEAD/ws/checkout/zypp/target/rpm/librpmDb.cv3.cc>:319:87:
warning: 'int headerGetEntryMinMemory(headerToken_s*, rpmTag, rpmTagType*,
void**, rpm_count_t*)' is deprecated (declared at
/usr/include/rpm/rpmlegacy.h:66)
<http://river.suse.de/job/libzypp-HEAD/ws/checkout/zypp/target/rpm/librpmDb.cv3.cc>:325:14:
warning: 'int_32' is deprecated (declared at /usr/include/rpm/rpmlegacy.h:18)
<http://river.suse.de/job/libzypp-HEAD/ws/checkout/zypp/target/rpm/librpmDb.cv3.cc>:326:12:
warning: 'int headerAddOrAppendEntry(headerToken_s*, rpmTag, rpmTagType, const
void*, rpm_count_t)' is deprecated (declared at
/usr/include/rpm/rpmlegacy.h:114)
<http://river.suse.de/job/libzypp-HEAD/ws/checkout/zypp/target/rpm/librpmDb.cv3.cc>:327:45:
warning: 'int headerAddOrAppendEntry(headerToken_s*, rpmTag, rpmTagType, const
void*, rpm_count_t)' is deprecated (declared at
/usr/include/rpm/rpmlegacy.h:114)
<http://river.suse.de/job/libzypp-HEAD/ws/checkout/zypp/target/rpm/librpmDb.cv3.cc>:328:12:
warning: 'int headerAddOrAppendEntry(headerToken_s*, rpmTag, rpmTagType, const
void*, rpm_count_t)' is deprecated (declared at
/usr/include/rpm/rpmlegacy.h:114)
<http://river.suse.de/job/libzypp-HEAD/ws/checkout/zypp/target/rpm/librpmDb.cv3.cc>:329:45:
warning: 'int headerAddOrAppendEntry(headerToken_s*, rpmTag, rpmTagType, const
void*, rpm_count_t)' is deprecated (declared at
/usr/include/rpm/rpmlegacy.h:114)
<http://river.suse.de/job/libzypp-HEAD/ws/checkout/zypp/target/rpm/librpmDb.cv3.cc>:334:8:
warning: 'int headerGetEntryMinMemory(headerToken_s*, rpmTag, rpmTagType*,
void**, rpm_count_t*)' is deprecated (declared at
/usr/include/rpm/rpmlegacy.h:66)
<http://river.suse.de/job/libzypp-HEAD/ws/checkout/zypp/target/rpm/librpmDb.cv3.cc>:334:79:
warning: 'int headerGetEntryMinMemory(headerToken_s*, rpmTag, rpmTagType*,
void**, rpm_count_t*)' is deprecated (declared at
/usr/include/rpm/rpmlegacy.h:66)
<http://river.suse.de/job/libzypp-HEAD/ws/checkout/zypp/target/rpm/librpmDb.cv3.cc>:335:26:
warning: 'int_32' is deprecated (declared at /usr/include/rpm/rpmlegacy.h:18)
<http://river.suse.de/job/libzypp-HEAD/ws/checkout/zypp/target/rpm/librpmDb.cv3.cc>:352:29:
warning: 'void* headerFreeData(void*, rpmTagType)' is deprecated (declared at
/usr/include/rpm/rpmlegacy.h:195)
<http://river.suse.de/job/libzypp-HEAD/ws/checkout/zypp/target/rpm/librpmDb.cv3.cc>:352:57:
warning: 'void* headerFreeData(void*, rpmTagType)' is deprecated (declared at
/usr/include/rpm/rpmlegacy.h:195)
<http://river.suse.de/job/libzypp-HEAD/ws/checkout/zypp/target/rpm/librpmDb.cv3.cc>:353:32:
warning: 'void* headerFreeData(void*, rpmTagType)' is deprecated (declared at
/usr/include/rpm/rpmlegacy.h:195)
<http://river.suse.de/job/libzypp-HEAD/ws/checkout/zypp/target/rpm/librpmDb.cv3.cc>:353:63:
warning: 'void* headerFreeData(void*, rpmTagType)' is deprecated (declared at
/usr/include/rpm/rpmlegacy.h:195)
<http://river.suse.de/job/libzypp-HEAD/ws/checkout/zypp/target/rpm/librpmDb.cv3.cc>:357:10:
warning: 'int headerAddOrAppendEntry(headerToken_s*, rpmTag, rpmTagType, const
void*, rpm_count_t)' is deprecated (declared at
/usr/include/rpm/rpmlegacy.h:114)
<http://river.suse.de/job/libzypp-HEAD/ws/checkout/zypp/target/rpm/librpmDb.cv3.cc>:358:41:
warning: 'int headerAddOrAppendEntry(headerToken_s*, rpmTag, rpmTagType, const
void*, rpm_count_t)' is deprecated (declared at
/usr/include/rpm/rpmlegacy.h:114)
<http://river.suse.de/job/libzypp-HEAD/ws/checkout/zypp/target/rpm/librpmDb.cv3.cc>:359:10:
warning: 'int headerAddOrAppendEntry(headerToken_s*, rpmTag, rpmTagType, const
void*, rpm_count_t)' is deprecated (declared at
/usr/include/rpm/rpmlegacy.h:114)
<http://river.suse.de/job/libzypp-HEAD/ws/checkout/zypp/target/rpm/librpmDb.cv3.cc>:360:43:
warning: 'int headerAddOrAppendEntry(headerToken_s*, rpmTag, rpmTagType, const
void*, rpm_count_t)' is deprecated (declared at
/usr/include/rpm/rpmlegacy.h:114)
<http://river.suse.de/job/libzypp-HEAD/ws/checkout/zypp/target/rpm/librpmDb.cv3.cc>:361:10:
warning: 'int headerAddOrAppendEntry(headerToken_s*, rpmTag, rpmTagType, const
void*, rpm_count_t)' is deprecated (declared at
/usr/include/rpm/rpmlegacy.h:114)
<http://river.suse.de/job/libzypp-HEAD/ws/checkout/zypp/target/rpm/librpmDb.cv3.cc>:362:41:
warning: 'int headerAddOrAppendEntry(headerToken_s*, rpmTag, rpmTagType, const
void*, rpm_count_t)' is deprecated (declared at
/usr/include/rpm/rpmlegacy.h:114)
<http://river.suse.de/job/libzypp-HEAD/ws/checkout/zypp/target/rpm/librpmDb.cv3.cc>:
In function 'void zypp::target::rpm::internal_convertV3toV4(const
zypp::filesystem::Pathname&, const zypp::target::rpm::librpmDb::constPtr&,
zypp::callback::SendReport<zypp::target::rpm::ConvertDBReport>&)':
<http://river.suse.de/job/libzypp-HEAD/ws/checkout/zypp/target/rpm/librpmDb.cv3.cc>:494:5:
warning: 'int headerNVR(headerToken_s*, const char**, const char**, const
char**)' is deprecated (declared at /usr/include/rpm/header.h:335)
<http://river.suse.de/job/libzypp-HEAD/ws/checkout/zypp/target/rpm/librpmDb.cv3.cc>:494:43:
warning: 'int headerNVR(headerToken_s*, const char**, const char**, const
char**)' is deprecated (declared at /usr/include/rpm/header.h:335)
[ 39%] Building CXX object zypp/CMakeFiles/zypp.dir/target/HardLocksFile.cc.o
[ 40%] Building CXX object
zypp/CMakeFiles/zypp.dir/target/CommitPackageCache.cc.o
[ 40%] Building CXX object
zypp/CMakeFiles/zypp.dir/target/CommitPackageCacheImpl.cc.o
ICECC[3245] 13:42:37: got exception 17 (10.11.0.42)
[ 40%] Building CXX object
zypp/CMakeFiles/zypp.dir/target/CommitPackageCacheReadAhead.cc.o
[ 40%] Building CXX object
zypp/CMakeFiles/zypp.dir/target/TargetCallbackReceiver.cc.o
[ 42%] Building CXX object zypp/CMakeFiles/zypp.dir/target/TargetException.cc.o
[ 42%] Building CXX object zypp/CMakeFiles/zypp.dir/target/TargetImpl.cc.o
<http://river.suse.de/job/libzypp-HEAD/ws/checkout/zypp/target/TargetImpl.cc>:1278:2:
warning: #warning Exception handling
[ 42%] Building CXX object zypp/CMakeFiles/zypp.dir/solver/detail/Helper.cc.o
[ 42%] Building CXX object
zypp/CMakeFiles/zypp.dir/solver/detail/InstallOrder.cc.o
[ 44%] Building CXX object
zypp/CMakeFiles/zypp.dir/solver/detail/ProblemSolutionIgnore.cc.o
[ 44%] Building CXX object
zypp/CMakeFiles/zypp.dir/solver/detail/ProblemSolutionCombi.cc.o
ICECC[3295] 13:42:41: got exception 17 (10.11.0.42)
[ 44%] Building CXX object zypp/CMakeFiles/zypp.dir/solver/detail/Resolver.cc.o
ICECC[3302] 13:42:42: got exception 17 (10.11.0.42)
ICECC[3308] 13:42:43: got exception 17 (10.11.0.42)
[ 44%] Building CXX object
zypp/CMakeFiles/zypp.dir/solver/detail/ResolverUpgrade.cc.o
[ 45%] Building CXX object
zypp/CMakeFiles/zypp.dir/solver/detail/Resolver_problems.cc.o
[ 45%] Building CXX object
zypp/CMakeFiles/zypp.dir/solver/detail/SolutionAction.cc.o
[ 45%] [ 45%] Building CXX object
zypp/CMakeFiles/zypp.dir/solver/detail/Testcase.cc.o
[ 47%] Building CXX object
zypp/CMakeFiles/zypp.dir/solver/detail/SolverQueueItem.cc.o
Building CXX object
zypp/CMakeFiles/zypp.dir/solver/detail/SolverQueueItemInstall.cc.o
[ 47%] Building CXX object
zypp/CMakeFiles/zypp.dir/solver/detail/SolverQueueItemDelete.cc.o
[ 47%] Building CXX object
zypp/CMakeFiles/zypp.dir/solver/detail/SolverQueueItemUpdate.cc.o
[ 47%] [ 49%] Building CXX object
zypp/CMakeFiles/zypp.dir/solver/detail/SolverQueueItemInstallOneOf.cc.o
Building CXX object
zypp/CMakeFiles/zypp.dir/solver/detail/SolverQueueItemLock.cc.o
[ 49%] Building CXX object
zypp/CMakeFiles/zypp.dir/solver/detail/SATResolver.cc.o
ICECC[3372] 13:42:51: got exception 17 (10.11.0.42)
ICECC[3377] 13:42:51: got exception 17 (10.11.0.42)
ICECC[3378] 13:42:51: got exception 17 (10.11.0.42)
[ 49%] Building CXX object
zypp/CMakeFiles/zypp.dir/solver/detail/SystemCheck.cc.o
[ 50%] Building CXX object zypp/CMakeFiles/zypp.dir/ui/Selectable.cc.o
ICECC[3395] 13:42:55: got exception 17 (10.11.0.42)
[ 50%] Building CXX object zypp/CMakeFiles/zypp.dir/ui/SelectableImpl.cc.o
<http://river.suse.de/job/libzypp-HEAD/ws/checkout/zypp/solver/detail/SATResolver.cc>:
In member function 'std::string
zypp::solver::detail::SATResolver::SATprobleminfoString(Id, std::string&, Id&)':
<http://river.suse.de/job/libzypp-HEAD/ws/checkout/zypp/solver/detail/SATResolver.cc>:958:10:
warning: enumeration value 'SOLVER_RULE_UNKNOWN' not handled in switch
<http://river.suse.de/job/libzypp-HEAD/ws/checkout/zypp/solver/detail/SATResolver.cc>:958:10:
warning: enumeration value 'SOLVER_RULE_RPM_IMPLICIT_OBSOLETES' not handled in
switch
<http://river.suse.de/job/libzypp-HEAD/ws/checkout/zypp/solver/detail/SATResolver.cc>:958:10:
warning: enumeration value 'SOLVER_RULE_FEATURE' not handled in switch
<http://river.suse.de/job/libzypp-HEAD/ws/checkout/zypp/solver/detail/SATResolver.cc>:958:10:
warning: enumeration value 'SOLVER_RULE_CHOICE' not handled in switch
<http://river.suse.de/job/libzypp-HEAD/ws/checkout/zypp/solver/detail/SATResolver.cc>:958:10:
warning: enumeration value 'SOLVER_RULE_LEARNT' not handled in switch
[ 50%] Building CXX object zypp/CMakeFiles/zypp.dir/ui/Status.cc.o
[ 50%] Building CXX object zypp/CMakeFiles/zypp.dir/ui/UserWantedPackages.cc.o
[ 52%] Building CXX object zypp/CMakeFiles/zypp.dir/thread/Mutex.cc.o
<http://river.suse.de/job/libzypp-HEAD/ws/checkout/zypp/ui/UserWantedPackages.cc>:130:2:
warning: #warning NEEDS FIX
[ 52%] Building CXX object zypp/CMakeFiles/zypp.dir/ws/WebpinResult.cc.o
[ 52%] Building CXX object zypp/CMakeFiles/zypp.dir/ByteCount.cc.o
[ 52%] Building CXX object zypp/CMakeFiles/zypp.dir/Capabilities.cc.o
[ 54%] Building CXX object zypp/CMakeFiles/zypp.dir/Capability.cc.o
ICECC[3423] 13:42:59: got exception 17 (10.11.0.42)
<http://river.suse.de/job/libzypp-HEAD/ws/checkout/zypp/Capability.cc>:307:2:
warning: #warning MIGRATE TO SAT
<http://river.suse.de/job/libzypp-HEAD/ws/checkout/zypp/Capability.cc>:308:2:
warning: #warning TESTCASE
[ 54%] Building CXX object zypp/CMakeFiles/zypp.dir/CapMatch.cc.o
[ 54%] Building CXX object zypp/CMakeFiles/zypp.dir/Changelog.cc.o
[ 54%] Building CXX object zypp/CMakeFiles/zypp.dir/CheckSum.cc.o
<http://river.suse.de/job/libzypp-HEAD/ws/checkout/zypp/ui/UserWantedPackages.cc>:130:2:
warning: #warning NEEDS FIX
[ 55%] Building CXX object zypp/CMakeFiles/zypp.dir/Date.cc.o
[ 55%] Building CXX object zypp/CMakeFiles/zypp.dir/Dep.cc.o
[ 55%] Building CXX object zypp/CMakeFiles/zypp.dir/Digest.cc.o
[ 55%] ICECC[3453] 13:43:01: got exception 17 (10.11.0.42)
Building CXX object zypp/CMakeFiles/zypp.dir/DiskUsage.cc.o
[ 57%] Building CXX object zypp/CMakeFiles/zypp.dir/DiskUsageCounter.cc.o
<http://river.suse.de/job/libzypp-HEAD/ws/checkout/zypp/Digest.cc>: In member
function 'std::string zypp::Digest::digest()':
<http://river.suse.de/job/libzypp-HEAD/ws/checkout/zypp/Digest.cc>:172:13:
warning: converting 'false' to pointer type for argument 1 of
'std::basic_string<_CharT, _Traits, _Alloc>::basic_string(const _CharT*, const
_Alloc&) [with _CharT = char, _Traits = std::char_traits<char>, _Alloc =
std::allocator<char>]'
<http://river.suse.de/job/libzypp-HEAD/ws/checkout/zypp/Digest.cc>:177:17:
warning: converting 'false' to pointer type for argument 1 of
'std::basic_string<_CharT, _Traits, _Alloc>::basic_string(const _CharT*, const
_Alloc&) [with _CharT = char, _Traits = std::char_traits<char>, _Alloc =
std::allocator<char>]'
[ 57%] Building CXX object zypp/CMakeFiles/zypp.dir/DownloadMode.cc.o
[ 57%] Building CXX object zypp/CMakeFiles/zypp.dir/Edition.cc.o
[ 57%] Building CXX object zypp/CMakeFiles/zypp.dir/ExternalProgram.cc.o
<http://river.suse.de/job/libzypp-HEAD/ws/checkout/zypp/Capability.cc>:307:2:
warning: #warning MIGRATE TO SAT
<http://river.suse.de/job/libzypp-HEAD/ws/checkout/zypp/Capability.cc>:308:2:
warning: #warning TESTCASE
[ 59%] Building CXX object zypp/CMakeFiles/zypp.dir/PluginFrame.cc.o
[ 59%] [ 59%] Building CXX object
zypp/CMakeFiles/zypp.dir/PluginFrameException.cc.o
Building CXX object zypp/CMakeFiles/zypp.dir/PluginScript.cc.o
[ 59%] Building CXX object zypp/CMakeFiles/zypp.dir/PluginScriptException.cc.o
[ 60%] Building CXX object zypp/CMakeFiles/zypp.dir/Fetcher.cc.o
[ 60%] Building CXX object zypp/CMakeFiles/zypp.dir/FileChecker.cc.o
[ 60%] Building CXX object zypp/CMakeFiles/zypp.dir/Glob.cc.o
[ 62%] Building CXX object zypp/CMakeFiles/zypp.dir/HistoryLog.cc.o
[ 62%] Building CXX object zypp/CMakeFiles/zypp.dir/HistoryLogData.cc.o
ICECC[3559] 13:43:06: got exception 17 (10.11.0.42)
[ 62%] Building CXX object zypp/CMakeFiles/zypp.dir/IdString.cc.o
[ 62%] Building CXX object zypp/CMakeFiles/zypp.dir/InstanceId.cc.o
[ 63%] Building CXX object zypp/CMakeFiles/zypp.dir/KeyRing.cc.o
[ 63%] Building CXX object zypp/CMakeFiles/zypp.dir/Locks.cc.o

cc1plus: out of memory allocating 14408 bytes after a total of 3399680 bytes
ICECC[3590] 13:43:08: Compiled on 10.11.0.42
make[2]: *** [zypp/CMakeFiles/zypp.dir/InstanceId.cc.o] Error 1
make[2]: *** Waiting for unfinished jobs....

cc1plus: out of memory allocating 4064 bytes after a total of 3448832 bytes
ICECC[3597] 13:43:08: Compiled on 10.11.0.42
make[2]: *** [zypp/CMakeFiles/zypp.dir/KeyRing.cc.o] Error 1
make[1]: *** [zypp/CMakeFiles/zypp.dir/all] Error 2
make: *** [all] Error 2
Archiving artifacts

--
To unsubscribe, e-mail: zypp-commit+unsubscribe@xxxxxxxxxxxx
For additional commands, e-mail: zypp-commit+help@xxxxxxxxxxxx

< Previous Next >
This Thread
Follow Ups