Mailinglist Archive: zypp-commit (52 mails)

< Previous Next >
[zypp-commit] Build failed in Hudson: libzypp-HEAD #169
  • From: hudson@xxxxxxx
  • Date: Mon, 21 Feb 2011 16:15:17 +0100 (CET)
  • Message-id: <1419086773.11298301317137.JavaMail.hudson@river>
See <http://river.suse.de/job/libzypp-HEAD/169/>

------------------------------------------
[...truncated 299 lines...]
[ 35%] Building CXX object zypp/CMakeFiles/zypp.dir/target/rpm/RpmException.cc.o
<http://river.suse.de/job/libzypp-HEAD/ws/checkout/zypp/target/rpm/RpmDb.cc>:220:2:
warning: #warning Check for obsolete memebers
<http://river.suse.de/job/libzypp-HEAD/ws/checkout/zypp/target/rpm/RpmDb.cc>:388:2:
warning: #warning CHECK: notify root about conversion backup.
<http://river.suse.de/job/libzypp-HEAD/ws/checkout/zypp/target/rpm/RpmDb.cc>:646:2:
warning: #warning CHECK: compare vs existing v3 backup. notify root
[ 36%] Building CXX object zypp/CMakeFiles/zypp.dir/target/rpm/RpmHeader.cc.o
<http://river.suse.de/job/libzypp-HEAD/ws/checkout/zypp/target/rpm/RpmHeader.cc>:391:2:
warning: #warning CHECK IF FILE REQUIRES HANDLING IS OBSOLETE
[ 36%] Building CXX object zypp/CMakeFiles/zypp.dir/target/rpm/librpmDb.cc.o
<http://river.suse.de/job/libzypp-HEAD/ws/checkout/zypp/target/rpm/librpmDb.cc>:704:2:
warning: #warning TESTCASE: rpmdbAppendIterator and (non)sequential access?
<http://river.suse.de/job/libzypp-HEAD/ws/checkout/zypp/target/rpm/librpmDb.cc>:719:2:
warning: #warning TESTCASE: rpmdbGetIteratorCount returns 0 on sequential
access?
[ 36%] Building CXX object zypp/CMakeFiles/zypp.dir/target/rpm/librpmDb.cv3.cc.o
ICECC[4729] 16:13:57: got exception 17 (10.11.0.42)
[ 36%] Building CXX object
zypp/CMakeFiles/zypp.dir/target/modalias/Modalias.cc.o
<http://river.suse.de/job/libzypp-HEAD/ws/checkout/zypp/target/rpm/librpmDb.cv3.cc>:448:2:
warning: #warning Add CBSuggest handling if needed, also on lines below
<http://river.suse.de/job/libzypp-HEAD/ws/checkout/zypp/target/rpm/RpmDb.cc>:220:2:
warning: #warning Check for obsolete memebers
<http://river.suse.de/job/libzypp-HEAD/ws/checkout/zypp/target/rpm/RpmDb.cc>:388:2:
warning: #warning CHECK: notify root about conversion backup.
<http://river.suse.de/job/libzypp-HEAD/ws/checkout/zypp/target/rpm/RpmDb.cc>:646:2:
warning: #warning CHECK: compare vs existing v3 backup. notify root
[ 38%] Building CXX object
zypp/CMakeFiles/zypp.dir/target/RequestedLocalesFile.cc.o
[ 38%] Building CXX object zypp/CMakeFiles/zypp.dir/target/SoftLocksFile.cc.o
ICECC[4754] 16:13:59: got exception 17 (10.11.0.42)
[ 38%] Building CXX object zypp/CMakeFiles/zypp.dir/target/HardLocksFile.cc.o
[ 38%] Building CXX object
zypp/CMakeFiles/zypp.dir/target/CommitPackageCache.cc.o
ICECC[4779] 16:14:01: got exception 17 (10.10.101.69)
[ 40%] Building CXX object
zypp/CMakeFiles/zypp.dir/target/CommitPackageCacheImpl.cc.o
[ 40%] Building CXX object
zypp/CMakeFiles/zypp.dir/target/CommitPackageCacheReadAhead.cc.o
<http://river.suse.de/job/libzypp-HEAD/ws/checkout/zypp/target/rpm/librpmDb.cv3.cc>:448:2:
warning: #warning Add CBSuggest handling if needed, also on lines below
ICECC[4791] 16:14:02: got exception 17 (10.10.101.69)
<http://river.suse.de/job/libzypp-HEAD/ws/checkout/zypp/target/rpm/librpmDb.cv3.cc>:
In function ‘void zypp::target::rpm::compressFilelist(headerToken_s*)’:
<http://river.suse.de/job/libzypp-HEAD/ws/checkout/zypp/target/rpm/librpmDb.cv3.cc>:181:12:
warning: ‘int_32’ is deprecated (declared at /usr/include/rpm/rpmlegacy.h:18)
<http://river.suse.de/job/libzypp-HEAD/ws/checkout/zypp/target/rpm/librpmDb.cv3.cc>:195:10:
warning: ‘int headerRemoveEntry(headerToken_s*, rpmTag)’ is deprecated
(declared at /usr/include/rpm/rpmlegacy.h:142)
<http://river.suse.de/job/libzypp-HEAD/ws/checkout/zypp/target/rpm/librpmDb.cv3.cc>:195:50:
warning: ‘int headerRemoveEntry(headerToken_s*, rpmTag)’ is deprecated
(declared at /usr/include/rpm/rpmlegacy.h:142)
<http://river.suse.de/job/libzypp-HEAD/ws/checkout/zypp/target/rpm/librpmDb.cv3.cc>:200:8:
warning: ‘int headerGetEntryMinMemory(headerToken_s*, rpmTag, rpmTagType*,
void**, rpm_count_t*)’ is deprecated (declared at
/usr/include/rpm/rpmlegacy.h:66)
<http://river.suse.de/job/libzypp-HEAD/ws/checkout/zypp/target/rpm/librpmDb.cv3.cc>:200:85:
warning: ‘int headerGetEntryMinMemory(headerToken_s*, rpmTag, rpmTagType*,
void**, rpm_count_t*)’ is deprecated (declared at
/usr/include/rpm/rpmlegacy.h:66)
<http://river.suse.de/job/libzypp-HEAD/ws/checkout/zypp/target/rpm/librpmDb.cv3.cc>:208:24:
warning: ‘int_32’ is deprecated (declared at /usr/include/rpm/rpmlegacy.h:18)
<http://river.suse.de/job/libzypp-HEAD/ws/checkout/zypp/target/rpm/librpmDb.cv3.cc>:260:10:
warning: ‘int headerAddEntry(headerToken_s*, rpmTag, rpmTagType, const void*,
rpm_count_t)’ is deprecated (declared at /usr/include/rpm/rpmlegacy.h:85)
<http://river.suse.de/job/libzypp-HEAD/ws/checkout/zypp/target/rpm/librpmDb.cv3.cc>:260:80:
warning: ‘int headerAddEntry(headerToken_s*, rpmTag, rpmTagType, const void*,
rpm_count_t)’ is deprecated (declared at /usr/include/rpm/rpmlegacy.h:85)
<http://river.suse.de/job/libzypp-HEAD/ws/checkout/zypp/target/rpm/librpmDb.cv3.cc>:261:10:
warning: ‘int headerAddEntry(headerToken_s*, rpmTag, rpmTagType, const void*,
rpm_count_t)’ is deprecated (declared at /usr/include/rpm/rpmlegacy.h:85)
<http://river.suse.de/job/libzypp-HEAD/ws/checkout/zypp/target/rpm/librpmDb.cv3.cc>:262:30:
warning: ‘int headerAddEntry(headerToken_s*, rpmTag, rpmTagType, const void*,
rpm_count_t)’ is deprecated (declared at /usr/include/rpm/rpmlegacy.h:85)
<http://river.suse.de/job/libzypp-HEAD/ws/checkout/zypp/target/rpm/librpmDb.cv3.cc>:263:10:
warning: ‘int headerAddEntry(headerToken_s*, rpmTag, rpmTagType, const void*,
rpm_count_t)’ is deprecated (declared at /usr/include/rpm/rpmlegacy.h:85)
<http://river.suse.de/job/libzypp-HEAD/ws/checkout/zypp/target/rpm/librpmDb.cv3.cc>:264:36:
warning: ‘int headerAddEntry(headerToken_s*, rpmTag, rpmTagType, const void*,
rpm_count_t)’ is deprecated (declared at /usr/include/rpm/rpmlegacy.h:85)
<http://river.suse.de/job/libzypp-HEAD/ws/checkout/zypp/target/rpm/librpmDb.cv3.cc>:267:23:
warning: ‘void* headerFreeData(void*, rpmTagType)’ is deprecated (declared at
/usr/include/rpm/rpmlegacy.h:195)
<http://river.suse.de/job/libzypp-HEAD/ws/checkout/zypp/target/rpm/librpmDb.cv3.cc>:267:52:
warning: ‘void* headerFreeData(void*, rpmTagType)’ is deprecated (declared at
/usr/include/rpm/rpmlegacy.h:195)
<http://river.suse.de/job/libzypp-HEAD/ws/checkout/zypp/target/rpm/librpmDb.cv3.cc>:269:8:
warning: ‘int headerRemoveEntry(headerToken_s*, rpmTag)’ is deprecated
(declared at /usr/include/rpm/rpmlegacy.h:142)
<http://river.suse.de/job/libzypp-HEAD/ws/checkout/zypp/target/rpm/librpmDb.cv3.cc>:269:48:
warning: ‘int headerRemoveEntry(headerToken_s*, rpmTag)’ is deprecated
(declared at /usr/include/rpm/rpmlegacy.h:142)
<http://river.suse.de/job/libzypp-HEAD/ws/checkout/zypp/target/rpm/librpmDb.cv3.cc>:
In function ‘void zypp::target::rpm::providePackageNVR(headerToken_s*)’:
<http://river.suse.de/job/libzypp-HEAD/ws/checkout/zypp/target/rpm/librpmDb.cv3.cc>:281:12:
warning: ‘int_32’ is deprecated (declared at /usr/include/rpm/rpmlegacy.h:18)
<http://river.suse.de/job/libzypp-HEAD/ws/checkout/zypp/target/rpm/librpmDb.cv3.cc>:284:10:
warning: ‘int_32’ is deprecated (declared at /usr/include/rpm/rpmlegacy.h:18)
<http://river.suse.de/job/libzypp-HEAD/ws/checkout/zypp/target/rpm/librpmDb.cv3.cc>:288:12:
warning: ‘int_32’ is deprecated (declared at /usr/include/rpm/rpmlegacy.h:18)
<http://river.suse.de/job/libzypp-HEAD/ws/checkout/zypp/target/rpm/librpmDb.cv3.cc>:294:8:
warning: ‘int headerNVR(headerToken_s*, const char**, const char**, const
char**)’ is deprecated (declared at /usr/include/rpm/header.h:335)
<http://river.suse.de/job/libzypp-HEAD/ws/checkout/zypp/target/rpm/librpmDb.cv3.cc>:294:46:
warning: ‘int headerNVR(headerToken_s*, const char**, const char**, const
char**)’ is deprecated (declared at /usr/include/rpm/header.h:335)
<http://river.suse.de/job/libzypp-HEAD/ws/checkout/zypp/target/rpm/librpmDb.cv3.cc>:299:7:
warning: ‘int headerGetEntryMinMemory(headerToken_s*, rpmTag, rpmTagType*,
void**, rpm_count_t*)’ is deprecated (declared at
/usr/include/rpm/rpmlegacy.h:66)
<http://river.suse.de/job/libzypp-HEAD/ws/checkout/zypp/target/rpm/librpmDb.cv3.cc>:299:67:
warning: ‘int headerGetEntryMinMemory(headerToken_s*, rpmTag, rpmTagType*,
void**, rpm_count_t*)’ is deprecated (declared at
/usr/include/rpm/rpmlegacy.h:66)
<http://river.suse.de/job/libzypp-HEAD/ws/checkout/zypp/target/rpm/librpmDb.cv3.cc>:301:21:
warning: ‘int_32’ is deprecated (declared at /usr/include/rpm/rpmlegacy.h:18)
<http://river.suse.de/job/libzypp-HEAD/ws/checkout/zypp/target/rpm/librpmDb.cv3.cc>:312:8:
warning: ‘int headerGetEntryMinMemory(headerToken_s*, rpmTag, rpmTagType*,
void**, rpm_count_t*)’ is deprecated (declared at
/usr/include/rpm/rpmlegacy.h:66)
<http://river.suse.de/job/libzypp-HEAD/ws/checkout/zypp/target/rpm/librpmDb.cv3.cc>:312:92:
warning: ‘int headerGetEntryMinMemory(headerToken_s*, rpmTag, rpmTagType*,
void**, rpm_count_t*)’ is deprecated (declared at
/usr/include/rpm/rpmlegacy.h:66)
<http://river.suse.de/job/libzypp-HEAD/ws/checkout/zypp/target/rpm/librpmDb.cv3.cc>:319:8:
warning: ‘int headerGetEntryMinMemory(headerToken_s*, rpmTag, rpmTagType*,
void**, rpm_count_t*)’ is deprecated (declared at
/usr/include/rpm/rpmlegacy.h:66)
<http://river.suse.de/job/libzypp-HEAD/ws/checkout/zypp/target/rpm/librpmDb.cv3.cc>:319:85:
warning: ‘int headerGetEntryMinMemory(headerToken_s*, rpmTag, rpmTagType*,
void**, rpm_count_t*)’ is deprecated (declared at
/usr/include/rpm/rpmlegacy.h:66)
<http://river.suse.de/job/libzypp-HEAD/ws/checkout/zypp/target/rpm/librpmDb.cv3.cc>:325:14:
warning: ‘int_32’ is deprecated (declared at /usr/include/rpm/rpmlegacy.h:18)
<http://river.suse.de/job/libzypp-HEAD/ws/checkout/zypp/target/rpm/librpmDb.cv3.cc>:326:12:
warning: ‘int headerAddOrAppendEntry(headerToken_s*, rpmTag, rpmTagType, const
void*, rpm_count_t)’ is deprecated (declared at
/usr/include/rpm/rpmlegacy.h:114)
<http://river.suse.de/job/libzypp-HEAD/ws/checkout/zypp/target/rpm/librpmDb.cv3.cc>:327:45:
warning: ‘int headerAddOrAppendEntry(headerToken_s*, rpmTag, rpmTagType, const
void*, rpm_count_t)’ is deprecated (declared at
/usr/include/rpm/rpmlegacy.h:114)
<http://river.suse.de/job/libzypp-HEAD/ws/checkout/zypp/target/rpm/librpmDb.cv3.cc>:328:12:
warning: ‘int headerAddOrAppendEntry(headerToken_s*, rpmTag, rpmTagType, const
void*, rpm_count_t)’ is deprecated (declared at
/usr/include/rpm/rpmlegacy.h:114)
<http://river.suse.de/job/libzypp-HEAD/ws/checkout/zypp/target/rpm/librpmDb.cv3.cc>:329:45:
warning: ‘int headerAddOrAppendEntry(headerToken_s*, rpmTag, rpmTagType, const
void*, rpm_count_t)’ is deprecated (declared at
/usr/include/rpm/rpmlegacy.h:114)
<http://river.suse.de/job/libzypp-HEAD/ws/checkout/zypp/target/rpm/librpmDb.cv3.cc>:334:8:
warning: ‘int headerGetEntryMinMemory(headerToken_s*, rpmTag, rpmTagType*,
void**, rpm_count_t*)’ is deprecated (declared at
/usr/include/rpm/rpmlegacy.h:66)
<http://river.suse.de/job/libzypp-HEAD/ws/checkout/zypp/target/rpm/librpmDb.cv3.cc>:334:75:
warning: ‘int headerGetEntryMinMemory(headerToken_s*, rpmTag, rpmTagType*,
void**, rpm_count_t*)’ is deprecated (declared at
/usr/include/rpm/rpmlegacy.h:66)
<http://river.suse.de/job/libzypp-HEAD/ws/checkout/zypp/target/rpm/librpmDb.cv3.cc>:335:26:
warning: ‘int_32’ is deprecated (declared at /usr/include/rpm/rpmlegacy.h:18)
<http://river.suse.de/job/libzypp-HEAD/ws/checkout/zypp/target/rpm/librpmDb.cv3.cc>:352:29:
warning: ‘void* headerFreeData(void*, rpmTagType)’ is deprecated (declared at
/usr/include/rpm/rpmlegacy.h:195)
<http://river.suse.de/job/libzypp-HEAD/ws/checkout/zypp/target/rpm/librpmDb.cv3.cc>:352:57:
warning: ‘void* headerFreeData(void*, rpmTagType)’ is deprecated (declared at
/usr/include/rpm/rpmlegacy.h:195)
<http://river.suse.de/job/libzypp-HEAD/ws/checkout/zypp/target/rpm/librpmDb.cv3.cc>:353:32:
warning: ‘void* headerFreeData(void*, rpmTagType)’ is deprecated (declared at
/usr/include/rpm/rpmlegacy.h:195)
<http://river.suse.de/job/libzypp-HEAD/ws/checkout/zypp/target/rpm/librpmDb.cv3.cc>:353:63:
warning: ‘void* headerFreeData(void*, rpmTagType)’ is deprecated (declared at
/usr/include/rpm/rpmlegacy.h:195)
<http://river.suse.de/job/libzypp-HEAD/ws/checkout/zypp/target/rpm/librpmDb.cv3.cc>:357:10:
warning: ‘int headerAddOrAppendEntry(headerToken_s*, rpmTag, rpmTagType, const
void*, rpm_count_t)’ is deprecated (declared at
/usr/include/rpm/rpmlegacy.h:114)
<http://river.suse.de/job/libzypp-HEAD/ws/checkout/zypp/target/rpm/librpmDb.cv3.cc>:358:41:
warning: ‘int headerAddOrAppendEntry(headerToken_s*, rpmTag, rpmTagType, const
void*, rpm_count_t)’ is deprecated (declared at
/usr/include/rpm/rpmlegacy.h:114)
<http://river.suse.de/job/libzypp-HEAD/ws/checkout/zypp/target/rpm/librpmDb.cv3.cc>:359:10:
warning: ‘int headerAddOrAppendEntry(headerToken_s*, rpmTag, rpmTagType, const
void*, rpm_count_t)’ is deprecated (declared at
/usr/include/rpm/rpmlegacy.h:114)
<http://river.suse.de/job/libzypp-HEAD/ws/checkout/zypp/target/rpm/librpmDb.cv3.cc>:360:43:
warning: ‘int headerAddOrAppendEntry(headerToken_s*, rpmTag, rpmTagType, const
void*, rpm_count_t)’ is deprecated (declared at
/usr/include/rpm/rpmlegacy.h:114)
<http://river.suse.de/job/libzypp-HEAD/ws/checkout/zypp/target/rpm/librpmDb.cv3.cc>:361:10:
warning: ‘int headerAddOrAppendEntry(headerToken_s*, rpmTag, rpmTagType, const
void*, rpm_count_t)’ is deprecated (declared at
/usr/include/rpm/rpmlegacy.h:114)
<http://river.suse.de/job/libzypp-HEAD/ws/checkout/zypp/target/rpm/librpmDb.cv3.cc>:362:41:
warning: ‘int headerAddOrAppendEntry(headerToken_s*, rpmTag, rpmTagType, const
void*, rpm_count_t)’ is deprecated (declared at
/usr/include/rpm/rpmlegacy.h:114)
<http://river.suse.de/job/libzypp-HEAD/ws/checkout/zypp/target/rpm/librpmDb.cv3.cc>:
In function ‘void zypp::target::rpm::internal_convertV3toV4(const
zypp::filesystem::Pathname&, const zypp::target::rpm::librpmDb::constPtr&,
zypp::callback::SendReport<zypp::target::rpm::ConvertDBReport>&)’:
<http://river.suse.de/job/libzypp-HEAD/ws/checkout/zypp/target/rpm/librpmDb.cv3.cc>:494:5:
warning: ‘int headerNVR(headerToken_s*, const char**, const char**, const
char**)’ is deprecated (declared at /usr/include/rpm/header.h:335)
<http://river.suse.de/job/libzypp-HEAD/ws/checkout/zypp/target/rpm/librpmDb.cv3.cc>:494:43:
warning: ‘int headerNVR(headerToken_s*, const char**, const char**, const
char**)’ is deprecated (declared at /usr/include/rpm/header.h:335)
[ 40%] Building CXX object
zypp/CMakeFiles/zypp.dir/target/TargetCallbackReceiver.cc.o
[ 41%] Building CXX object zypp/CMakeFiles/zypp.dir/target/TargetException.cc.o
[ 41%] Building CXX object zypp/CMakeFiles/zypp.dir/target/TargetImpl.cc.o
<http://river.suse.de/job/libzypp-HEAD/ws/checkout/zypp/target/TargetImpl.cc>:1278:2:
warning: #warning Exception handling
[ 41%] Building CXX object zypp/CMakeFiles/zypp.dir/solver/detail/Helper.cc.o
ICECC[4807] 16:14:05: got exception 17 (10.10.101.69)
ICECC[4819] 16:14:06: got exception 17 (10.11.0.42)
[ 41%] Building CXX object
zypp/CMakeFiles/zypp.dir/solver/detail/InstallOrder.cc.o
[ 43%] Building CXX object
zypp/CMakeFiles/zypp.dir/solver/detail/ProblemSolutionIgnore.cc.o
[ 43%] Building CXX object
zypp/CMakeFiles/zypp.dir/solver/detail/ProblemSolutionCombi.cc.o
<http://river.suse.de/job/libzypp-HEAD/ws/checkout/zypp/target/TargetImpl.cc>:1278:2:
warning: #warning Exception handling
ICECC[4835] 16:14:09: got exception 17 (10.11.0.42)
[ 43%] Building CXX object zypp/CMakeFiles/zypp.dir/solver/detail/Resolver.cc.o
ICECC[4849] 16:14:10: got exception 17 (10.10.101.69)
[ 43%] Building CXX object
zypp/CMakeFiles/zypp.dir/solver/detail/ResolverUpgrade.cc.o
[ 45%] Building CXX object
zypp/CMakeFiles/zypp.dir/solver/detail/Resolver_problems.cc.o
[ 45%] Building CXX object
zypp/CMakeFiles/zypp.dir/solver/detail/SolutionAction.cc.o
[ 45%] Building CXX object zypp/CMakeFiles/zypp.dir/solver/detail/Testcase.cc.o
[ 45%] Building CXX object
zypp/CMakeFiles/zypp.dir/solver/detail/SolverQueueItem.cc.o
[ 46%] Building CXX object
zypp/CMakeFiles/zypp.dir/solver/detail/SolverQueueItemInstall.cc.o
[ 46%] Building CXX object
zypp/CMakeFiles/zypp.dir/solver/detail/SolverQueueItemDelete.cc.o
[ 46%] Building CXX object
zypp/CMakeFiles/zypp.dir/solver/detail/SolverQueueItemUpdate.cc.o
ICECC[4887] 16:14:18: got exception 17 (10.11.0.42)
[ 46%] Building CXX object
zypp/CMakeFiles/zypp.dir/solver/detail/SolverQueueItemInstallOneOf.cc.o
ICECC[4927] 16:14:19: got exception 17 (10.10.101.69)
[ 48%] Building CXX object
zypp/CMakeFiles/zypp.dir/solver/detail/SolverQueueItemLock.cc.o
[ 48%] Building CXX object
zypp/CMakeFiles/zypp.dir/solver/detail/SATResolver.cc.o
[ 48%] Building CXX object
zypp/CMakeFiles/zypp.dir/solver/detail/SystemCheck.cc.o
ICECC[4945] 16:14:22: got exception 17 (10.11.0.42)
ICECC[4952] 16:14:22: got exception 17 (10.11.0.42)
[ 48%] Building CXX object zypp/CMakeFiles/zypp.dir/ui/Selectable.cc.o
ICECC[4960] 16:14:22: got exception 17 (10.11.0.42)
ICECC[4968] 16:14:24: got exception 17 (10.10.101.69)
[ 50%] Building CXX object zypp/CMakeFiles/zypp.dir/ui/SelectableImpl.cc.o
<http://river.suse.de/job/libzypp-HEAD/ws/checkout/zypp/solver/detail/SATResolver.cc>:
In member function ‘std::string
zypp::solver::detail::SATResolver::SATprobleminfoString(Id, std::string&, Id&)’:
<http://river.suse.de/job/libzypp-HEAD/ws/checkout/zypp/solver/detail/SATResolver.cc>:958:10:
warning: enumeration value ‘SOLVER_RULE_UNKNOWN’ not handled in switch
<http://river.suse.de/job/libzypp-HEAD/ws/checkout/zypp/solver/detail/SATResolver.cc>:958:10:
warning: enumeration value ‘SOLVER_RULE_RPM_IMPLICIT_OBSOLETES’ not handled in
switch
<http://river.suse.de/job/libzypp-HEAD/ws/checkout/zypp/solver/detail/SATResolver.cc>:958:10:
warning: enumeration value ‘SOLVER_RULE_FEATURE’ not handled in switch
<http://river.suse.de/job/libzypp-HEAD/ws/checkout/zypp/solver/detail/SATResolver.cc>:958:10:
warning: enumeration value ‘SOLVER_RULE_CHOICE’ not handled in switch
<http://river.suse.de/job/libzypp-HEAD/ws/checkout/zypp/solver/detail/SATResolver.cc>:958:10:
warning: enumeration value ‘SOLVER_RULE_LEARNT’ not handled in switch
[ 50%] Building CXX object zypp/CMakeFiles/zypp.dir/ui/Status.cc.o
[ 50%] Building CXX object zypp/CMakeFiles/zypp.dir/ui/UserWantedPackages.cc.o
<http://river.suse.de/job/libzypp-HEAD/ws/checkout/zypp/ui/UserWantedPackages.cc>:130:2:
warning: #warning NEEDS FIX
[ 50%] Building CXX object zypp/CMakeFiles/zypp.dir/thread/Mutex.cc.o
[ 51%] Building CXX object zypp/CMakeFiles/zypp.dir/ws/WebpinResult.cc.o
[ 51%] Building CXX object zypp/CMakeFiles/zypp.dir/ByteCount.cc.o
[ 51%] Building CXX object zypp/CMakeFiles/zypp.dir/Capabilities.cc.o
[ 53%] Building CXX object zypp/CMakeFiles/zypp.dir/Capability.cc.o
[ 53%] Building CXX object zypp/CMakeFiles/zypp.dir/CapMatch.cc.o
<http://river.suse.de/job/libzypp-HEAD/ws/checkout/zypp/Capability.cc>:307:2:
warning: #warning MIGRATE TO SAT
<http://river.suse.de/job/libzypp-HEAD/ws/checkout/zypp/Capability.cc>:308:2:
warning: #warning TESTCASE
[ 53%] Building CXX object zypp/CMakeFiles/zypp.dir/Changelog.cc.o
[ 53%] Building CXX object zypp/CMakeFiles/zypp.dir/CheckSum.cc.o
[ 55%] Building CXX object zypp/CMakeFiles/zypp.dir/Date.cc.o
[ 55%] Building CXX object zypp/CMakeFiles/zypp.dir/Dep.cc.o
[ 55%] Building CXX object zypp/CMakeFiles/zypp.dir/Digest.cc.o
[ 55%] Building CXX object zypp/CMakeFiles/zypp.dir/DiskUsage.cc.o
[ 56%] Building CXX object zypp/CMakeFiles/zypp.dir/DiskUsageCounter.cc.o
<http://river.suse.de/job/libzypp-HEAD/ws/checkout/zypp/Digest.cc>: In member
function 'std::string zypp::Digest::digest()':
<http://river.suse.de/job/libzypp-HEAD/ws/checkout/zypp/Digest.cc>:172:13:
warning: converting 'false' to pointer type for argument 1 of
'std::basic_string<_CharT, _Traits, _Alloc>::basic_string(const _CharT*, const
_Alloc&) [with _CharT = char, _Traits = std::char_traits<char>, _Alloc =
std::allocator<char>]'
<http://river.suse.de/job/libzypp-HEAD/ws/checkout/zypp/Digest.cc>:177:17:
warning: converting 'false' to pointer type for argument 1 of
'std::basic_string<_CharT, _Traits, _Alloc>::basic_string(const _CharT*, const
_Alloc&) [with _CharT = char, _Traits = std::char_traits<char>, _Alloc =
std::allocator<char>]'
[ 56%] [ 56%] Building CXX object zypp/CMakeFiles/zypp.dir/DownloadMode.cc.o
Building CXX object zypp/CMakeFiles/zypp.dir/Edition.cc.o
[ 56%] Building CXX object zypp/CMakeFiles/zypp.dir/ExternalProgram.cc.o
[ 58%] Building CXX object zypp/CMakeFiles/zypp.dir/PluginFrame.cc.o
[ 58%] Building CXX object zypp/CMakeFiles/zypp.dir/PluginFrameException.cc.o
[ 58%] Building CXX object zypp/CMakeFiles/zypp.dir/PluginScript.cc.o
[ 58%] Building CXX object zypp/CMakeFiles/zypp.dir/PluginScriptException.cc.o
[ 60%] Building CXX object zypp/CMakeFiles/zypp.dir/Fetcher.cc.o
[ 60%] Building CXX object zypp/CMakeFiles/zypp.dir/FileChecker.cc.o
[ 60%] Building CXX object zypp/CMakeFiles/zypp.dir/Glob.cc.o
[ 60%] Building CXX object zypp/CMakeFiles/zypp.dir/HistoryLog.cc.o
[ 61%] Building CXX object zypp/CMakeFiles/zypp.dir/HistoryLogData.cc.o
[ 61%] Building CXX object zypp/CMakeFiles/zypp.dir/IdString.cc.o
[ 61%] Building CXX object zypp/CMakeFiles/zypp.dir/InstanceId.cc.o
ICECC[5119] 16:14:36: got exception 17 (10.10.101.69)
[ 61%] Building CXX object zypp/CMakeFiles/zypp.dir/KeyRing.cc.o
[ 63%] Building CXX object zypp/CMakeFiles/zypp.dir/Locks.cc.o
[ 63%] Building CXX object zypp/CMakeFiles/zypp.dir/MediaProducts.cc.o
[ 63%] Building CXX object zypp/CMakeFiles/zypp.dir/MediaSetAccess.cc.o
ICECC[5162] 16:14:39: got exception 17 (10.11.0.42)
[ 65%] Building CXX object zypp/CMakeFiles/zypp.dir/OnMediaLocation.cc.o
[ 65%] Building CXX object zypp/CMakeFiles/zypp.dir/Package.cc.o
[ 65%] Building CXX object zypp/CMakeFiles/zypp.dir/Patch.cc.o
<http://river.suse.de/job/libzypp-HEAD/ws/checkout/zypp/Patch.cc>:148:2:
warning: #warning definition of patch contents is poor - needs review
[ 65%] Building CXX object zypp/CMakeFiles/zypp.dir/PathInfo.cc.o
[ 66%] Building CXX object zypp/CMakeFiles/zypp.dir/Pathname.cc.o
[ 66%] Building CXX object zypp/CMakeFiles/zypp.dir/Pattern.cc.o
[ 66%] Building CXX object zypp/CMakeFiles/zypp.dir/PoolItem.cc.o
[ 66%] Building CXX object zypp/CMakeFiles/zypp.dir/PoolItemBest.cc.o
[ 68%] Building CXX object zypp/CMakeFiles/zypp.dir/PoolQuery.cc.o
ICECC[5225] 16:14:44: got exception 17 (10.10.101.69)
[ 68%] Building CXX object zypp/CMakeFiles/zypp.dir/PoolQueryResult.cc.o
ICECC[5232] 16:14:45: got exception 17 (10.10.101.69)
[ 68%] Building CXX object zypp/CMakeFiles/zypp.dir/ProblemSolution.cc.o
[ 68%] Building CXX object zypp/CMakeFiles/zypp.dir/Product.cc.o
[ 70%] Building CXX object zypp/CMakeFiles/zypp.dir/ProgressData.cc.o
ICECC[5252] 16:14:47: got exception 17 (10.10.101.69)
[ 70%] Building CXX object zypp/CMakeFiles/zypp.dir/ProvideFilePolicy.cc.o
[ 70%] Building CXX object zypp/CMakeFiles/zypp.dir/PublicKey.cc.o
[ 70%] Building CXX object zypp/CMakeFiles/zypp.dir/Range.cc.o
[ 71%] Building CXX object zypp/CMakeFiles/zypp.dir/Rel.cc.o
[ 71%] Building CXX object zypp/CMakeFiles/zypp.dir/RepoInfo.cc.o
[ 71%] Building CXX object zypp/CMakeFiles/zypp.dir/RepoManager.cc.o
[ 71%] Building CXX object zypp/CMakeFiles/zypp.dir/Repository.cc.o
[ 73%] Building CXX object zypp/CMakeFiles/zypp.dir/RepoStatus.cc.o
[ 73%] Building CXX object zypp/CMakeFiles/zypp.dir/ResKind.cc.o
[ 73%] Building CXX object zypp/CMakeFiles/zypp.dir/ResObject.cc.o
[ 73%] Building CXX object zypp/CMakeFiles/zypp.dir/Resolvable.cc.o
<http://river.suse.de/job/libzypp-HEAD/ws/checkout/zypp/ResObject.cc>:99:2:
warning: #warning DUMMY diskusage
[ 75%] Building CXX object zypp/CMakeFiles/zypp.dir/Resolver.cc.o
[ 75%] Building CXX object zypp/CMakeFiles/zypp.dir/ResolverProblem.cc.o
ICECC[5328] 16:14:51: got exception 17 (10.10.101.69)
<http://river.suse.de/job/libzypp-HEAD/ws/checkout/zypp/ResObject.cc>:99:2:
warning: #warning DUMMY diskusage
[ 75%] [ 76%] Building CXX object zypp/CMakeFiles/zypp.dir/ResPool.cc.o
Building CXX object zypp/CMakeFiles/zypp.dir/ResPoolProxy.cc.o
[ 76%] Building CXX object zypp/CMakeFiles/zypp.dir/ResStatus.cc.o
[ 76%] Building CXX object zypp/CMakeFiles/zypp.dir/ServiceInfo.cc.o
[ 76%] Building CXX object zypp/CMakeFiles/zypp.dir/Signature.cc.o
[ 78%] Building CXX object zypp/CMakeFiles/zypp.dir/SrcPackage.cc.o
ICECC[5358] 16:14:54: got exception 17 (10.10.101.69)
[ 78%] Building CXX object zypp/CMakeFiles/zypp.dir/SysContent.cc.o
[ 78%] Building CXX object zypp/CMakeFiles/zypp.dir/Target.cc.o
[ 78%] Building CXX object zypp/CMakeFiles/zypp.dir/TmpPath.cc.o
ICECC[5391] 16:14:55: got exception 17 (10.10.101.69)
[ 80%] Building CXX object zypp/CMakeFiles/zypp.dir/Url.cc.o
ICECC[5397] 16:14:55: got exception 17 (10.10.101.69)
[ 80%] Building CXX object zypp/CMakeFiles/zypp.dir/VendorAttr.cc.o
[ 80%] Building CXX object zypp/CMakeFiles/zypp.dir/VendorSupportOptions.cc.o
[ 80%] Building CXX object zypp/CMakeFiles/zypp.dir/ZYpp.cc.o
[ 81%] Building CXX object zypp/CMakeFiles/zypp.dir/ZYppCommitPolicy.cc.o
[ 81%] Building CXX object zypp/CMakeFiles/zypp.dir/ZYppCommitResult.cc.o
[ 81%] Building CXX object zypp/CMakeFiles/zypp.dir/ZYppFactory.cc.o
ICECC[5429] 16:14:59: got exception 17 (10.10.101.69)
In file included from
<http://river.suse.de/job/libzypp-HEAD/ws/checkout/zypp/ZYppFactory.cc>:26:0:
<http://river.suse.de/job/libzypp-HEAD/ws/checkout/zypp/zypp_detail/ZYppReadOnlyHack.h>:15:2:
warning: #warning ZYPP_ZYPP_DETAIL_ZYPPREADONLYHACK_H
[ 81%] Building CXX object zypp/CMakeFiles/zypp.dir/zypp_detail/ZYppImpl.cc.o
ICECC[5449] 16:15:00: got exception 17 (10.10.101.69)
[ 83%] Building CXX object zypp/CMakeFiles/zypp.dir/sat/Pool.cc.o
ICECC[5463] 16:15:02: got exception 17 (10.10.101.69)
[ 83%] Building CXX object zypp/CMakeFiles/zypp.dir/sat/Solvable.cc.o
[ 83%] Building CXX object zypp/CMakeFiles/zypp.dir/sat/SolvableSet.cc.o
In file included from
<http://river.suse.de/job/libzypp-HEAD/ws/checkout/zypp/ZYppFactory.cc>:26:0:
<http://river.suse.de/job/libzypp-HEAD/ws/checkout/zypp/zypp_detail/ZYppReadOnlyHack.h>:15:2:
warning: #warning ZYPP_ZYPP_DETAIL_ZYPPREADONLYHACK_H
[ 83%] Building CXX object zypp/CMakeFiles/zypp.dir/sat/SolvIterMixin.cc.o
[ 85%] Building CXX object zypp/CMakeFiles/zypp.dir/sat/WhatProvides.cc.o
ICECC[5501] 16:15:05: got exception 17 (10.10.101.69)
[ 85%] Building CXX object zypp/CMakeFiles/zypp.dir/sat/WhatObsoletes.cc.o
[ 85%] Building CXX object zypp/CMakeFiles/zypp.dir/sat/LocaleSupport.cc.o
ICECC[5515] 16:15:06: got exception 17 (10.10.101.69)
[ 85%] Building CXX object zypp/CMakeFiles/zypp.dir/sat/LookupAttr.cc.o
[ 86%] Building CXX object zypp/CMakeFiles/zypp.dir/sat/SolvAttr.cc.o
<http://river.suse.de/job/libzypp-HEAD/ws/checkout/zypp/sat/SolvAttr.cc>:33:2:
warning: #warning STILL ATTRIBUTES HERE WHICH ARE NOT PROVIDED BY SOLV FILES
[ 86%] Building CXX object zypp/CMakeFiles/zypp.dir/sat/AttrMatcher.cc.o
ICECC[5529] 16:15:07: got exception 17 (10.10.101.69)
[ 86%] Building CXX object zypp/CMakeFiles/zypp.dir/sat/detail/PoolImpl.cc.o
[ 88%] Building CXX object zypp/CMakeFiles/zypp.dir/ZConfig.cc.o
<http://river.suse.de/job/libzypp-HEAD/ws/checkout/zypp/sat/detail/PoolImpl.cc>:491:2:
warning: #warning immediately build LocaleSet as soon as Loale is an Id based
type
<http://river.suse.de/job/libzypp-HEAD/ws/checkout/zypp/ZConfig.cc>:165:2:
warning: #warning HACK AROUND BOOST_TEST_CATCH_SYSTEM_ERRORS
<http://river.suse.de/job/libzypp-HEAD/ws/checkout/zypp/ZConfig.cc>:631:2:
warning: #warning prefer signal
[ 88%] Building CXX object zypp/CMakeFiles/zypp.dir/Arch.cc.o
[ 88%] Building CXX object zypp/CMakeFiles/zypp.dir/Locale.cc.o
[ 88%] Building CXX object zypp/CMakeFiles/zypp.dir/CountryCode.cc.o
[ 90%] Building CXX object zypp/CMakeFiles/zypp.dir/LanguageCode.cc.o

cc1plus: out of memory allocating 28808 bytes after a total of 8368128 bytes
ICECC[5563] 16:15:11: Compiled on 10.10.101.69
make[2]: *** [zypp/CMakeFiles/zypp.dir/Arch.cc.o] Error 1
make[2]: *** Waiting for unfinished jobs....
make[1]: *** [zypp/CMakeFiles/zypp.dir/all] Error 2
make: *** [all] Error 2
Archiving artifacts

--
To unsubscribe, e-mail: zypp-commit+unsubscribe@xxxxxxxxxxxx
For additional commands, e-mail: zypp-commit+help@xxxxxxxxxxxx

< Previous Next >
Follow Ups
References