Mailinglist Archive: yast-devel (251 mails)

< Previous Next >
[yast-devel] Build failed in Jenkins: yast-kerberos-client-HEAD #127
  • From: hudson@xxxxxxx
  • Date: Wed, 31 Jul 2013 11:31:21 +0200 (CEST)
  • Message-id: <625777604.223.1375263081083.JavaMail.jenkins@river>
See <http://river.suse.de/job/yast-kerberos-client-HEAD/127/changes>

Changes:

[yast-devel] version 3.0.0

------------------------------------------
[...truncated 104 lines...]
++ RPMTOPDIR=<http://river.suse.de/job/yast-kerberos-client-HEAD/ws/rpm>
++ export
RPMOUT=<http://river.suse.de/job/yast-kerberos-client-HEAD/ws/rpm/rpms>
++ RPMOUT=<http://river.suse.de/job/yast-kerberos-client-HEAD/ws/rpm/rpms>
++ export
RPMBUILDDIR=<http://river.suse.de/job/yast-kerberos-client-HEAD/ws/rpm/rpmbuild>
++
RPMBUILDDIR=<http://river.suse.de/job/yast-kerberos-client-HEAD/ws/rpm/rpmbuild>
++ export
RPMBUILDROOT=<http://river.suse.de/job/yast-kerberos-client-HEAD/ws/rpm/rpmbuildroot>
++
RPMBUILDROOT=<http://river.suse.de/job/yast-kerberos-client-HEAD/ws/rpm/rpmbuildroot>
++ rm -rf <http://river.suse.de/job/yast-kerberos-client-HEAD/ws/rpm/rpms>
++ rm -rf <http://river.suse.de/job/yast-kerberos-client-HEAD/ws/rpm/rpmbuild>
++ rm -rf
<http://river.suse.de/job/yast-kerberos-client-HEAD/ws/rpm/rpmbuildroot>
++ rm -rf <http://river.suse.de/job/yast-kerberos-client-HEAD/ws/.artifacts>
++ rm -rf <http://river.suse.de/job/yast-kerberos-client-HEAD/ws/OBS>
++ rm -rf
'<http://river.suse.de/job/yast-kerberos-client-HEAD/ws/copy-to-slave*.dir'>
++ [[ 1 == 1 ]]
++ echo 'Using autotools for building'
Using autotools for building
++ export
BUILDDIR=<http://river.suse.de/job/yast-kerberos-client-HEAD/ws/checkout>
++ BUILDDIR=<http://river.suse.de/job/yast-kerberos-client-HEAD/ws/checkout>
++ export
PACKAGEDIR=<http://river.suse.de/job/yast-kerberos-client-HEAD/ws/checkout/package>
++
PACKAGEDIR=<http://river.suse.de/job/yast-kerberos-client-HEAD/ws/checkout/package>
++ mkdir -p <http://river.suse.de/job/yast-kerberos-client-HEAD/ws/rpm>
++ mkdir -p <http://river.suse.de/job/yast-kerberos-client-HEAD/ws/rpm/rpms>
++ mkdir -p <http://river.suse.de/job/yast-kerberos-client-HEAD/ws/rpm/rpmbuild>
++ mkdir -p
<http://river.suse.de/job/yast-kerberos-client-HEAD/ws/rpm/rpmbuildroot>
++ mkdir -p <http://river.suse.de/job/yast-kerberos-client-HEAD/ws/.artifacts>
++ mkdir -p <http://river.suse.de/job/yast-kerberos-client-HEAD/ws/OBS>
++ cat
+ PACKAGENAME=yast-kerberos-client
+ PACKAGENAME=yast2-kerberos-client
+ cd <http://river.suse.de/job/yast-kerberos-client-HEAD/ws/checkout>
+ make -f Makefile.cvs
y2tool y2autoconf
y2autoconf: Generating toplevel configure.ac
y2tool y2automake
y2automake: Copying automakefiles for inclusion
y2automake: Generating toplevel Makefile.am
autoreconf --force --install
./configure --prefix=/usr --libdir=/usr/lib64
checking build system type... x86_64-suse-linux-gnu
checking host system type... x86_64-suse-linux-gnu
checking target system type... x86_64-suse-linux-gnu
checking for a BSD-compatible install... /usr/bin/install -c
checking whether build environment is sane... yes
checking for a thread-safe mkdir -p... /usr/bin/mkdir -p
checking for gawk... gawk
checking whether make sets $(MAKE)... yes
checking how to create a ustar tar archive... gnutar
checking whether ln -s works... yes
checking whether make sets $(MAKE)... (cached) yes
checking for xgettext... /usr/bin/xgettext
checking for ycpdoc... /usr/lib/YaST2/bin/ycpdoc
checking for ycpmakedep... /usr/lib/YaST2/bin/ycpmakedep
checking for ycpc... /usr/bin/ycpc
checking for /usr/share/YaST2/data/testsuite/Makefile.testsuite... yes
checking that generated files are newer than configure... done
configure: creating ./config.status
config.status: creating Makefile
config.status: creating agents/Makefile
config.status: creating doc/autodocs/Makefile
config.status: creating doc/Makefile
config.status: creating src/Makefile
config.status: creating testsuite/Makefile
+ make
Making all in agents
make[1]: Entering directory
`<http://river.suse.de/job/yast-kerberos-client-HEAD/ws/checkout/agents'>
make[1]: Nothing to be done for `all'.
make[1]: Leaving directory
`<http://river.suse.de/job/yast-kerberos-client-HEAD/ws/checkout/agents'>
Making all in doc
make[1]: Entering directory
`<http://river.suse.de/job/yast-kerberos-client-HEAD/ws/checkout/doc'>
Making all in autodocs
make[2]: Entering directory
`<http://river.suse.de/job/yast-kerberos-client-HEAD/ws/checkout/doc/autodocs'>
make[2]: Nothing to be done for `all'.
make[2]: Leaving directory
`<http://river.suse.de/job/yast-kerberos-client-HEAD/ws/checkout/doc/autodocs'>
make[2]: Entering directory
`<http://river.suse.de/job/yast-kerberos-client-HEAD/ws/checkout/doc'>
make[2]: Nothing to be done for `all-am'.
make[2]: Leaving directory
`<http://river.suse.de/job/yast-kerberos-client-HEAD/ws/checkout/doc'>
make[1]: Leaving directory
`<http://river.suse.de/job/yast-kerberos-client-HEAD/ws/checkout/doc'>
Making all in src
make[1]: Entering directory
`<http://river.suse.de/job/yast-kerberos-client-HEAD/ws/checkout/src'>
make[1]: Nothing to be done for `all'.
make[1]: Leaving directory
`<http://river.suse.de/job/yast-kerberos-client-HEAD/ws/checkout/src'>
Making all in testsuite
make[1]: Entering directory
`<http://river.suse.de/job/yast-kerberos-client-HEAD/ws/checkout/testsuite'>
make -f /usr/share/YaST2/data/testsuite/Makefile.testsuite
RPMNAME=yast2-kerberos-client srcdir=.
make[2]: Entering directory
`<http://river.suse.de/job/yast-kerberos-client-HEAD/ws/checkout/testsuite'>
make[2]: Nothing to be done for `all'.
make[2]: Leaving directory
`<http://river.suse.de/job/yast-kerberos-client-HEAD/ws/checkout/testsuite'>
make[1]: Leaving directory
`<http://river.suse.de/job/yast-kerberos-client-HEAD/ws/checkout/testsuite'>
make[1]: Entering directory
`<http://river.suse.de/job/yast-kerberos-client-HEAD/ws/checkout'>
make[1]: Nothing to be done for `all-am'.
make[1]: Leaving directory
`<http://river.suse.de/job/yast-kerberos-client-HEAD/ws/checkout'>
+ make check
Making check in agents
make[1]: Entering directory
`<http://river.suse.de/job/yast-kerberos-client-HEAD/ws/checkout/agents'>
make[1]: Nothing to be done for `check'.
make[1]: Leaving directory
`<http://river.suse.de/job/yast-kerberos-client-HEAD/ws/checkout/agents'>
Making check in doc
make[1]: Entering directory
`<http://river.suse.de/job/yast-kerberos-client-HEAD/ws/checkout/doc'>
Making check in autodocs
make[2]: Entering directory
`<http://river.suse.de/job/yast-kerberos-client-HEAD/ws/checkout/doc/autodocs'>
make[2]: Nothing to be done for `check'.
make[2]: Leaving directory
`<http://river.suse.de/job/yast-kerberos-client-HEAD/ws/checkout/doc/autodocs'>
make[2]: Entering directory
`<http://river.suse.de/job/yast-kerberos-client-HEAD/ws/checkout/doc'>
make[2]: Nothing to be done for `check-am'.
make[2]: Leaving directory
`<http://river.suse.de/job/yast-kerberos-client-HEAD/ws/checkout/doc'>
make[1]: Leaving directory
`<http://river.suse.de/job/yast-kerberos-client-HEAD/ws/checkout/doc'>
Making check in src
make[1]: Entering directory
`<http://river.suse.de/job/yast-kerberos-client-HEAD/ws/checkout/src'>
make[1]: Nothing to be done for `check'.
make[1]: Leaving directory
`<http://river.suse.de/job/yast-kerberos-client-HEAD/ws/checkout/src'>
Making check in testsuite
make[1]: Entering directory
`<http://river.suse.de/job/yast-kerberos-client-HEAD/ws/checkout/testsuite'>
make -f /usr/share/YaST2/data/testsuite/Makefile.testsuite
RPMNAME=yast2-kerberos-client srcdir=.
make[2]: Entering directory
`<http://river.suse.de/job/yast-kerberos-client-HEAD/ws/checkout/testsuite'>
make[2]: Nothing to be done for `all'.
make[2]: Leaving directory
`<http://river.suse.de/job/yast-kerberos-client-HEAD/ws/checkout/testsuite'>
make check-DEJAGNU check-local
make[2]: Entering directory
`<http://river.suse.de/job/yast-kerberos-client-HEAD/ws/checkout/testsuite'>
Making a new site.exp file ...
srcdir='.'; export srcdir; \
EXPECT=expect; export EXPECT; \
runtest=runtest; \
if /bin/sh -c "$runtest --version" > /dev/null 2>&1; then \
exit_status=0; l='yast2-kerberos-client'; for tool in $l; do \
if $runtest --tool $tool --srcdir $srcdir ; \
then :; else exit_status=1; fi; \
done; \
else echo "WARNING: could not find 'runtest'" 1>&2; :;\
fi; \
exit $exit_status
WARNING: Couldn't find tool init file
Test Run By root on Wed Jul 31 11:31:19 2013
Native configuration is x86_64-suse-linux-gnu

=== yast2-kerberos-client tests ===

Schedule of variations:
unix

Running target unix
Using /usr/share/dejagnu/baseboards/unix.exp as board description file for
target.
Using /usr/share/dejagnu/config/unix.exp as generic interface file for target.
Using ./config/unix.exp as tool-and-target-specific interface file.
Running ./yast2-kerberos-client.test/testsuite.exp ...

Checking started

Running ImportExport ...
FAIL: Wrong stderr for ImportExport

The diff follows...

--- tests/ImportExport.err 2013-01-22 11:25:53.000000000 +0100
+++ tmp.err.ImportExport 2013-07-31 11:31:19.000000000 +0200
@@ -0,0 +1,2 @@
+2013-07-31 11:31:19 <3> app42(14679) [Interpreter] modules/Testsuite.rb:42
Loading module 'Kerberos' failed
+2013-07-31 11:31:19 <3> app42(14679) [libycp] Import.cc(import):97 No matching
component found

FAIL: Wrong stderr for ImportExport
See the diff above.
Running Read ...
FAIL: Wrong stderr for Read

The diff follows...

--- tests/Read.err 2013-01-22 11:25:53.000000000 +0100
+++ tmp.err.Read 2013-07-31 11:31:20.000000000 +0200
@@ -0,0 +1,2 @@
+2013-07-31 11:31:20 <3> app42(14705) [Interpreter] modules/Testsuite.rb:42
Loading module 'Kerberos' failed
+2013-07-31 11:31:20 <3> app42(14705) [libycp] Import.cc(import):97 No matching
component found

FAIL: Wrong stderr for Read
See the diff above.
Running ReadKrb5ConfValue ...
FAIL: Wrong stderr for ReadKrb5ConfValue

The diff follows...

--- tests/ReadKrb5ConfValue.err 2013-01-22 11:25:53.000000000 +0100
+++ tmp.err.ReadKrb5ConfValue 2013-07-31 11:31:20.000000000 +0200
@@ -0,0 +1,2 @@
+2013-07-31 11:31:20 <3> app42(14731) [Interpreter] modules/Testsuite.rb:42
Loading module 'Kerberos' failed
+2013-07-31 11:31:20 <3> app42(14731) [libycp] Import.cc(import):97 No matching
component found

FAIL: Wrong stderr for ReadKrb5ConfValue
See the diff above.
Running Write ...
FAIL: Wrong stderr for Write

The diff follows...

--- tests/Write.err 2013-01-22 11:25:53.000000000 +0100
+++ tmp.err.Write 2013-07-31 11:31:20.000000000 +0200
@@ -0,0 +1,2 @@
+2013-07-31 11:31:20 <3> app42(14757) [Interpreter] modules/Testsuite.rb:42
Loading module 'Kerberos' failed
+2013-07-31 11:31:20 <3> app42(14757) [libycp] Import.cc(import):97 No matching
component found

FAIL: Wrong stderr for Write
See the diff above.
Running WriteKrb5ConfValue ...
FAIL: Wrong stderr for WriteKrb5ConfValue

The diff follows...

--- tests/WriteKrb5ConfValue.err 2013-01-22 11:25:53.000000000 +0100
+++ tmp.err.WriteKrb5ConfValue 2013-07-31 11:31:20.000000000 +0200
@@ -0,0 +1,2 @@
+2013-07-31 11:31:20 <3> app42(14783) [Interpreter] modules/Testsuite.rb:42
Loading module 'Kerberos' failed
+2013-07-31 11:31:20 <3> app42(14783) [libycp] Import.cc(import):97 No matching
component found

FAIL: Wrong stderr for WriteKrb5ConfValue
See the diff above.

Checking finished


=== yast2-kerberos-client Summary ===

# of unexpected failures 10
make[2]: *** [check-DEJAGNU] Error 1
make[2]: Leaving directory
`<http://river.suse.de/job/yast-kerberos-client-HEAD/ws/checkout/testsuite'>
make[1]: *** [check-am] Error 2
make[1]: Leaving directory
`<http://river.suse.de/job/yast-kerberos-client-HEAD/ws/checkout/testsuite'>
make: *** [check-recursive] Error 1
++ error_exit 2
++ echo 'ERROR: detected exitcode 2'
ERROR: detected exitcode 2
++ cleanup
++ echo '==> Running cleanup'
==> Running cleanup
++ rm -f
<http://river.suse.de/job/yast-kerberos-client-HEAD/ws/ICECC/40c0ab7e54f59a1e4e493c1ea90a882a.tar.gz>
++ footer_and_exit 1
++ '[' -z 1 ']'
++ MYEXIT=1
++ '[' 1 == 0 ']'
++ ascii_failed
++ cat

( )
( ) (
) _ )
( \_
_(_\ \)__
(____\___))

build failed

++ exit 1
Build step 'Execute shell' marked build as failure
--
To unsubscribe, e-mail: yast-devel+unsubscribe@xxxxxxxxxxxx
To contact the owner, e-mail: yast-devel+owner@xxxxxxxxxxxx

< Previous Next >
Follow Ups
References