Mailinglist Archive: yast-devel (251 mails)

< Previous Next >
[yast-devel] Build failed in Jenkins: yast-ftp-server-HEAD #129
  • From: hudson@xxxxxxx
  • Date: Wed, 31 Jul 2013 11:20:47 +0200 (CEST)
  • Message-id: <1589092378.211.1375262447720.JavaMail.jenkins@river>
See <http://river.suse.de/job/yast-ftp-server-HEAD/129/changes>

Changes:

[yast-devel] version 3.0.0

------------------------------------------
[...truncated 153 lines...]
checking for ycpdoc... /usr/lib/YaST2/bin/ycpdoc
checking for ycpmakedep... /usr/lib/YaST2/bin/ycpmakedep
checking for ycpc... /usr/bin/ycpc
checking for /usr/share/YaST2/data/testsuite/Makefile.testsuite... yes
checking that generated files are newer than configure... done
configure: creating ./config.status
config.status: creating Makefile
config.status: creating agents/Makefile
config.status: creating config/Makefile
config.status: creating doc/autodocs/Makefile
config.status: creating doc/Makefile
config.status: creating src/Makefile
config.status: creating testsuite/Makefile
+ make
Making all in agents
make[1]: Entering directory
`<http://river.suse.de/job/yast-ftp-server-HEAD/ws/checkout/agents'>
make[1]: Nothing to be done for `all'.
make[1]: Leaving directory
`<http://river.suse.de/job/yast-ftp-server-HEAD/ws/checkout/agents'>
Making all in config
make[1]: Entering directory
`<http://river.suse.de/job/yast-ftp-server-HEAD/ws/checkout/config'>
make[1]: Nothing to be done for `all'.
make[1]: Leaving directory
`<http://river.suse.de/job/yast-ftp-server-HEAD/ws/checkout/config'>
Making all in doc
make[1]: Entering directory
`<http://river.suse.de/job/yast-ftp-server-HEAD/ws/checkout/doc'>
Making all in autodocs
make[2]: Entering directory
`<http://river.suse.de/job/yast-ftp-server-HEAD/ws/checkout/doc/autodocs'>
make[2]: Nothing to be done for `all'.
make[2]: Leaving directory
`<http://river.suse.de/job/yast-ftp-server-HEAD/ws/checkout/doc/autodocs'>
make[2]: Entering directory
`<http://river.suse.de/job/yast-ftp-server-HEAD/ws/checkout/doc'>
make[2]: Nothing to be done for `all-am'.
make[2]: Leaving directory
`<http://river.suse.de/job/yast-ftp-server-HEAD/ws/checkout/doc'>
make[1]: Leaving directory
`<http://river.suse.de/job/yast-ftp-server-HEAD/ws/checkout/doc'>
Making all in src
make[1]: Entering directory
`<http://river.suse.de/job/yast-ftp-server-HEAD/ws/checkout/src'>
make[1]: Nothing to be done for `all'.
make[1]: Leaving directory
`<http://river.suse.de/job/yast-ftp-server-HEAD/ws/checkout/src'>
Making all in testsuite
make[1]: Entering directory
`<http://river.suse.de/job/yast-ftp-server-HEAD/ws/checkout/testsuite'>
make -f /usr/share/YaST2/data/testsuite/Makefile.testsuite
RPMNAME=yast2-ftp-server srcdir=.
make[2]: Entering directory
`<http://river.suse.de/job/yast-ftp-server-HEAD/ws/checkout/testsuite'>
make[2]: Nothing to be done for `all'.
make[2]: Leaving directory
`<http://river.suse.de/job/yast-ftp-server-HEAD/ws/checkout/testsuite'>
make[1]: Leaving directory
`<http://river.suse.de/job/yast-ftp-server-HEAD/ws/checkout/testsuite'>
make[1]: Entering directory
`<http://river.suse.de/job/yast-ftp-server-HEAD/ws/checkout'>
make[1]: Nothing to be done for `all-am'.
make[1]: Leaving directory
`<http://river.suse.de/job/yast-ftp-server-HEAD/ws/checkout'>
+ make install
Making install in agents
make[1]: Entering directory
`<http://river.suse.de/job/yast-ftp-server-HEAD/ws/checkout/agents'>
make[2]: Entering directory
`<http://river.suse.de/job/yast-ftp-server-HEAD/ws/checkout/agents'>
make[2]: Nothing to be done for `install-exec-am'.
make[2]: Nothing to be done for `install-data-am'.
make[2]: Leaving directory
`<http://river.suse.de/job/yast-ftp-server-HEAD/ws/checkout/agents'>
make[1]: Leaving directory
`<http://river.suse.de/job/yast-ftp-server-HEAD/ws/checkout/agents'>
Making install in config
make[1]: Entering directory
`<http://river.suse.de/job/yast-ftp-server-HEAD/ws/checkout/config'>
make[2]: Entering directory
`<http://river.suse.de/job/yast-ftp-server-HEAD/ws/checkout/config'>
make[2]: Nothing to be done for `install-exec-am'.
make[2]: Nothing to be done for `install-data-am'.
make[2]: Leaving directory
`<http://river.suse.de/job/yast-ftp-server-HEAD/ws/checkout/config'>
make[1]: Leaving directory
`<http://river.suse.de/job/yast-ftp-server-HEAD/ws/checkout/config'>
Making install in doc
make[1]: Entering directory
`<http://river.suse.de/job/yast-ftp-server-HEAD/ws/checkout/doc'>
Making install in autodocs
make[2]: Entering directory
`<http://river.suse.de/job/yast-ftp-server-HEAD/ws/checkout/doc/autodocs'>
make[3]: Entering directory
`<http://river.suse.de/job/yast-ftp-server-HEAD/ws/checkout/doc/autodocs'>
make[3]: Nothing to be done for `install-exec-am'.
/usr/bin/mkdir -p '/usr/share/doc/packages/yast2-ftp-server//autodocs'
/usr/bin/mkdir -p '/usr/share/doc/packages/yast2-ftp-server//autodocs/js'
/usr/bin/install -c -p -m 644 js/full_list.js js/jquery.js js/app.js
'/usr/share/doc/packages/yast2-ftp-server//autodocs/js'
/usr/bin/install -c -p -m 644 index.html file_list.html class_list.html
Yast.html _index.html method_list.html top-level-namespace.html frames.html
'/usr/share/doc/packages/yast2-ftp-server//autodocs/.'
/usr/bin/mkdir -p '/usr/share/doc/packages/yast2-ftp-server//autodocs/Yast'
/usr/bin/install -c -p -m 644 Yast/FtpServerDialogsInclude.html
Yast/FtpServerComplexInclude.html Yast/FtpServerHelpsInclude.html
Yast/FtpServerWidFunctionsInclude.html Yast/FtpServerWriteLoadInclude.html
Yast/FtpServerClass.html Yast/FtpServerWizardsInclude.html
'/usr/share/doc/packages/yast2-ftp-server//autodocs/Yast'
/usr/bin/mkdir -p '/usr/share/doc/packages/yast2-ftp-server//autodocs/css'
/usr/bin/install -c -p -m 644 css/full_list.css css/style.css css/common.css
'/usr/share/doc/packages/yast2-ftp-server//autodocs/css'
make[3]: Leaving directory
`<http://river.suse.de/job/yast-ftp-server-HEAD/ws/checkout/doc/autodocs'>
make[2]: Leaving directory
`<http://river.suse.de/job/yast-ftp-server-HEAD/ws/checkout/doc/autodocs'>
make[2]: Entering directory
`<http://river.suse.de/job/yast-ftp-server-HEAD/ws/checkout/doc'>
make[3]: Entering directory
`<http://river.suse.de/job/yast-ftp-server-HEAD/ws/checkout/doc'>
make[3]: Nothing to be done for `install-exec-am'.
make[3]: Leaving directory
`<http://river.suse.de/job/yast-ftp-server-HEAD/ws/checkout/doc'>
make[2]: Leaving directory
`<http://river.suse.de/job/yast-ftp-server-HEAD/ws/checkout/doc'>
make[1]: Leaving directory
`<http://river.suse.de/job/yast-ftp-server-HEAD/ws/checkout/doc'>
Making install in src
make[1]: Entering directory
`<http://river.suse.de/job/yast-ftp-server-HEAD/ws/checkout/src'>
make[2]: Entering directory
`<http://river.suse.de/job/yast-ftp-server-HEAD/ws/checkout/src'>
make[2]: Nothing to be done for `install-exec-am'.
/usr/bin/mkdir -p '/usr/share/YaST2/clients'
/usr/bin/install -c -p -m 644 clients/ftp-server_auto.rb clients/ftp-server.rb
'/usr/share/YaST2/clients'
/usr/bin/mkdir -p '/usr/share/applications/YaST2'
/usr/bin/install -c -p -m 644 desktop/ftp-server.desktop
'/usr/share/applications/YaST2'
/usr/bin/mkdir -p '/usr/share/YaST2/modules'
/usr/bin/install -c -p -m 644 modules/FtpServer.rb '/usr/share/YaST2/modules'
/usr/bin/mkdir -p '/usr/share/YaST2/modules'
/usr/bin/install -c -p -m 644 modules/FtpServer.rb '/usr/share/YaST2/modules'
/usr/bin/mkdir -p '/usr/share/YaST2/schema/autoyast/rnc'
/usr/bin/install -c -p -m 644 autoyast-rnc/ftp-server.rnc
'/usr/share/YaST2/schema/autoyast/rnc'
/usr/bin/mkdir -p '/usr/share/YaST2/scrconf'
/usr/bin/install -c -p -m 644 scrconf/pure-ftpd.scr scrconf/vsftpd.scr
'/usr/share/YaST2/scrconf'
/usr/bin/mkdir -p '/usr/share/YaST2/include/ftp-server'
/usr/bin/install -c -p -m 644 include/ftp-server/wid_functions.rb
include/ftp-server/wizards.rb include/ftp-server/dialogs.rb
include/ftp-server/write_load.rb include/ftp-server/complex.rb
include/ftp-server/helps.rb '/usr/share/YaST2/include/ftp-server'
make[2]: Leaving directory
`<http://river.suse.de/job/yast-ftp-server-HEAD/ws/checkout/src'>
make[1]: Leaving directory
`<http://river.suse.de/job/yast-ftp-server-HEAD/ws/checkout/src'>
Making install in testsuite
make[1]: Entering directory
`<http://river.suse.de/job/yast-ftp-server-HEAD/ws/checkout/testsuite'>
make -f /usr/share/YaST2/data/testsuite/Makefile.testsuite
RPMNAME=yast2-ftp-server srcdir=.
make[2]: Entering directory
`<http://river.suse.de/job/yast-ftp-server-HEAD/ws/checkout/testsuite'>
make[2]: Nothing to be done for `all'.
make[2]: Leaving directory
`<http://river.suse.de/job/yast-ftp-server-HEAD/ws/checkout/testsuite'>
make[2]: Entering directory
`<http://river.suse.de/job/yast-ftp-server-HEAD/ws/checkout/testsuite'>
make[2]: Nothing to be done for `install-exec-am'.
make[2]: Nothing to be done for `install-data-am'.
make[2]: Leaving directory
`<http://river.suse.de/job/yast-ftp-server-HEAD/ws/checkout/testsuite'>
make[1]: Leaving directory
`<http://river.suse.de/job/yast-ftp-server-HEAD/ws/checkout/testsuite'>
make[1]: Entering directory
`<http://river.suse.de/job/yast-ftp-server-HEAD/ws/checkout'>
make[2]: Entering directory
`<http://river.suse.de/job/yast-ftp-server-HEAD/ws/checkout'>
make[2]: Nothing to be done for `install-exec-am'.
mkdir -p /usr/share/doc/packages/yast2-ftp-server
/usr/bin/install -c -p -m 644
/usr/share/YaST2/data/devtools/admin/copyright/gpl/README
/usr/share/doc/packages/yast2-ftp-server
/usr/bin/install -c -p -m 644
/usr/share/YaST2/data/devtools/admin/copyright/gpl/COPYING
/usr/share/doc/packages/yast2-ftp-server
make[2]: Leaving directory
`<http://river.suse.de/job/yast-ftp-server-HEAD/ws/checkout'>
make[1]: Leaving directory
`<http://river.suse.de/job/yast-ftp-server-HEAD/ws/checkout'>
+ make check
Making check in agents
make[1]: Entering directory
`<http://river.suse.de/job/yast-ftp-server-HEAD/ws/checkout/agents'>
make[1]: Nothing to be done for `check'.
make[1]: Leaving directory
`<http://river.suse.de/job/yast-ftp-server-HEAD/ws/checkout/agents'>
Making check in config
make[1]: Entering directory
`<http://river.suse.de/job/yast-ftp-server-HEAD/ws/checkout/config'>
make[1]: Nothing to be done for `check'.
make[1]: Leaving directory
`<http://river.suse.de/job/yast-ftp-server-HEAD/ws/checkout/config'>
Making check in doc
make[1]: Entering directory
`<http://river.suse.de/job/yast-ftp-server-HEAD/ws/checkout/doc'>
Making check in autodocs
make[2]: Entering directory
`<http://river.suse.de/job/yast-ftp-server-HEAD/ws/checkout/doc/autodocs'>
make[2]: Nothing to be done for `check'.
make[2]: Leaving directory
`<http://river.suse.de/job/yast-ftp-server-HEAD/ws/checkout/doc/autodocs'>
make[2]: Entering directory
`<http://river.suse.de/job/yast-ftp-server-HEAD/ws/checkout/doc'>
make[2]: Nothing to be done for `check-am'.
make[2]: Leaving directory
`<http://river.suse.de/job/yast-ftp-server-HEAD/ws/checkout/doc'>
make[1]: Leaving directory
`<http://river.suse.de/job/yast-ftp-server-HEAD/ws/checkout/doc'>
Making check in src
make[1]: Entering directory
`<http://river.suse.de/job/yast-ftp-server-HEAD/ws/checkout/src'>
make[1]: Nothing to be done for `check'.
make[1]: Leaving directory
`<http://river.suse.de/job/yast-ftp-server-HEAD/ws/checkout/src'>
Making check in testsuite
make[1]: Entering directory
`<http://river.suse.de/job/yast-ftp-server-HEAD/ws/checkout/testsuite'>
make -f /usr/share/YaST2/data/testsuite/Makefile.testsuite
RPMNAME=yast2-ftp-server srcdir=.
make[2]: Entering directory
`<http://river.suse.de/job/yast-ftp-server-HEAD/ws/checkout/testsuite'>
make[2]: Nothing to be done for `all'.
make[2]: Leaving directory
`<http://river.suse.de/job/yast-ftp-server-HEAD/ws/checkout/testsuite'>
make check-DEJAGNU check-local
make[2]: Entering directory
`<http://river.suse.de/job/yast-ftp-server-HEAD/ws/checkout/testsuite'>
Making a new site.exp file ...
srcdir='.'; export srcdir; \
EXPECT=expect; export EXPECT; \
runtest=runtest; \
if /bin/sh -c "$runtest --version" > /dev/null 2>&1; then \
exit_status=0; l='yast2-ftp-server'; for tool in $l; do \
if $runtest --tool $tool --srcdir $srcdir ; \
then :; else exit_status=1; fi; \
done; \
else echo "WARNING: could not find 'runtest'" 1>&2; :;\
fi; \
exit $exit_status
WARNING: Couldn't find tool init file
Test Run By root on Wed Jul 31 11:20:45 2013
Native configuration is x86_64-suse-linux-gnu

=== yast2-ftp-server tests ===

Schedule of variations:
unix

Running target unix
Using /usr/share/dejagnu/baseboards/unix.exp as board description file for
target.
Using /usr/share/dejagnu/config/unix.exp as generic interface file for target.
Using ./config/unix.exp as tool-and-target-specific interface file.
Running ./yast2-ftp-server.test/testsuite.exp ...

Checking started

Running FtpServer ...
FAIL: Wrong stderr for FtpServer

The diff follows...

--- tests/FtpServer.err 2013-01-22 11:19:59.000000000 +0100
+++ tmp.err.FtpServer 2013-07-31 11:20:46.000000000 +0200
@@ -0,0 +1,4 @@
+2013-07-31 11:20:46 <3> app42(23937) [Interpreter] yast/i18n.rb:83 Loading
module 'Inetd' failed
+2013-07-31 11:20:46 <3> app42(23937) [libycp] Import.cc(import):97 No matching
component found
+2013-07-31 11:20:46 <3> app42(23937) [Y2Ruby] binary/YRuby.cc(loadModule):148
Module /usr/share/YaST2/modules/FtpServer load failed:component cannot import
namespace 'Inetd' at /usr/lib64/ruby/vendor_ruby/1.9.1/yast/yast.rb:146:in
`import_pure'
+2013-07-31 11:20:46 <3> app42(23937) [Interpreter] yast/i18n.rb:83
Ruby::loadModule() / Can't load ruby module '/usr/share/YaST2/modules/FtpServer'

FAIL: Wrong stderr for FtpServer
See the diff above.
Running PassivePortRange ...
FAIL: Wrong stderr for PassivePortRange

The diff follows...

--- tests/PassivePortRange.err 2013-01-22 11:19:59.000000000 +0100
+++ tmp.err.PassivePortRange 2013-07-31 11:20:47.000000000 +0200
@@ -0,0 +1,4 @@
+2013-07-31 11:20:47 <3> app42(23959) [Interpreter] yast/i18n.rb:83 Loading
module 'Inetd' failed
+2013-07-31 11:20:47 <3> app42(23959) [libycp] Import.cc(import):97 No matching
component found
+2013-07-31 11:20:47 <3> app42(23959) [Y2Ruby] binary/YRuby.cc(loadModule):148
Module /usr/share/YaST2/modules/FtpServer load failed:component cannot import
namespace 'Inetd' at /usr/lib64/ruby/vendor_ruby/1.9.1/yast/yast.rb:146:in
`import_pure'
+2013-07-31 11:20:47 <3> app42(23959) [Interpreter] yast/i18n.rb:83
Ruby::loadModule() / Can't load ruby module '/usr/share/YaST2/modules/FtpServer'

FAIL: Wrong stderr for PassivePortRange
See the diff above.

Checking finished


=== yast2-ftp-server Summary ===

# of unexpected failures 4
make[2]: *** [check-DEJAGNU] Error 1
make[2]: Leaving directory
`<http://river.suse.de/job/yast-ftp-server-HEAD/ws/checkout/testsuite'>
make[1]: *** [check-am] Error 2
make[1]: Leaving directory
`<http://river.suse.de/job/yast-ftp-server-HEAD/ws/checkout/testsuite'>
make: *** [check-recursive] Error 1
++ error_exit 2
++ echo 'ERROR: detected exitcode 2'
ERROR: detected exitcode 2
++ cleanup
++ echo '==> Running cleanup'
==> Running cleanup
++ rm -f
<http://river.suse.de/job/yast-ftp-server-HEAD/ws/ICECC/40c0ab7e54f59a1e4e493c1ea90a882a.tar.gz>
++ footer_and_exit 1
++ '[' -z 1 ']'
++ MYEXIT=1
++ '[' 1 == 0 ']'
++ ascii_failed
++ cat

( )
( ) (
) _ )
( \_
_(_\ \)__
(____\___))

build failed

++ exit 1
Build step 'Execute shell' marked build as failure
--
To unsubscribe, e-mail: yast-devel+unsubscribe@xxxxxxxxxxxx
To contact the owner, e-mail: yast-devel+owner@xxxxxxxxxxxx

< Previous Next >
This Thread
Follow Ups
References