Mailinglist Archive: yast-devel (251 mails)

< Previous Next >
[yast-devel] Build failed in Jenkins: yast-backup-HEAD #224
  • From: hudson@xxxxxxx
  • Date: Wed, 31 Jul 2013 11:13:02 +0200 (CEST)
  • Message-id: <1671277327.209.1375261982999.JavaMail.jenkins@river>
See <http://river.suse.de/job/yast-backup-HEAD/224/changes>

Changes:

[yast-devel] version 3.0.0

------------------------------------------
[...truncated 351 lines...]
FAIL: Wrong stderr for AddIdExt2

The diff follows...

--- tests/AddIdExt2.err 2013-01-22 11:16:18.000000000 +0100
+++ tmp.err.AddIdExt2 2013-07-31 11:12:56.000000000 +0200
@@ -0,0 +1,2 @@
+2013-07-31 11:12:56 <3> app42(941) [Interpreter] yast/i18n.rb:83 Loading
module 'Nfs' failed
+2013-07-31 11:12:56 <3> app42(941) [libycp] Import.cc(import):97 No matching
component found

FAIL: Wrong stderr for AddIdExt2
See the diff above.
Running AddMissingExtension ...
FAIL: Wrong stderr for AddMissingExtension

The diff follows...

--- tests/AddMissingExtension.err 2013-01-22 11:16:18.000000000 +0100
+++ tmp.err.AddMissingExtension 2013-07-31 11:12:57.000000000 +0200
@@ -0,0 +1,2 @@
+2013-07-31 11:12:57 <3> app42(967) [Interpreter] yast/i18n.rb:83 Loading
module 'Nfs' failed
+2013-07-31 11:12:57 <3> app42(967) [libycp] Import.cc(import):97 No matching
component found

FAIL: Wrong stderr for AddMissingExtension
See the diff above.
Running ExcludeNodevFS ...
FAIL: Wrong stderr for ExcludeNodevFS

The diff follows...

--- tests/ExcludeNodevFS.err 2013-01-22 11:16:18.000000000 +0100
+++ tmp.err.ExcludeNodevFS 2013-07-31 11:12:57.000000000 +0200
@@ -0,0 +1,4 @@
+2013-07-31 11:12:57 <3> app42(993) [Interpreter] yast/i18n.rb:83 Loading
module 'Nfs' failed
+2013-07-31 11:12:57 <3> app42(993) [libycp] Import.cc(import):97 No matching
component found
+2013-07-31 11:12:57 <3> app42(993) [Y2Ruby] binary/YRuby.cc(loadModule):148
Module /usr/share/YaST2/modules/Backup load failed:component cannot import
namespace 'Nfs' at /usr/lib64/ruby/vendor_ruby/1.9.1/yast/yast.rb:146:in
`import_pure'
+2013-07-31 11:12:57 <3> app42(993) [Interpreter] yast/i18n.rb:83
Ruby::loadModule() / Can't load ruby module '/usr/share/YaST2/modules/Backup'

FAIL: Wrong stderr for ExcludeNodevFS
See the diff above.
Running Ext2Filesystems ...
FAIL: Wrong stderr for Ext2Filesystems

The diff follows...

--- tests/Ext2Filesystems.err 2013-01-22 11:16:18.000000000 +0100
+++ tmp.err.Ext2Filesystems 2013-07-31 11:12:57.000000000 +0200
@@ -0,0 +1,2 @@
+2013-07-31 11:12:57 <3> app42(1021) [Interpreter] yast/i18n.rb:83 Loading
module 'Nfs' failed
+2013-07-31 11:12:57 <3> app42(1021) [libycp] Import.cc(import):97 No matching
component found

FAIL: Wrong stderr for Ext2Filesystems
See the diff above.
Running Ext2MountPoint ...
FAIL: Wrong stderr for Ext2MountPoint

The diff follows...

--- tests/Ext2MountPoint.err 2013-01-22 11:16:18.000000000 +0100
+++ tmp.err.Ext2MountPoint 2013-07-31 11:12:58.000000000 +0200
@@ -0,0 +1,2 @@
+2013-07-31 11:12:58 <3> app42(1047) [Interpreter] yast/i18n.rb:83 Loading
module 'Nfs' failed
+2013-07-31 11:12:58 <3> app42(1047) [libycp] Import.cc(import):97 No matching
component found

FAIL: Wrong stderr for Ext2MountPoint
See the diff above.
Running GetBaseName ...
FAIL: Wrong stderr for GetBaseName

The diff follows...

--- tests/GetBaseName.err 2013-01-22 11:16:18.000000000 +0100
+++ tmp.err.GetBaseName 2013-07-31 11:12:58.000000000 +0200
@@ -0,0 +1,2 @@
+2013-07-31 11:12:58 <3> app42(1073) [Interpreter] yast/i18n.rb:83 Loading
module 'Nfs' failed
+2013-07-31 11:12:58 <3> app42(1073) [libycp] Import.cc(import):97 No matching
component found

FAIL: Wrong stderr for GetBaseName
See the diff above.
Running GetCapacity ...
FAIL: Wrong stderr for GetCapacity

The diff follows...

--- tests/GetCapacity.err 2013-01-22 11:16:18.000000000 +0100
+++ tmp.err.GetCapacity 2013-07-31 11:12:59.000000000 +0200
@@ -0,0 +1,4 @@
+2013-07-31 11:12:58 <3> app42(1099) [Interpreter] yast/i18n.rb:83 Loading
module 'Nfs' failed
+2013-07-31 11:12:58 <3> app42(1099) [libycp] Import.cc(import):97 No matching
component found
+2013-07-31 11:12:58 <3> app42(1099) [Y2Ruby] binary/YRuby.cc(loadModule):148
Module /usr/share/YaST2/modules/Backup load failed:component cannot import
namespace 'Nfs' at /usr/lib64/ruby/vendor_ruby/1.9.1/yast/yast.rb:146:in
`import_pure'
+2013-07-31 11:12:58 <3> app42(1099) [Interpreter] yast/i18n.rb:83
Ruby::loadModule() / Can't load ruby module '/usr/share/YaST2/modules/Backup'

FAIL: Wrong stderr for GetCapacity
See the diff above.
Running GetListWithFlags ...
FAIL: Wrong stderr for GetListWithFlags

The diff follows...

--- tests/GetListWithFlags.err 2013-01-22 11:16:18.000000000 +0100
+++ tmp.err.GetListWithFlags 2013-07-31 11:12:59.000000000 +0200
@@ -0,0 +1,2 @@
+2013-07-31 11:12:59 <3> app42(1125) [Interpreter] yast/i18n.rb:83 Loading
module 'Nfs' failed
+2013-07-31 11:12:59 <3> app42(1125) [libycp] Import.cc(import):97 No matching
component found

FAIL: Wrong stderr for GetListWithFlags
See the diff above.
Running GetMountedFilesystems ...
FAIL: Wrong stderr for GetMountedFilesystems

The diff follows...

--- tests/GetMountedFilesystems.err 2013-01-22 11:16:18.000000000 +0100
+++ tmp.err.GetMountedFilesystems 2013-07-31 11:12:59.000000000 +0200
@@ -0,0 +1,2 @@
+2013-07-31 11:12:59 <3> app42(1151) [Interpreter] yast/i18n.rb:83 Loading
module 'Nfs' failed
+2013-07-31 11:12:59 <3> app42(1151) [libycp] Import.cc(import):97 No matching
component found

FAIL: Wrong stderr for GetMountedFilesystems
See the diff above.
Running MapFilesToString ...
FAIL: Wrong stderr for MapFilesToString

The diff follows...

--- tests/MapFilesToString.err 2013-01-22 11:16:18.000000000 +0100
+++ tmp.err.MapFilesToString 2013-07-31 11:13:00.000000000 +0200
@@ -0,0 +1,4 @@
+2013-07-31 11:13:00 <3> app42(1177) [Interpreter] yast/i18n.rb:83 Loading
module 'Nfs' failed
+2013-07-31 11:13:00 <3> app42(1177) [libycp] Import.cc(import):97 No matching
component found
+2013-07-31 11:13:00 <3> app42(1177) [Y2Ruby] binary/YRuby.cc(loadModule):148
Module /usr/share/YaST2/modules/Backup load failed:component cannot import
namespace 'Nfs' at /usr/lib64/ruby/vendor_ruby/1.9.1/yast/yast.rb:146:in
`import_pure'
+2013-07-31 11:13:00 <3> app42(1177) [Interpreter] yast/i18n.rb:83
Ruby::loadModule() / Can't load ruby module '/usr/share/YaST2/modules/Backup'

FAIL: Wrong stderr for MapFilesToString
See the diff above.
Running MediaList2UIList ...
FAIL: Wrong stderr for MediaList2UIList

The diff follows...

--- tests/MediaList2UIList.err 2013-01-22 11:16:18.000000000 +0100
+++ tmp.err.MediaList2UIList 2013-07-31 11:13:00.000000000 +0200
@@ -0,0 +1,2 @@
+2013-07-31 11:13:00 <3> app42(1203) [Interpreter] yast/i18n.rb:83 Loading
module 'Nfs' failed
+2013-07-31 11:13:00 <3> app42(1203) [libycp] Import.cc(import):97 No matching
component found

FAIL: Wrong stderr for MediaList2UIList
See the diff above.
Running ReadBackupProfiles ...
FAIL: Wrong stderr for ReadBackupProfiles

The diff follows...

--- tests/ReadBackupProfiles.err 2013-01-22 11:16:18.000000000 +0100
+++ tmp.err.ReadBackupProfiles 2013-07-31 11:13:01.000000000 +0200
@@ -0,0 +1,6 @@
+2013-07-31 11:13:01 <3> app42(1229) [Interpreter] yast/i18n.rb:83 Loading
module 'Nfs' failed
+2013-07-31 11:13:01 <3> app42(1229) [libycp] Import.cc(import):97 No matching
component found
+2013-07-31 11:13:01 <3> app42(1229) [Y2Ruby] binary/YRuby.cc(loadModule):148
Module /usr/share/YaST2/modules/Backup load failed:component cannot import
namespace 'Nfs' at /usr/lib64/ruby/vendor_ruby/1.9.1/yast/yast.rb:146:in
`import_pure'
+2013-07-31 11:13:01 <3> app42(1229) [Interpreter] yast/i18n.rb:83
Ruby::loadModule() / Can't load ruby module '/usr/share/YaST2/modules/Backup'
+2013-07-31 11:13:01 <3> app42(1229) [Interpreter] modules/FileUtils.rb:56
Argument (nil) to Read(...) is nil
+2013-07-31 11:13:01 <3> app42(1229) [Interpreter] modules/Backup.rb:1248
Argument (nil) to Read(...) is nil

FAIL: Wrong stderr for ReadBackupProfiles
See the diff above.
Running RestoreBackupProfile ...
FAIL: Wrong stderr for RestoreBackupProfile

The diff follows...

--- tests/RestoreBackupProfile.err 2013-01-22 11:16:18.000000000 +0100
+++ tmp.err.RestoreBackupProfile 2013-07-31 11:13:01.000000000 +0200
@@ -0,0 +1,6 @@
+2013-07-31 11:13:01 <3> app42(1255) [Interpreter] yast/i18n.rb:83 Loading
module 'Nfs' failed
+2013-07-31 11:13:01 <3> app42(1255) [libycp] Import.cc(import):97 No matching
component found
+2013-07-31 11:13:01 <3> app42(1255) [Y2Ruby] binary/YRuby.cc(loadModule):148
Module /usr/share/YaST2/modules/Backup load failed:component cannot import
namespace 'Nfs' at /usr/lib64/ruby/vendor_ruby/1.9.1/yast/yast.rb:146:in
`import_pure'
+2013-07-31 11:13:01 <3> app42(1255) [Interpreter] yast/i18n.rb:83
Ruby::loadModule() / Can't load ruby module '/usr/share/YaST2/modules/Backup'
+2013-07-31 11:13:01 <3> app42(1255) [Interpreter] modules/FileUtils.rb:56
Argument (nil) to Read(...) is nil
+2013-07-31 11:13:01 <3> app42(1255) [Interpreter] modules/Backup.rb:1248
Argument (nil) to Read(...) is nil

FAIL: Wrong stderr for RestoreBackupProfile
See the diff above.
Running RestoreBackupSettings ...
FAIL: Wrong stderr for RestoreBackupSettings

The diff follows...

--- tests/RestoreBackupSettings.err 2013-01-22 11:16:18.000000000 +0100
+++ tmp.err.RestoreBackupSettings 2013-07-31 11:13:02.000000000 +0200
@@ -0,0 +1,4 @@
+2013-07-31 11:13:02 <3> app42(1281) [Interpreter] yast/i18n.rb:83 Loading
module 'Nfs' failed
+2013-07-31 11:13:02 <3> app42(1281) [libycp] Import.cc(import):97 No matching
component found
+2013-07-31 11:13:02 <3> app42(1281) [Y2Ruby] binary/YRuby.cc(loadModule):148
Module /usr/share/YaST2/modules/Backup load failed:component cannot import
namespace 'Nfs' at /usr/lib64/ruby/vendor_ruby/1.9.1/yast/yast.rb:146:in
`import_pure'
+2013-07-31 11:13:02 <3> app42(1281) [Interpreter] yast/i18n.rb:83
Ruby::loadModule() / Can't load ruby module '/usr/share/YaST2/modules/Backup'

FAIL: Wrong stderr for RestoreBackupSettings
See the diff above.
Running WriteBackupProfiles ...
FAIL: Wrong stderr for WriteBackupProfiles

The diff follows...

--- tests/WriteBackupProfiles.err 2013-01-22 11:16:18.000000000 +0100
+++ tmp.err.WriteBackupProfiles 2013-07-31 11:13:02.000000000 +0200
@@ -0,0 +1,4 @@
+2013-07-31 11:13:02 <3> app42(1307) [Interpreter] yast/i18n.rb:83 Loading
module 'Nfs' failed
+2013-07-31 11:13:02 <3> app42(1307) [libycp] Import.cc(import):97 No matching
component found
+2013-07-31 11:13:02 <3> app42(1307) [Y2Ruby] binary/YRuby.cc(loadModule):148
Module /usr/share/YaST2/modules/Backup load failed:component cannot import
namespace 'Nfs' at /usr/lib64/ruby/vendor_ruby/1.9.1/yast/yast.rb:146:in
`import_pure'
+2013-07-31 11:13:02 <3> app42(1307) [Interpreter] yast/i18n.rb:83
Ruby::loadModule() / Can't load ruby module '/usr/share/YaST2/modules/Backup'

FAIL: Wrong stderr for WriteBackupProfiles
See the diff above.

Checking finished


=== yast2-backup Summary ===

# of unexpected failures 34
make[2]: *** [check-DEJAGNU] Error 1
make[2]: Leaving directory
`<http://river.suse.de/job/yast-backup-HEAD/ws/checkout/testsuite'>
make[1]: *** [check-am] Error 2
make[1]: Leaving directory
`<http://river.suse.de/job/yast-backup-HEAD/ws/checkout/testsuite'>
make: *** [check-recursive] Error 1
++ error_exit 2
++ echo 'ERROR: detected exitcode 2'
ERROR: detected exitcode 2
++ cleanup
++ echo '==> Running cleanup'
==> Running cleanup
++ rm -f
<http://river.suse.de/job/yast-backup-HEAD/ws/ICECC/40c0ab7e54f59a1e4e493c1ea90a882a.tar.gz>
++ footer_and_exit 1
++ '[' -z 1 ']'
++ MYEXIT=1
++ '[' 1 == 0 ']'
++ ascii_failed
++ cat

( )
( ) (
) _ )
( \_
_(_\ \)__
(____\___))

build failed

++ exit 1
Build step 'Execute shell' marked build as failure
--
To unsubscribe, e-mail: yast-devel+unsubscribe@xxxxxxxxxxxx
To contact the owner, e-mail: yast-devel+owner@xxxxxxxxxxxx

< Previous Next >
Follow Ups
References