Mailinglist Archive: yast-devel (251 mails)

< Previous Next >
[yast-devel] Build failed in Jenkins: yast-sysconfig-HEAD #125
  • From: hudson@xxxxxxx
  • Date: Wed, 31 Jul 2013 10:54:57 +0200 (CEST)
  • Message-id: <736737395.203.1375260897625.JavaMail.jenkins@river>
See <http://river.suse.de/job/yast-sysconfig-HEAD/125/changes>

Changes:

[yast-devel] YCP Killer: Unify YaST module structure

[yast-devel] YCP Killer: Apply changes needed for Ruby translation

[yast-devel] YCP Killer: Translate YCP files into Ruby

[yast-devel] YCP Killer: Regenerate Makefile.am files in all source directories

[yast-devel] version 3.0.0

------------------------------------------
[...truncated 145 lines...]
checking for a thread-safe mkdir -p... /usr/bin/mkdir -p
checking for gawk... gawk
checking whether make sets $(MAKE)... yes
checking how to create a ustar tar archive... gnutar
checking whether ln -s works... yes
checking whether make sets $(MAKE)... (cached) yes
checking for xgettext... /usr/bin/xgettext
checking for ycpdoc... /usr/lib/YaST2/bin/ycpdoc
checking for ycpmakedep... /usr/lib/YaST2/bin/ycpmakedep
checking for ycpc... /usr/bin/ycpc
checking for /usr/share/YaST2/data/testsuite/Makefile.testsuite... yes
checking that generated files are newer than configure... done
configure: creating ./config.status
config.status: creating Makefile
config.status: creating doc/autodocs/Makefile
config.status: creating doc/Makefile
config.status: creating src/Makefile
config.status: creating testsuite/Makefile
+ make
Making all in doc
make[1]: Entering directory
`<http://river.suse.de/job/yast-sysconfig-HEAD/ws/checkout/doc'>
Making all in autodocs
make[2]: Entering directory
`<http://river.suse.de/job/yast-sysconfig-HEAD/ws/checkout/doc/autodocs'>
make[2]: Nothing to be done for `all'.
make[2]: Leaving directory
`<http://river.suse.de/job/yast-sysconfig-HEAD/ws/checkout/doc/autodocs'>
make[2]: Entering directory
`<http://river.suse.de/job/yast-sysconfig-HEAD/ws/checkout/doc'>
make[2]: Nothing to be done for `all-am'.
make[2]: Leaving directory
`<http://river.suse.de/job/yast-sysconfig-HEAD/ws/checkout/doc'>
make[1]: Leaving directory
`<http://river.suse.de/job/yast-sysconfig-HEAD/ws/checkout/doc'>
Making all in src
make[1]: Entering directory
`<http://river.suse.de/job/yast-sysconfig-HEAD/ws/checkout/src'>
make[1]: Nothing to be done for `all'.
make[1]: Leaving directory
`<http://river.suse.de/job/yast-sysconfig-HEAD/ws/checkout/src'>
Making all in testsuite
make[1]: Entering directory
`<http://river.suse.de/job/yast-sysconfig-HEAD/ws/checkout/testsuite'>
make -f /usr/share/YaST2/data/testsuite/Makefile.testsuite
RPMNAME=yast2-sysconfig srcdir=.
make[2]: Entering directory
`<http://river.suse.de/job/yast-sysconfig-HEAD/ws/checkout/testsuite'>
make[2]: Nothing to be done for `all'.
make[2]: Leaving directory
`<http://river.suse.de/job/yast-sysconfig-HEAD/ws/checkout/testsuite'>
make[1]: Leaving directory
`<http://river.suse.de/job/yast-sysconfig-HEAD/ws/checkout/testsuite'>
make[1]: Entering directory
`<http://river.suse.de/job/yast-sysconfig-HEAD/ws/checkout'>
make[1]: Nothing to be done for `all-am'.
make[1]: Leaving directory
`<http://river.suse.de/job/yast-sysconfig-HEAD/ws/checkout'>
+ make check
Making check in doc
make[1]: Entering directory
`<http://river.suse.de/job/yast-sysconfig-HEAD/ws/checkout/doc'>
Making check in autodocs
make[2]: Entering directory
`<http://river.suse.de/job/yast-sysconfig-HEAD/ws/checkout/doc/autodocs'>
make[2]: Nothing to be done for `check'.
make[2]: Leaving directory
`<http://river.suse.de/job/yast-sysconfig-HEAD/ws/checkout/doc/autodocs'>
make[2]: Entering directory
`<http://river.suse.de/job/yast-sysconfig-HEAD/ws/checkout/doc'>
make[2]: Nothing to be done for `check-am'.
make[2]: Leaving directory
`<http://river.suse.de/job/yast-sysconfig-HEAD/ws/checkout/doc'>
make[1]: Leaving directory
`<http://river.suse.de/job/yast-sysconfig-HEAD/ws/checkout/doc'>
Making check in src
make[1]: Entering directory
`<http://river.suse.de/job/yast-sysconfig-HEAD/ws/checkout/src'>
make[1]: Nothing to be done for `check'.
make[1]: Leaving directory
`<http://river.suse.de/job/yast-sysconfig-HEAD/ws/checkout/src'>
Making check in testsuite
make[1]: Entering directory
`<http://river.suse.de/job/yast-sysconfig-HEAD/ws/checkout/testsuite'>
make -f /usr/share/YaST2/data/testsuite/Makefile.testsuite
RPMNAME=yast2-sysconfig srcdir=.
make[2]: Entering directory
`<http://river.suse.de/job/yast-sysconfig-HEAD/ws/checkout/testsuite'>
make[2]: Nothing to be done for `all'.
make[2]: Leaving directory
`<http://river.suse.de/job/yast-sysconfig-HEAD/ws/checkout/testsuite'>
make check-DEJAGNU check-local
make[2]: Entering directory
`<http://river.suse.de/job/yast-sysconfig-HEAD/ws/checkout/testsuite'>
Making a new site.exp file ...
srcdir='.'; export srcdir; \
EXPECT=expect; export EXPECT; \
runtest=runtest; \
if /bin/sh -c "$runtest --version" > /dev/null 2>&1; then \
exit_status=0; l='yast2-sysconfig'; for tool in $l; do \
if $runtest --tool $tool --srcdir $srcdir ; \
then :; else exit_status=1; fi; \
done; \
else echo "WARNING: could not find 'runtest'" 1>&2; :;\
fi; \
exit $exit_status
WARNING: Couldn't find tool init file
Test Run By root on Wed Jul 31 10:54:54 2013
Native configuration is x86_64-suse-linux-gnu

=== yast2-sysconfig tests ===

Schedule of variations:
unix

Running target unix
Using /usr/share/dejagnu/baseboards/unix.exp as board description file for
target.
Using /usr/share/dejagnu/config/unix.exp as generic interface file for target.
Using ./config/unix.exp as tool-and-target-specific interface file.
Running ./yast2-sysconfig.test/testsuite.exp ...

Checking started

Running Set_Export ...
FAIL: Wrong stderr for Set_Export

The diff follows...

--- tests/Set_Export.err 2013-01-22 12:13:49.000000000 +0100
+++ tmp.err.Set_Export 2013-07-31 10:54:55.000000000 +0200
@@ -0,0 +1,2 @@
+2013-07-31 10:54:55 <3> app42(24829) [Interpreter] modules/Testsuite.rb:42
Loading module 'Sysconfig' failed
+2013-07-31 10:54:55 <3> app42(24829) [libycp] Import.cc(import):97 No matching
component found

FAIL: Wrong stderr for Set_Export
See the diff above.
Running get_description ...
FAIL: Wrong stderr for get_description

The diff follows...

--- tests/get_description.err 2013-01-22 12:13:49.000000000 +0100
+++ tmp.err.get_description 2013-07-31 10:54:56.000000000 +0200
@@ -0,0 +1,2 @@
+2013-07-31 10:54:56 <3> app42(24855) [Interpreter] modules/Testsuite.rb:42
Loading module 'Sysconfig' failed
+2013-07-31 10:54:56 <3> app42(24855) [libycp] Import.cc(import):97 No matching
component found

FAIL: Wrong stderr for get_description
See the diff above.
Running get_file_from_id ...
FAIL: Wrong stderr for get_file_from_id

The diff follows...

--- tests/get_file_from_id.err 2013-01-22 12:13:49.000000000 +0100
+++ tmp.err.get_file_from_id 2013-07-31 10:54:56.000000000 +0200
@@ -0,0 +1,2 @@
+2013-07-31 10:54:56 <3> app42(24881) [Interpreter] modules/Testsuite.rb:42
Loading module 'Sysconfig' failed
+2013-07-31 10:54:56 <3> app42(24881) [libycp] Import.cc(import):97 No matching
component found

FAIL: Wrong stderr for get_file_from_id
See the diff above.
Running get_metadata ...
FAIL: Wrong stderr for get_metadata

The diff follows...

--- tests/get_metadata.err 2013-01-22 12:13:49.000000000 +0100
+++ tmp.err.get_metadata 2013-07-31 10:54:56.000000000 +0200
@@ -0,0 +1,2 @@
+2013-07-31 10:54:56 <3> app42(24907) [Interpreter] modules/Testsuite.rb:42
Loading module 'Sysconfig' failed
+2013-07-31 10:54:56 <3> app42(24907) [libycp] Import.cc(import):97 No matching
component found

FAIL: Wrong stderr for get_metadata
See the diff above.
Running get_name_from_id ...
FAIL: Wrong stderr for get_name_from_id

The diff follows...

--- tests/get_name_from_id.err 2013-01-22 12:13:49.000000000 +0100
+++ tmp.err.get_name_from_id 2013-07-31 10:54:56.000000000 +0200
@@ -0,0 +1,2 @@
+2013-07-31 10:54:56 <3> app42(24933) [Interpreter] modules/Testsuite.rb:42
Loading module 'Sysconfig' failed
+2013-07-31 10:54:56 <3> app42(24933) [libycp] Import.cc(import):97 No matching
component found

FAIL: Wrong stderr for get_name_from_id
See the diff above.
Running get_only_comment ...
FAIL: Wrong stderr for get_only_comment

The diff follows...

--- tests/get_only_comment.err 2013-01-22 12:13:49.000000000 +0100
+++ tmp.err.get_only_comment 2013-07-31 10:54:56.000000000 +0200
@@ -0,0 +1,2 @@
+2013-07-31 10:54:56 <3> app42(24959) [Interpreter] modules/Testsuite.rb:42
Loading module 'Sysconfig' failed
+2013-07-31 10:54:56 <3> app42(24959) [libycp] Import.cc(import):97 No matching
component found

FAIL: Wrong stderr for get_only_comment
See the diff above.
Running parse_metadata ...
FAIL: Wrong stderr for parse_metadata

The diff follows...

--- tests/parse_metadata.err 2013-01-22 12:13:49.000000000 +0100
+++ tmp.err.parse_metadata 2013-07-31 10:54:57.000000000 +0200
@@ -0,0 +1,2 @@
+2013-07-31 10:54:57 <3> app42(24985) [Interpreter] modules/Testsuite.rb:42
Loading module 'Sysconfig' failed
+2013-07-31 10:54:57 <3> app42(24985) [libycp] Import.cc(import):97 No matching
component found

FAIL: Wrong stderr for parse_metadata
See the diff above.
Running remove_whitespaces ...
FAIL: Wrong stderr for remove_whitespaces

The diff follows...

--- tests/remove_whitespaces.err 2013-01-22 12:13:49.000000000 +0100
+++ tmp.err.remove_whitespaces 2013-07-31 10:54:57.000000000 +0200
@@ -0,0 +1,2 @@
+2013-07-31 10:54:57 <3> app42(25011) [Interpreter] modules/Testsuite.rb:42
Loading module 'Sysconfig' failed
+2013-07-31 10:54:57 <3> app42(25011) [libycp] Import.cc(import):97 No matching
component found

FAIL: Wrong stderr for remove_whitespaces
See the diff above.
Running set_value ...
FAIL: Wrong stderr for set_value

The diff follows...

--- tests/set_value.err 2013-01-22 12:13:49.000000000 +0100
+++ tmp.err.set_value 2013-07-31 10:54:57.000000000 +0200
@@ -0,0 +1,2 @@
+2013-07-31 10:54:57 <3> app42(25037) [Interpreter] modules/Testsuite.rb:42
Loading module 'Sysconfig' failed
+2013-07-31 10:54:57 <3> app42(25037) [libycp] Import.cc(import):97 No matching
component found

FAIL: Wrong stderr for set_value
See the diff above.

Checking finished


=== yast2-sysconfig Summary ===

# of unexpected failures 18
make[2]: *** [check-DEJAGNU] Error 1
make[2]: Leaving directory
`<http://river.suse.de/job/yast-sysconfig-HEAD/ws/checkout/testsuite'>
make[1]: *** [check-am] Error 2
make[1]: Leaving directory
`<http://river.suse.de/job/yast-sysconfig-HEAD/ws/checkout/testsuite'>
make: *** [check-recursive] Error 1
++ error_exit 2
++ echo 'ERROR: detected exitcode 2'
ERROR: detected exitcode 2
++ cleanup
++ echo '==> Running cleanup'
==> Running cleanup
++ rm -f
<http://river.suse.de/job/yast-sysconfig-HEAD/ws/ICECC/40c0ab7e54f59a1e4e493c1ea90a882a.tar.gz>
++ footer_and_exit 1
++ '[' -z 1 ']'
++ MYEXIT=1
++ '[' 1 == 0 ']'
++ ascii_failed
++ cat

( )
( ) (
) _ )
( \_
_(_\ \)__
(____\___))

build failed

++ exit 1
Build step 'Execute shell' marked build as failure
--
To unsubscribe, e-mail: yast-devel+unsubscribe@xxxxxxxxxxxx
To contact the owner, e-mail: yast-devel+owner@xxxxxxxxxxxx

< Previous Next >
This Thread
Follow Ups
References