Mailinglist Archive: yast-devel (251 mails)

< Previous Next >
[yast-devel] Build failed in Jenkins: yast-snapper-HEAD #238
  • From: hudson@xxxxxxx
  • Date: Wed, 31 Jul 2013 10:47:16 +0200 (CEST)
  • Message-id: <619603452.192.1375260436824.JavaMail.jenkins@river>
See <http://river.suse.de/job/yast-snapper-HEAD/238/changes>

Changes:

[yast-devel] YCP Killer: Unify YaST module structure

[yast-devel] YCP Killer: Apply changes needed for Ruby translation

[yast-devel] YCP Killer: Translate YCP files into Ruby

[yast-devel] YCP Killer: Regenerate Makefile.am files in all source directories

[yast-devel] version 3.0.0

------------------------------------------
[...truncated 250 lines...]
checking for size_t... yes
checking for working alloca.h... yes
checking for alloca... yes
checking for ANSI C header files... (cached) yes
checking that generated files are newer than configure... done
configure: creating ./config.status
config.status: creating Makefile
config.status: creating agent-snapper/conf/Makefile
config.status: creating agent-snapper/doc/autodocs/Makefile
config.status: creating agent-snapper/doc/Makefile
config.status: creating agent-snapper/src/Makefile
config.status: creating agent-snapper/Makefile
config.status: creating doc/autodocs/Makefile
config.status: creating doc/Makefile
config.status: creating src/Makefile
config.status: creating testsuite/Makefile
config.status: creating config.h
config.status: config.h is unchanged
config.status: executing depfiles commands
config.status: executing libtool commands
+ make
make all-recursive
make[1]: Entering directory
`<http://river.suse.de/job/yast-snapper-HEAD/ws/checkout'>
Making all in agent-snapper
make[2]: Entering directory
`<http://river.suse.de/job/yast-snapper-HEAD/ws/checkout/agent-snapper'>
Making all in conf
make[3]: Entering directory
`<http://river.suse.de/job/yast-snapper-HEAD/ws/checkout/agent-snapper/conf'>
make[3]: Nothing to be done for `all'.
make[3]: Leaving directory
`<http://river.suse.de/job/yast-snapper-HEAD/ws/checkout/agent-snapper/conf'>
Making all in doc
make[3]: Entering directory
`<http://river.suse.de/job/yast-snapper-HEAD/ws/checkout/agent-snapper/doc'>
Making all in autodocs
make[4]: Entering directory
`<http://river.suse.de/job/yast-snapper-HEAD/ws/checkout/agent-snapper/doc/autodocs'>
make[4]: Nothing to be done for `all'.
make[4]: Leaving directory
`<http://river.suse.de/job/yast-snapper-HEAD/ws/checkout/agent-snapper/doc/autodocs'>
make[4]: Entering directory
`<http://river.suse.de/job/yast-snapper-HEAD/ws/checkout/agent-snapper/doc'>
make[4]: Nothing to be done for `all-am'.
make[4]: Leaving directory
`<http://river.suse.de/job/yast-snapper-HEAD/ws/checkout/agent-snapper/doc'>
make[3]: Leaving directory
`<http://river.suse.de/job/yast-snapper-HEAD/ws/checkout/agent-snapper/doc'>
Making all in src
make[3]: Entering directory
`<http://river.suse.de/job/yast-snapper-HEAD/ws/checkout/agent-snapper/src'>
make[3]: Nothing to be done for `all'.
make[3]: Leaving directory
`<http://river.suse.de/job/yast-snapper-HEAD/ws/checkout/agent-snapper/src'>
make[3]: Entering directory
`<http://river.suse.de/job/yast-snapper-HEAD/ws/checkout/agent-snapper'>
make[3]: Nothing to be done for `all-am'.
make[3]: Leaving directory
`<http://river.suse.de/job/yast-snapper-HEAD/ws/checkout/agent-snapper'>
make[2]: Leaving directory
`<http://river.suse.de/job/yast-snapper-HEAD/ws/checkout/agent-snapper'>
Making all in doc
make[2]: Entering directory
`<http://river.suse.de/job/yast-snapper-HEAD/ws/checkout/doc'>
Making all in autodocs
make[3]: Entering directory
`<http://river.suse.de/job/yast-snapper-HEAD/ws/checkout/doc/autodocs'>
make[3]: Nothing to be done for `all'.
make[3]: Leaving directory
`<http://river.suse.de/job/yast-snapper-HEAD/ws/checkout/doc/autodocs'>
make[3]: Entering directory
`<http://river.suse.de/job/yast-snapper-HEAD/ws/checkout/doc'>
make[3]: Nothing to be done for `all-am'.
make[3]: Leaving directory
`<http://river.suse.de/job/yast-snapper-HEAD/ws/checkout/doc'>
make[2]: Leaving directory
`<http://river.suse.de/job/yast-snapper-HEAD/ws/checkout/doc'>
Making all in src
make[2]: Entering directory
`<http://river.suse.de/job/yast-snapper-HEAD/ws/checkout/src'>
make[2]: Nothing to be done for `all'.
make[2]: Leaving directory
`<http://river.suse.de/job/yast-snapper-HEAD/ws/checkout/src'>
Making all in testsuite
make[2]: Entering directory
`<http://river.suse.de/job/yast-snapper-HEAD/ws/checkout/testsuite'>
make -f /usr/share/YaST2/data/testsuite/Makefile.testsuite
RPMNAME=yast2-snapper srcdir=.
make[3]: Entering directory
`<http://river.suse.de/job/yast-snapper-HEAD/ws/checkout/testsuite'>
make[3]: Nothing to be done for `all'.
make[3]: Leaving directory
`<http://river.suse.de/job/yast-snapper-HEAD/ws/checkout/testsuite'>
make[2]: Leaving directory
`<http://river.suse.de/job/yast-snapper-HEAD/ws/checkout/testsuite'>
make[2]: Entering directory
`<http://river.suse.de/job/yast-snapper-HEAD/ws/checkout'>
make[2]: Leaving directory
`<http://river.suse.de/job/yast-snapper-HEAD/ws/checkout'>
make[1]: Leaving directory
`<http://river.suse.de/job/yast-snapper-HEAD/ws/checkout'>
+ make check
Making check in agent-snapper
make[1]: Entering directory
`<http://river.suse.de/job/yast-snapper-HEAD/ws/checkout/agent-snapper'>
Making check in conf
make[2]: Entering directory
`<http://river.suse.de/job/yast-snapper-HEAD/ws/checkout/agent-snapper/conf'>
make[2]: Nothing to be done for `check'.
make[2]: Leaving directory
`<http://river.suse.de/job/yast-snapper-HEAD/ws/checkout/agent-snapper/conf'>
Making check in doc
make[2]: Entering directory
`<http://river.suse.de/job/yast-snapper-HEAD/ws/checkout/agent-snapper/doc'>
Making check in autodocs
make[3]: Entering directory
`<http://river.suse.de/job/yast-snapper-HEAD/ws/checkout/agent-snapper/doc/autodocs'>
make[3]: Nothing to be done for `check'.
make[3]: Leaving directory
`<http://river.suse.de/job/yast-snapper-HEAD/ws/checkout/agent-snapper/doc/autodocs'>
make[3]: Entering directory
`<http://river.suse.de/job/yast-snapper-HEAD/ws/checkout/agent-snapper/doc'>
make[3]: Nothing to be done for `check-am'.
make[3]: Leaving directory
`<http://river.suse.de/job/yast-snapper-HEAD/ws/checkout/agent-snapper/doc'>
make[2]: Leaving directory
`<http://river.suse.de/job/yast-snapper-HEAD/ws/checkout/agent-snapper/doc'>
Making check in src
make[2]: Entering directory
`<http://river.suse.de/job/yast-snapper-HEAD/ws/checkout/agent-snapper/src'>
make[2]: Nothing to be done for `check'.
make[2]: Leaving directory
`<http://river.suse.de/job/yast-snapper-HEAD/ws/checkout/agent-snapper/src'>
make[2]: Entering directory
`<http://river.suse.de/job/yast-snapper-HEAD/ws/checkout/agent-snapper'>
make[2]: Nothing to be done for `check-am'.
make[2]: Leaving directory
`<http://river.suse.de/job/yast-snapper-HEAD/ws/checkout/agent-snapper'>
make[1]: Leaving directory
`<http://river.suse.de/job/yast-snapper-HEAD/ws/checkout/agent-snapper'>
Making check in doc
make[1]: Entering directory
`<http://river.suse.de/job/yast-snapper-HEAD/ws/checkout/doc'>
Making check in autodocs
make[2]: Entering directory
`<http://river.suse.de/job/yast-snapper-HEAD/ws/checkout/doc/autodocs'>
make[2]: Nothing to be done for `check'.
make[2]: Leaving directory
`<http://river.suse.de/job/yast-snapper-HEAD/ws/checkout/doc/autodocs'>
make[2]: Entering directory
`<http://river.suse.de/job/yast-snapper-HEAD/ws/checkout/doc'>
make[2]: Nothing to be done for `check-am'.
make[2]: Leaving directory
`<http://river.suse.de/job/yast-snapper-HEAD/ws/checkout/doc'>
make[1]: Leaving directory
`<http://river.suse.de/job/yast-snapper-HEAD/ws/checkout/doc'>
Making check in src
make[1]: Entering directory
`<http://river.suse.de/job/yast-snapper-HEAD/ws/checkout/src'>
make[1]: Nothing to be done for `check'.
make[1]: Leaving directory
`<http://river.suse.de/job/yast-snapper-HEAD/ws/checkout/src'>
Making check in testsuite
make[1]: Entering directory
`<http://river.suse.de/job/yast-snapper-HEAD/ws/checkout/testsuite'>
make -f /usr/share/YaST2/data/testsuite/Makefile.testsuite
RPMNAME=yast2-snapper srcdir=.
make[2]: Entering directory
`<http://river.suse.de/job/yast-snapper-HEAD/ws/checkout/testsuite'>
make[2]: Nothing to be done for `all'.
make[2]: Leaving directory
`<http://river.suse.de/job/yast-snapper-HEAD/ws/checkout/testsuite'>
make check-DEJAGNU check-local
make[2]: Entering directory
`<http://river.suse.de/job/yast-snapper-HEAD/ws/checkout/testsuite'>
Making a new site.exp file ...
srcdir='.'; export srcdir; \
EXPECT=expect; export EXPECT; \
runtest=runtest; \
if /bin/sh -c "$runtest --version" > /dev/null 2>&1; then \
exit_status=0; l='yast2-snapper'; for tool in $l; do \
if $runtest --tool $tool --srcdir $srcdir ; \
then :; else exit_status=1; fi; \
done; \
else echo "WARNING: could not find 'runtest'" 1>&2; :;\
fi; \
exit $exit_status
WARNING: Couldn't find tool init file
Test Run By root on Wed Jul 31 10:47:15 2013
Native configuration is x86_64-suse-linux-gnu

=== yast2-snapper tests ===

Schedule of variations:
unix

Running target unix
Using /usr/share/dejagnu/baseboards/unix.exp as board description file for
target.
Using /usr/share/dejagnu/config/unix.exp as generic interface file for target.
Using ./config/unix.exp as tool-and-target-specific interface file.
Running ./yast2-snapper.test/testsuite.exp ...

Checking started

Running GetFileMode ...
FAIL: Wrong stderr for GetFileMode

The diff follows...

--- tests/GetFileMode.err 2013-01-22 12:09:18.000000000 +0100
+++ tmp.err.GetFileMode 2013-07-31 10:47:15.000000000 +0200
@@ -0,0 +1,2 @@
+2013-07-31 10:47:15 <3> app42(7712) [Interpreter] :0 Loading module 'Snapper'
failed
+2013-07-31 10:47:15 <3> app42(7712) [libycp] Import.cc(import):97 No matching
component found

FAIL: Wrong stderr for GetFileMode
See the diff above.
Running GetFileModification ...
FAIL: Wrong stderr for GetFileModification

The diff follows...

--- tests/GetFileModification.err 2013-01-22 12:09:18.000000000 +0100
+++ tmp.err.GetFileModification 2013-07-31 10:47:16.000000000 +0200
@@ -0,0 +1,2 @@
+2013-07-31 10:47:16 <3> app42(7738) [Interpreter] :0 Loading module 'Snapper'
failed
+2013-07-31 10:47:16 <3> app42(7738) [libycp] Import.cc(import):97 No matching
component found

FAIL: Wrong stderr for GetFileModification
See the diff above.
Running GetSnapshotPath ...
FAIL: Wrong stderr for GetSnapshotPath

The diff follows...

--- tests/GetSnapshotPath.err 2013-01-22 12:09:18.000000000 +0100
+++ tmp.err.GetSnapshotPath 2013-07-31 10:47:16.000000000 +0200
@@ -0,0 +1,2 @@
+2013-07-31 10:47:16 <3> app42(7764) [Interpreter] :0 Loading module 'Snapper'
failed
+2013-07-31 10:47:16 <3> app42(7764) [libycp] Import.cc(import):97 No matching
component found

FAIL: Wrong stderr for GetSnapshotPath
See the diff above.
Running ReadConfigs ...
FAIL: Wrong stderr for ReadConfigs

The diff follows...

--- tests/ReadConfigs.err 2013-01-22 12:09:18.000000000 +0100
+++ tmp.err.ReadConfigs 2013-07-31 10:47:16.000000000 +0200
@@ -0,0 +1,2 @@
+2013-07-31 10:47:16 <3> app42(7790) [Interpreter] modules/Testsuite.rb:42
Loading module 'Snapper' failed
+2013-07-31 10:47:16 <3> app42(7790) [libycp] Import.cc(import):97 No matching
component found

FAIL: Wrong stderr for ReadConfigs
See the diff above.
Running ReadSnapshots ...
FAIL: Wrong stderr for ReadSnapshots

The diff follows...

--- tests/ReadSnapshots.err 2013-01-22 12:09:18.000000000 +0100
+++ tmp.err.ReadSnapshots 2013-07-31 10:47:16.000000000 +0200
@@ -0,0 +1,2 @@
+2013-07-31 10:47:16 <3> app42(7816) [Interpreter] modules/Testsuite.rb:42
Loading module 'Snapper' failed
+2013-07-31 10:47:16 <3> app42(7816) [libycp] Import.cc(import):97 No matching
component found

FAIL: Wrong stderr for ReadSnapshots
See the diff above.

Checking finished


=== yast2-snapper Summary ===

# of unexpected failures 10
make[2]: *** [check-DEJAGNU] Error 1
make[2]: Leaving directory
`<http://river.suse.de/job/yast-snapper-HEAD/ws/checkout/testsuite'>
make[1]: *** [check-am] Error 2
make[1]: Leaving directory
`<http://river.suse.de/job/yast-snapper-HEAD/ws/checkout/testsuite'>
make: *** [check-recursive] Error 1
++ error_exit 2
++ echo 'ERROR: detected exitcode 2'
ERROR: detected exitcode 2
++ cleanup
++ echo '==> Running cleanup'
==> Running cleanup
++ rm -f
<http://river.suse.de/job/yast-snapper-HEAD/ws/ICECC/40c0ab7e54f59a1e4e493c1ea90a882a.tar.gz>
++ footer_and_exit 1
++ '[' -z 1 ']'
++ MYEXIT=1
++ '[' 1 == 0 ']'
++ ascii_failed
++ cat

( )
( ) (
) _ )
( \_
_(_\ \)__
(____\___))

build failed

++ exit 1
Build step 'Execute shell' marked build as failure
--
To unsubscribe, e-mail: yast-devel+unsubscribe@xxxxxxxxxxxx
To contact the owner, e-mail: yast-devel+owner@xxxxxxxxxxxx

< Previous Next >
This Thread
Follow Ups
References