Mailinglist Archive: yast-devel (251 mails)

< Previous Next >
[yast-devel] Build failed in Jenkins: yast-runlevel-HEAD #129
  • From: hudson@xxxxxxx
  • Date: Wed, 31 Jul 2013 10:45:02 +0200 (CEST)
  • Message-id: <2107681537.190.1375260302260.JavaMail.jenkins@river>
See <http://river.suse.de/job/yast-runlevel-HEAD/129/changes>

Changes:

[yast-devel] YCP Killer: Unify YaST module structure

[yast-devel] YCP Killer: Apply changes needed for Ruby translation

[yast-devel] YCP Killer: Translate YCP files into Ruby

[yast-devel] YCP Killer: Regenerate Makefile.am files in all source directories

[yast-devel] version 3.0.0

------------------------------------------
[...truncated 217 lines...]
if $runtest --tool $tool --srcdir $srcdir ; \
then :; else exit_status=1; fi; \
done; \
else echo "WARNING: could not find 'runtest'" 1>&2; :;\
fi; \
exit $exit_status
WARNING: Couldn't find tool init file
Test Run By root on Wed Jul 31 10:44:58 2013
Native configuration is x86_64-suse-linux-gnu

=== yast2-runlevel tests ===

Schedule of variations:
unix

Running target unix
Using /usr/share/dejagnu/baseboards/unix.exp as board description file for
target.
Using /usr/share/dejagnu/config/unix.exp as generic interface file for target.
Using ./config/unix.exp as tool-and-target-specific interface file.
Running ./yast2-runlevel.test/testsuite.exp ...

Checking started

Running Filters ...
FAIL: Wrong stderr for Filters

The diff follows...

--- tests/Filters.err 2013-01-22 11:51:49.000000000 +0100
+++ tmp.err.Filters 2013-07-31 10:44:59.000000000 +0200
@@ -0,0 +1,2 @@
+2013-07-31 10:44:59 <3> app42(23880) [Interpreter] modules/Testsuite.rb:42
Loading module 'RunlevelEd' failed
+2013-07-31 10:44:59 <3> app42(23880) [libycp] Import.cc(import):97 No matching
component found

FAIL: Wrong stderr for Filters
See the diff above.
Running RunlevelEd ...
FAIL: Wrong stderr for RunlevelEd

The diff follows...

--- tests/RunlevelEd.err 2013-01-22 11:51:49.000000000 +0100
+++ tmp.err.RunlevelEd 2013-07-31 10:44:59.000000000 +0200
@@ -0,0 +1,2 @@
+2013-07-31 10:44:59 <3> app42(23906) [Interpreter] modules/Testsuite.rb:42
Loading module 'RunlevelEd' failed
+2013-07-31 10:44:59 <3> app42(23906) [libycp] Import.cc(import):97 No matching
component found

FAIL: Wrong stderr for RunlevelEd
See the diff above.
Running ServiceDependencies ...
FAIL: Wrong stderr for ServiceDependencies

The diff follows...

--- tests/ServiceDependencies.err 2013-01-22 11:51:49.000000000 +0100
+++ tmp.err.ServiceDependencies 2013-07-31 10:44:59.000000000 +0200
@@ -0,0 +1,2 @@
+2013-07-31 10:44:59 <3> app42(23932) [Interpreter] modules/Testsuite.rb:42
Loading module 'RunlevelEd' failed
+2013-07-31 10:44:59 <3> app42(23932) [libycp] Import.cc(import):97 No matching
component found

FAIL: Wrong stderr for ServiceDependencies
See the diff above.
Running dirtyServices ...
FAIL: Wrong stderr for dirtyServices

The diff follows...

--- tests/dirtyServices.err 2013-01-22 11:51:49.000000000 +0100
+++ tmp.err.dirtyServices 2013-07-31 10:45:00.000000000 +0200
@@ -0,0 +1,2 @@
+2013-07-31 10:45:00 <3> app42(23958) [Interpreter] modules/Testsuite.rb:42
Loading module 'RunlevelEd' failed
+2013-07-31 10:45:00 <3> app42(23958) [libycp] Import.cc(import):97 No matching
component found

FAIL: Wrong stderr for dirtyServices
See the diff above.
Running formatLine ...
FAIL: Wrong stdout for formatLine

The diff follows...

--- tests/formatLine.out 2013-01-22 11:51:49.000000000 +0100
+++ tmp.out.formatLine 2013-07-31 10:45:00.000000000 +0200
@@ -1,3 +0,0 @@
-Dump [" a"]
-Dump [" a, b, c, d, e"]
-Dump [" a, b, c, d, e,", " f, g, h, i, j,", " k, l"]

FAIL: Wrong stdout for formatLine
See the diff above.
Running getDefaultPicker ...
FAIL: Wrong stderr for getDefaultPicker

The diff follows...

--- tests/getDefaultPicker.err 2013-01-22 11:51:49.000000000 +0100
+++ tmp.err.getDefaultPicker 2013-07-31 10:45:00.000000000 +0200
@@ -0,0 +1,2 @@
+2013-07-31 10:45:00 <3> app42(24010) [Interpreter] modules/Testsuite.rb:42
Loading module 'RunlevelEd' failed
+2013-07-31 10:45:00 <3> app42(24010) [libycp] Import.cc(import):97 No matching
component found

FAIL: Wrong stderr for getDefaultPicker
See the diff above.
Running getRunlevelDescr ...
FAIL: Wrong stderr for getRunlevelDescr

The diff follows...

--- tests/getRunlevelDescr.err 2013-01-22 11:51:49.000000000 +0100
+++ tmp.err.getRunlevelDescr 2013-07-31 10:45:00.000000000 +0200
@@ -0,0 +1,2 @@
+2013-07-31 10:45:00 <3> app42(24036) [Interpreter] modules/Testsuite.rb:42
Loading module 'RunlevelEd' failed
+2013-07-31 10:45:00 <3> app42(24036) [libycp] Import.cc(import):97 No matching
component found

FAIL: Wrong stderr for getRunlevelDescr
See the diff above.
Running getScripts ...
FAIL: Wrong stderr for getScripts

The diff follows...

--- tests/getScripts.err 2013-01-22 11:51:49.000000000 +0100
+++ tmp.err.getScripts 2013-07-31 10:45:00.000000000 +0200
@@ -0,0 +1,2 @@
+2013-07-31 10:45:00 <3> app42(24062) [Interpreter] modules/Testsuite.rb:42
Loading module 'RunlevelEd' failed
+2013-07-31 10:45:00 <3> app42(24062) [libycp] Import.cc(import):97 No matching
component found

FAIL: Wrong stderr for getScripts
See the diff above.
Running isDisabled ...
FAIL: Wrong stderr for isDisabled

The diff follows...

--- tests/isDisabled.err 2013-01-22 11:51:49.000000000 +0100
+++ tmp.err.isDisabled 2013-07-31 10:45:01.000000000 +0200
@@ -0,0 +1,2 @@
+2013-07-31 10:45:01 <3> app42(24088) [Interpreter] modules/Testsuite.rb:42
Loading module 'RunlevelEd' failed
+2013-07-31 10:45:01 <3> app42(24088) [libycp] Import.cc(import):97 No matching
component found

FAIL: Wrong stderr for isDisabled
See the diff above.
Running overviewText ...
FAIL: Wrong stderr for overviewText

The diff follows...

--- tests/overviewText.err 2013-01-22 11:51:49.000000000 +0100
+++ tmp.err.overviewText 2013-07-31 10:45:01.000000000 +0200
@@ -0,0 +1,2 @@
+2013-07-31 10:45:01 <3> app42(24114) [Interpreter] modules/Testsuite.rb:42
Loading module 'RunlevelEd' failed
+2013-07-31 10:45:01 <3> app42(24114) [libycp] Import.cc(import):97 No matching
component found

FAIL: Wrong stderr for overviewText
See the diff above.
Running saveServices ...
FAIL: Wrong stderr for saveServices

The diff follows...

--- tests/saveServices.err 2013-01-22 11:51:49.000000000 +0100
+++ tmp.err.saveServices 2013-07-31 10:45:01.000000000 +0200
@@ -0,0 +1,2 @@
+2013-07-31 10:45:01 <3> app42(24140) [Interpreter] modules/Testsuite.rb:42
Loading module 'RunlevelEd' failed
+2013-07-31 10:45:01 <3> app42(24140) [libycp] Import.cc(import):97 No matching
component found

FAIL: Wrong stderr for saveServices
See the diff above.
Running servicesToTable ...
FAIL: Wrong stderr for servicesToTable

The diff follows...

--- tests/servicesToTable.err 2013-01-22 11:51:49.000000000 +0100
+++ tmp.err.servicesToTable 2013-07-31 10:45:01.000000000 +0200
@@ -0,0 +1,2 @@
+2013-07-31 10:45:01 <3> app42(24167) [Interpreter] modules/Testsuite.rb:42
Loading module 'RunlevelEd' failed
+2013-07-31 10:45:01 <3> app42(24167) [libycp] Import.cc(import):97 No matching
component found

FAIL: Wrong stderr for servicesToTable
See the diff above.
Running setServiceToDefault ...
FAIL: Wrong stdout for setServiceToDefault

The diff follows...

--- tests/setServiceToDefault.out 2013-01-22 11:51:49.000000000 +0100
+++ tmp.out.setServiceToDefault 2013-07-31 10:45:01.000000000 +0200
@@ -1 +0,0 @@
-Dump $["a":$["defstart":["3", "4"], "dirty":true, "start":["3", "4"]]]

FAIL: Wrong stdout for setServiceToDefault
See the diff above.
Running toposort ...
FAIL: Wrong stdout for toposort

The diff follows...

--- tests/toposort.out 2013-01-22 11:51:49.000000000 +0100
+++ tmp.out.toposort 2013-07-31 10:45:01.000000000 +0200
@@ -1,9 +0,0 @@
-Dump TopologicalSort
-Dump [[], []]
-Log Cyclic subgraph found, remainder has 1 nodes: ["v1"]
-Dump [[], ["v1"]]
-Dump [["v1", "v10", "v5", "v7", "v8", "v2", "v9", "v3", "v4", "v6"], []]
-Dump ReachableSubgraph
-Dump $["v1":["v2", "v3"], "v2":["v3", "v4"], "v3":["v6"], "v4":["v6"],
"v6":[]]
-Dump ReverseGraph
-Dump $["v1":[], "v10":[], "v2":["v1"], "v3":["v1", "v2"], "v4":["v2", "v5"],
"v5":[], "v6":["v3", "v4", "v7"], "v7":[], "v8":[], "v9":["v8"]]

FAIL: Wrong stdout for toposort
See the diff above.

Checking finished


=== yast2-runlevel Summary ===

# of unexpected failures 28
make[2]: *** [check-DEJAGNU] Error 1
make[2]: Leaving directory
`<http://river.suse.de/job/yast-runlevel-HEAD/ws/checkout/testsuite'>
make[1]: *** [check-am] Error 2
make[1]: Leaving directory
`<http://river.suse.de/job/yast-runlevel-HEAD/ws/checkout/testsuite'>
make: *** [check-recursive] Error 1
++ error_exit 2
++ echo 'ERROR: detected exitcode 2'
ERROR: detected exitcode 2
++ cleanup
++ echo '==> Running cleanup'
==> Running cleanup
++ rm -f
<http://river.suse.de/job/yast-runlevel-HEAD/ws/ICECC/40c0ab7e54f59a1e4e493c1ea90a882a.tar.gz>
++ footer_and_exit 1
++ '[' -z 1 ']'
++ MYEXIT=1
++ '[' 1 == 0 ']'
++ ascii_failed
++ cat

( )
( ) (
) _ )
( \_
_(_\ \)__
(____\___))

build failed

++ exit 1
Build step 'Execute shell' marked build as failure
--
To unsubscribe, e-mail: yast-devel+unsubscribe@xxxxxxxxxxxx
To contact the owner, e-mail: yast-devel+owner@xxxxxxxxxxxx

< Previous Next >
This Thread
Follow Ups
References