Mailinglist Archive: yast-devel (251 mails)

< Previous Next >
[yast-devel] Build failed in Jenkins: yast-ldap-client-HEAD #384
  • From: hudson@xxxxxxx
  • Date: Wed, 31 Jul 2013 10:30:33 +0200 (CEST)
  • Message-id: <1017629944.180.1375259433307.JavaMail.jenkins@river>
See <http://river.suse.de/job/yast-ldap-client-HEAD/384/changes>

Changes:

[yast-devel] YCP Killer: Unify YaST module structure

[yast-devel] YCP Killer: Apply changes needed for Ruby translation

[yast-devel] YCP Killer: Translate YCP files into Ruby

[yast-devel] YCP Killer: Regenerate Makefile.am files in all source directories

------------------------------------------
[...truncated 179 lines...]
make[1]: Leaving directory
`<http://river.suse.de/job/yast-ldap-client-HEAD/ws/checkout/testsuite'>
make[1]: Entering directory
`<http://river.suse.de/job/yast-ldap-client-HEAD/ws/checkout'>
make[1]: Nothing to be done for `all-am'.
make[1]: Leaving directory
`<http://river.suse.de/job/yast-ldap-client-HEAD/ws/checkout'>
+ make check
Making check in doc
make[1]: Entering directory
`<http://river.suse.de/job/yast-ldap-client-HEAD/ws/checkout/doc'>
Making check in autodocs
make[2]: Entering directory
`<http://river.suse.de/job/yast-ldap-client-HEAD/ws/checkout/doc/autodocs'>
make[2]: Nothing to be done for `check'.
make[2]: Leaving directory
`<http://river.suse.de/job/yast-ldap-client-HEAD/ws/checkout/doc/autodocs'>
make[2]: Entering directory
`<http://river.suse.de/job/yast-ldap-client-HEAD/ws/checkout/doc'>
make[2]: Nothing to be done for `check-am'.
make[2]: Leaving directory
`<http://river.suse.de/job/yast-ldap-client-HEAD/ws/checkout/doc'>
make[1]: Leaving directory
`<http://river.suse.de/job/yast-ldap-client-HEAD/ws/checkout/doc'>
Making check in src
make[1]: Entering directory
`<http://river.suse.de/job/yast-ldap-client-HEAD/ws/checkout/src'>
make[1]: Nothing to be done for `check'.
make[1]: Leaving directory
`<http://river.suse.de/job/yast-ldap-client-HEAD/ws/checkout/src'>
Making check in testsuite
make[1]: Entering directory
`<http://river.suse.de/job/yast-ldap-client-HEAD/ws/checkout/testsuite'>
make -f /usr/share/YaST2/data/testsuite/Makefile.testsuite
RPMNAME=yast2-ldap-client srcdir=.
make[2]: Entering directory
`<http://river.suse.de/job/yast-ldap-client-HEAD/ws/checkout/testsuite'>
make[2]: Nothing to be done for `all'.
make[2]: Leaving directory
`<http://river.suse.de/job/yast-ldap-client-HEAD/ws/checkout/testsuite'>
make check-DEJAGNU check-local
make[2]: Entering directory
`<http://river.suse.de/job/yast-ldap-client-HEAD/ws/checkout/testsuite'>
Making a new site.exp file ...
srcdir='.'; export srcdir; \
EXPECT=expect; export EXPECT; \
runtest=runtest; \
if /bin/sh -c "$runtest --version" > /dev/null 2>&1; then \
exit_status=0; l='yast2-ldap-client'; for tool in $l; do \
if $runtest --tool $tool --srcdir $srcdir ; \
then :; else exit_status=1; fi; \
done; \
else echo "WARNING: could not find 'runtest'" 1>&2; :;\
fi; \
exit $exit_status
WARNING: Couldn't find tool init file
Test Run By root on Wed Jul 31 10:30:30 2013
Native configuration is x86_64-suse-linux-gnu

=== yast2-ldap-client tests ===

Schedule of variations:
unix

Running target unix
Using /usr/share/dejagnu/baseboards/unix.exp as board description file for
target.
Using /usr/share/dejagnu/config/unix.exp as generic interface file for target.
Using ./config/unix.exp as tool-and-target-specific interface file.
Running ./yast2-ldap-client.test/testsuite.exp ...

Checking started

Running ConvertDefaultValues ...
FAIL: Wrong stderr for ConvertDefaultValues

The diff follows...

--- tests/ConvertDefaultValues.err 2013-01-22 11:26:37.000000000 +0100
+++ tmp.err.ConvertDefaultValues 2013-07-31 10:30:31.000000000 +0200
@@ -0,0 +1,2 @@
+2013-07-31 10:30:31 <3> app42(13013) [Interpreter] modules/Testsuite.rb:42
Loading module 'Ldap' failed
+2013-07-31 10:30:31 <3> app42(13013) [libycp] Import.cc(import):97 No matching
component found

FAIL: Wrong stderr for ConvertDefaultValues
See the diff above.
Running Export ...
FAIL: Wrong stderr for Export

The diff follows...

--- tests/Export.err 2013-01-22 11:26:37.000000000 +0100
+++ tmp.err.Export 2013-07-31 10:30:31.000000000 +0200
@@ -0,0 +1,2 @@
+2013-07-31 10:30:31 <3> app42(13039) [Interpreter] modules/Testsuite.rb:42
Loading module 'Ldap' failed
+2013-07-31 10:30:31 <3> app42(13039) [libycp] Import.cc(import):97 No matching
component found

FAIL: Wrong stderr for Export
See the diff above.
Running Export2 ...
FAIL: Wrong stderr for Export2

The diff follows...

--- tests/Export2.err 2013-01-22 11:26:37.000000000 +0100
+++ tmp.err.Export2 2013-07-31 10:30:31.000000000 +0200
@@ -0,0 +1,2 @@
+2013-07-31 10:30:31 <3> app42(13065) [Interpreter] modules/Testsuite.rb:42
Loading module 'Ldap' failed
+2013-07-31 10:30:31 <3> app42(13065) [libycp] Import.cc(import):97 No matching
component found

FAIL: Wrong stderr for Export2
See the diff above.
Running Export3 ...
FAIL: Wrong stderr for Export3

The diff follows...

--- tests/Export3.err 2013-01-22 11:26:37.000000000 +0100
+++ tmp.err.Export3 2013-07-31 10:30:31.000000000 +0200
@@ -0,0 +1,2 @@
+2013-07-31 10:30:31 <3> app42(13091) [Interpreter] modules/Testsuite.rb:42
Loading module 'Ldap' failed
+2013-07-31 10:30:31 <3> app42(13091) [libycp] Import.cc(import):97 No matching
component found

FAIL: Wrong stderr for Export3
See the diff above.
Running GetAllAttributes ...
FAIL: Wrong stderr for GetAllAttributes

The diff follows...

--- tests/GetAllAttributes.err 2013-01-22 11:26:37.000000000 +0100
+++ tmp.err.GetAllAttributes 2013-07-31 10:30:31.000000000 +0200
@@ -0,0 +1,2 @@
+2013-07-31 10:30:31 <3> app42(13118) [Interpreter] modules/Testsuite.rb:42
Loading module 'Ldap' failed
+2013-07-31 10:30:31 <3> app42(13118) [libycp] Import.cc(import):97 No matching
component found

FAIL: Wrong stderr for GetAllAttributes
See the diff above.
Running LDAPBind ...
FAIL: Wrong stderr for LDAPBind

The diff follows...

--- tests/LDAPBind.err 2013-01-22 11:26:37.000000000 +0100
+++ tmp.err.LDAPBind 2013-07-31 10:30:32.000000000 +0200
@@ -0,0 +1,2 @@
+2013-07-31 10:30:32 <3> app42(13144) [Interpreter] modules/Testsuite.rb:42
Loading module 'Ldap' failed
+2013-07-31 10:30:32 <3> app42(13144) [libycp] Import.cc(import):97 No matching
component found

FAIL: Wrong stderr for LDAPBind
See the diff above.
Running LDAPInit ...
FAIL: Wrong stderr for LDAPInit

The diff follows...

--- tests/LDAPInit.err 2013-01-22 11:26:37.000000000 +0100
+++ tmp.err.LDAPInit 2013-07-31 10:30:32.000000000 +0200
@@ -0,0 +1,2 @@
+2013-07-31 10:30:32 <3> app42(13170) [Interpreter] modules/Testsuite.rb:42
Loading module 'Ldap' failed
+2013-07-31 10:30:32 <3> app42(13170) [libycp] Import.cc(import):97 No matching
component found

FAIL: Wrong stderr for LDAPInit
See the diff above.
Running Read ...
FAIL: Wrong stderr for Read

The diff follows...

--- tests/Read.err 2013-01-22 11:26:37.000000000 +0100
+++ tmp.err.Read 2013-07-31 10:30:32.000000000 +0200
@@ -0,0 +1,2 @@
+2013-07-31 10:30:32 <3> app42(13196) [Interpreter] modules/Testsuite.rb:42
Loading module 'Ldap' failed
+2013-07-31 10:30:32 <3> app42(13196) [libycp] Import.cc(import):97 No matching
component found

FAIL: Wrong stderr for Read
See the diff above.
Running Read2 ...
FAIL: Wrong stderr for Read2

The diff follows...

--- tests/Read2.err 2013-01-22 11:26:37.000000000 +0100
+++ tmp.err.Read2 2013-07-31 10:30:32.000000000 +0200
@@ -0,0 +1,2 @@
+2013-07-31 10:30:32 <3> app42(13222) [Interpreter] :0 Loading module 'Ldap'
failed
+2013-07-31 10:30:32 <3> app42(13222) [libycp] Import.cc(import):97 No matching
component found

FAIL: Wrong stderr for Read2
See the diff above.
Running ReadLdapConfEntry ...
FAIL: Wrong stderr for ReadLdapConfEntry

The diff follows...

--- tests/ReadLdapConfEntry.err 2013-01-22 11:26:37.000000000 +0100
+++ tmp.err.ReadLdapConfEntry 2013-07-31 10:30:32.000000000 +0200
@@ -0,0 +1,2 @@
+2013-07-31 10:30:32 <3> app42(13248) [Interpreter] modules/Testsuite.rb:42
Loading module 'Ldap' failed
+2013-07-31 10:30:32 <3> app42(13248) [libycp] Import.cc(import):97 No matching
component found

FAIL: Wrong stderr for ReadLdapConfEntry
See the diff above.
Running Routines ...
FAIL: Wrong stderr for Routines

The diff follows...

--- tests/Routines.err 2013-01-22 11:26:37.000000000 +0100
+++ tmp.err.Routines 2013-07-31 10:30:33.000000000 +0200
@@ -0,0 +1,2 @@
+2013-07-31 10:30:32 <3> app42(13274) [Interpreter] modules/Testsuite.rb:42
Loading module 'Ldap' failed
+2013-07-31 10:30:32 <3> app42(13274) [libycp] Import.cc(import):97 No matching
component found

FAIL: Wrong stderr for Routines
See the diff above.
Running SingleValued ...
FAIL: Wrong stderr for SingleValued

The diff follows...

--- tests/SingleValued.err 2013-01-22 11:26:37.000000000 +0100
+++ tmp.err.SingleValued 2013-07-31 10:30:33.000000000 +0200
@@ -0,0 +1,2 @@
+2013-07-31 10:30:33 <3> app42(13300) [Interpreter] modules/Testsuite.rb:42
Loading module 'Ldap' failed
+2013-07-31 10:30:33 <3> app42(13300) [libycp] Import.cc(import):97 No matching
component found

FAIL: Wrong stderr for SingleValued
See the diff above.

Checking finished


=== yast2-ldap-client Summary ===

# of unexpected failures 24
make[2]: *** [check-DEJAGNU] Error 1
make[2]: Leaving directory
`<http://river.suse.de/job/yast-ldap-client-HEAD/ws/checkout/testsuite'>
make[1]: *** [check-am] Error 2
make[1]: Leaving directory
`<http://river.suse.de/job/yast-ldap-client-HEAD/ws/checkout/testsuite'>
make: *** [check-recursive] Error 1
++ error_exit 2
++ echo 'ERROR: detected exitcode 2'
ERROR: detected exitcode 2
++ cleanup
++ echo '==> Running cleanup'
==> Running cleanup
++ rm -f
<http://river.suse.de/job/yast-ldap-client-HEAD/ws/ICECC/40c0ab7e54f59a1e4e493c1ea90a882a.tar.gz>
++ footer_and_exit 1
++ '[' -z 1 ']'
++ MYEXIT=1
++ '[' 1 == 0 ']'
++ ascii_failed
++ cat

( )
( ) (
) _ )
( \_
_(_\ \)__
(____\___))

build failed

++ exit 1
Build step 'Execute shell' marked build as failure
--
To unsubscribe, e-mail: yast-devel+unsubscribe@xxxxxxxxxxxx
To contact the owner, e-mail: yast-devel+owner@xxxxxxxxxxxx

< Previous Next >
Follow Ups
References