Mailinglist Archive: yast-devel (251 mails)

< Previous Next >
[yast-devel] Build failed in Jenkins: yast-dns-server-HEAD #391
  • From: hudson@xxxxxxx
  • Date: Wed, 31 Jul 2013 10:27:47 +0200 (CEST)
  • Message-id: <1660811553.176.1375259267848.JavaMail.jenkins@river>
See <http://river.suse.de/job/yast-dns-server-HEAD/391/changes>

Changes:

[yast-devel] YCP Killer: Unify YaST module structure

[yast-devel] YCP Killer: Apply changes needed for Ruby translation

[yast-devel] YCP Killer: Translate YCP files into Ruby

[yast-devel] YCP Killer: Regenerate Makefile.am files in all source directories

------------------------------------------
[...truncated 409 lines...]
make[2]: Entering directory
`<http://river.suse.de/job/yast-dns-server-HEAD/ws/checkout/doc/autodocs'>
make[2]: Nothing to be done for `check'.
make[2]: Leaving directory
`<http://river.suse.de/job/yast-dns-server-HEAD/ws/checkout/doc/autodocs'>
make[2]: Entering directory
`<http://river.suse.de/job/yast-dns-server-HEAD/ws/checkout/doc'>
make[2]: Nothing to be done for `check-am'.
make[2]: Leaving directory
`<http://river.suse.de/job/yast-dns-server-HEAD/ws/checkout/doc'>
make[1]: Leaving directory
`<http://river.suse.de/job/yast-dns-server-HEAD/ws/checkout/doc'>
Making check in src
make[1]: Entering directory
`<http://river.suse.de/job/yast-dns-server-HEAD/ws/checkout/src'>
make[1]: Nothing to be done for `check'.
make[1]: Leaving directory
`<http://river.suse.de/job/yast-dns-server-HEAD/ws/checkout/src'>
Making check in testsuite
make[1]: Entering directory
`<http://river.suse.de/job/yast-dns-server-HEAD/ws/checkout/testsuite'>
make -f /usr/share/YaST2/data/testsuite/Makefile.testsuite
RPMNAME=yast2-dns-server srcdir=.
make[2]: Entering directory
`<http://river.suse.de/job/yast-dns-server-HEAD/ws/checkout/testsuite'>
make[2]: Nothing to be done for `all'.
make[2]: Leaving directory
`<http://river.suse.de/job/yast-dns-server-HEAD/ws/checkout/testsuite'>
make check-DEJAGNU check-local
make[2]: Entering directory
`<http://river.suse.de/job/yast-dns-server-HEAD/ws/checkout/testsuite'>
Making a new site.exp file ...
srcdir='.'; export srcdir; \
EXPECT=expect; export EXPECT; \
runtest=runtest; \
if /bin/sh -c "$runtest --version" > /dev/null 2>&1; then \
exit_status=0; l='yast2-dns-server'; for tool in $l; do \
if $runtest --tool $tool --srcdir $srcdir ; \
then :; else exit_status=1; fi; \
done; \
else echo "WARNING: could not find 'runtest'" 1>&2; :;\
fi; \
exit $exit_status
WARNING: Couldn't find tool init file
Test Run By root on Wed Jul 31 10:27:43 2013
Native configuration is x86_64-suse-linux-gnu

=== yast2-dns-server tests ===

Schedule of variations:
unix

Running target unix
Using /usr/share/dejagnu/baseboards/unix.exp as board description file for
target.
Using /usr/share/dejagnu/config/unix.exp as generic interface file for target.
Using ./config/unix.exp as tool-and-target-specific interface file.
Running ./yast2-dns-server.test/testsuite.exp ...

Checking started

Running DnsServerAPI ...
FAIL: Wrong stderr for DnsServerAPI

The diff follows...

--- tests/DnsServerAPI.err 2013-01-22 11:17:55.000000000 +0100
+++ tmp.err.DnsServerAPI 2013-07-31 10:27:44.000000000 +0200
@@ -0,0 +1,2 @@
+2013-07-31 10:27:44 <3> app42(28837) [Interpreter] modules/Testsuite.rb:42
Loading module 'Mode' failed
+2013-07-31 10:27:44 <3> app42(28837) [libycp] Import.cc(import):97 No matching
component found

FAIL: Wrong stderr for DnsServerAPI
See the diff above.
Running DnsServerHelperFunctions ...
FAIL: Wrong stderr for DnsServerHelperFunctions

The diff follows...

--- tests/DnsServerHelperFunctions.err 2013-01-22 11:17:55.000000000 +0100
+++ tmp.err.DnsServerHelperFunctions 2013-07-31 10:27:44.000000000 +0200
@@ -0,0 +1,2 @@
+2013-07-31 10:27:44 <3> app42(28863) [Interpreter] yast/i18n.rb:83 Loading
module 'Mode' failed
+2013-07-31 10:27:44 <3> app42(28863) [libycp] Import.cc(import):97 No matching
component found

FAIL: Wrong stderr for DnsServerHelperFunctions
See the diff above.
Running DnsServerUI ...
FAIL: Wrong stderr for DnsServerUI

The diff follows...

--- tests/DnsServerUI.err 2013-01-22 11:17:55.000000000 +0100
+++ tmp.err.DnsServerUI 2013-07-31 10:27:45.000000000 +0200
@@ -0,0 +1,4 @@
+2013-07-31 10:27:44 <3> app42(28889) [Interpreter] yast/i18n.rb:83 Loading
module 'Mode' failed
+2013-07-31 10:27:44 <3> app42(28889) [libycp] Import.cc(import):97 No matching
component found
+2013-07-31 10:27:44 <3> app42(28889) [Y2Ruby] binary/YRuby.cc(loadModule):148
Module /usr/share/YaST2/modules/DnsServerUI load failed:component cannot import
namespace 'Mode' at /usr/lib64/ruby/vendor_ruby/1.9.1/yast/yast.rb:146:in
`import_pure'
+2013-07-31 10:27:44 <3> app42(28889) [Interpreter] yast/i18n.rb:83
Ruby::loadModule() / Can't load ruby module
'/usr/share/YaST2/modules/DnsServerUI'

FAIL: Wrong stderr for DnsServerUI
See the diff above.
Running Read ...
FAIL: Wrong stderr for Read

The diff follows...

--- tests/Read.err 2013-01-22 11:17:55.000000000 +0100
+++ tmp.err.Read 2013-07-31 10:27:45.000000000 +0200
@@ -0,0 +1,18 @@
+2013-07-31 10:27:45 <3> app42(28915) [Interpreter] yast/i18n.rb:83 Loading
module 'Directory' failed
+2013-07-31 10:27:45 <3> app42(28915) [libycp] Import.cc(import):97 No matching
component found
+2013-07-31 10:27:45 <3> app42(28915) [Y2Ruby] binary/YRuby.cc(loadModule):148
Module /usr/share/YaST2/modules/CommandLine load failed:component cannot import
namespace 'Directory' at /usr/lib64/ruby/vendor_ruby/1.9.1/yast/yast.rb:146:in
`import_pure'
+2013-07-31 10:27:45 <3> app42(28915) [Interpreter] yast/i18n.rb:83
Ruby::loadModule() / Can't load ruby module
'/usr/share/YaST2/modules/CommandLine'
+2013-07-31 10:27:45 <3> app42(28915) [Interpreter] yast/i18n.rb:83 Loading
module 'Directory' failed
+2013-07-31 10:27:45 <3> app42(28915) [libycp] Import.cc(import):97 No matching
component found
+2013-07-31 10:27:45 <3> app42(28915) [Y2Ruby] binary/YRuby.cc(loadModule):148
Module /usr/share/YaST2/modules/Desktop load failed:component cannot import
namespace 'Directory' at /usr/lib64/ruby/vendor_ruby/1.9.1/yast/yast.rb:146:in
`import_pure'
+2013-07-31 10:27:45 <3> app42(28915) [Interpreter] yast/i18n.rb:83
Ruby::loadModule() / Can't load ruby module '/usr/share/YaST2/modules/Desktop'
+2013-07-31 10:27:45 <3> app42(28915) [Interpreter] yast/i18n.rb:83 Loading
module 'Label' failed
+2013-07-31 10:27:45 <3> app42(28915) [libycp] Import.cc(import):97 No matching
component found
+2013-07-31 10:27:45 <3> app42(28915) [Y2Ruby] binary/YRuby.cc(loadModule):148
Module /usr/share/YaST2/modules/Wizard load failed:component cannot import
namespace 'Label' at /usr/lib64/ruby/vendor_ruby/1.9.1/yast/yast.rb:146:in
`import_pure'
+2013-07-31 10:27:45 <3> app42(28915) [Interpreter] yast/i18n.rb:83
Ruby::loadModule() / Can't load ruby module '/usr/share/YaST2/modules/Wizard'
+2013-07-31 10:27:45 <3> app42(28915) [Interpreter] yast/i18n.rb:83 Loading
module 'Mode' failed
+2013-07-31 10:27:45 <3> app42(28915) [libycp] Import.cc(import):97 No matching
component found
+2013-07-31 10:27:45 <3> app42(28915) [Y2Ruby] binary/YRuby.cc(loadModule):148
Module /usr/share/YaST2/modules/Progress load failed:component cannot import
namespace 'Mode' at /usr/lib64/ruby/vendor_ruby/1.9.1/yast/yast.rb:146:in
`import_pure'
+2013-07-31 10:27:45 <3> app42(28915) [Interpreter] yast/i18n.rb:83
Ruby::loadModule() / Can't load ruby module '/usr/share/YaST2/modules/Progress'
+2013-07-31 10:27:45 <3> app42(28915) [Interpreter] yast/i18n.rb:83 Loading
module 'Mode' failed
+2013-07-31 10:27:45 <3> app42(28915) [libycp] Import.cc(import):97 No matching
component found

FAIL: Wrong stderr for Read
See the diff above.
Running Write ...
FAIL: Wrong stderr for Write

The diff follows...

--- tests/Write.err 2013-01-22 11:17:55.000000000 +0100
+++ tmp.err.Write 2013-07-31 10:27:46.000000000 +0200
@@ -0,0 +1,18 @@
+2013-07-31 10:27:45 <3> app42(28941) [Interpreter] yast/i18n.rb:83 Loading
module 'Directory' failed
+2013-07-31 10:27:45 <3> app42(28941) [libycp] Import.cc(import):97 No matching
component found
+2013-07-31 10:27:45 <3> app42(28941) [Y2Ruby] binary/YRuby.cc(loadModule):148
Module /usr/share/YaST2/modules/CommandLine load failed:component cannot import
namespace 'Directory' at /usr/lib64/ruby/vendor_ruby/1.9.1/yast/yast.rb:146:in
`import_pure'
+2013-07-31 10:27:45 <3> app42(28941) [Interpreter] yast/i18n.rb:83
Ruby::loadModule() / Can't load ruby module
'/usr/share/YaST2/modules/CommandLine'
+2013-07-31 10:27:45 <3> app42(28941) [Interpreter] yast/i18n.rb:83 Loading
module 'Directory' failed
+2013-07-31 10:27:45 <3> app42(28941) [libycp] Import.cc(import):97 No matching
component found
+2013-07-31 10:27:45 <3> app42(28941) [Y2Ruby] binary/YRuby.cc(loadModule):148
Module /usr/share/YaST2/modules/Desktop load failed:component cannot import
namespace 'Directory' at /usr/lib64/ruby/vendor_ruby/1.9.1/yast/yast.rb:146:in
`import_pure'
+2013-07-31 10:27:45 <3> app42(28941) [Interpreter] yast/i18n.rb:83
Ruby::loadModule() / Can't load ruby module '/usr/share/YaST2/modules/Desktop'
+2013-07-31 10:27:45 <3> app42(28941) [Interpreter] yast/i18n.rb:83 Loading
module 'Label' failed
+2013-07-31 10:27:45 <3> app42(28941) [libycp] Import.cc(import):97 No matching
component found
+2013-07-31 10:27:45 <3> app42(28941) [Y2Ruby] binary/YRuby.cc(loadModule):148
Module /usr/share/YaST2/modules/Wizard load failed:component cannot import
namespace 'Label' at /usr/lib64/ruby/vendor_ruby/1.9.1/yast/yast.rb:146:in
`import_pure'
+2013-07-31 10:27:45 <3> app42(28941) [Interpreter] yast/i18n.rb:83
Ruby::loadModule() / Can't load ruby module '/usr/share/YaST2/modules/Wizard'
+2013-07-31 10:27:45 <3> app42(28941) [Interpreter] yast/i18n.rb:83 Loading
module 'Mode' failed
+2013-07-31 10:27:45 <3> app42(28941) [libycp] Import.cc(import):97 No matching
component found
+2013-07-31 10:27:45 <3> app42(28941) [Y2Ruby] binary/YRuby.cc(loadModule):148
Module /usr/share/YaST2/modules/Progress load failed:component cannot import
namespace 'Mode' at /usr/lib64/ruby/vendor_ruby/1.9.1/yast/yast.rb:146:in
`import_pure'
+2013-07-31 10:27:45 <3> app42(28941) [Interpreter] yast/i18n.rb:83
Ruby::loadModule() / Can't load ruby module '/usr/share/YaST2/modules/Progress'
+2013-07-31 10:27:46 <3> app42(28941) [Interpreter] yast/i18n.rb:83 Loading
module 'Mode' failed
+2013-07-31 10:27:46 <3> app42(28941) [libycp] Import.cc(import):97 No matching
component found

FAIL: Wrong stderr for Write
See the diff above.
Running YaPIReadGlobalOptions ...
FAIL: Wrong stderr for YaPIReadGlobalOptions

The diff follows...

--- tests/YaPIReadGlobalOptions.err 2013-01-22 11:17:55.000000000 +0100
+++ tmp.err.YaPIReadGlobalOptions 2013-07-31 10:27:46.000000000 +0200
@@ -0,0 +1,2 @@
+2013-07-31 10:27:46 <3> app42(28967) [Interpreter] modules/Testsuite.rb:42
Loading module 'Mode' failed
+2013-07-31 10:27:46 <3> app42(28967) [libycp] Import.cc(import):97 No matching
component found

FAIL: Wrong stderr for YaPIReadGlobalOptions
See the diff above.
Running YaPIReadZones ...
FAIL: Wrong stderr for YaPIReadZones

The diff follows...

--- tests/YaPIReadZones.err 2013-01-22 11:17:55.000000000 +0100
+++ tmp.err.YaPIReadZones 2013-07-31 10:27:46.000000000 +0200
@@ -0,0 +1,2 @@
+2013-07-31 10:27:46 <3> app42(28993) [Interpreter] modules/Testsuite.rb:42
Loading module 'Mode' failed
+2013-07-31 10:27:46 <3> app42(28993) [libycp] Import.cc(import):97 No matching
component found

FAIL: Wrong stderr for YaPIReadZones
See the diff above.
Running YaPIStartStopDnsService ...
FAIL: Wrong stderr for YaPIStartStopDnsService

The diff follows...

--- tests/YaPIStartStopDnsService.err 2013-01-22 11:17:55.000000000 +0100
+++ tmp.err.YaPIStartStopDnsService 2013-07-31 10:27:47.000000000 +0200
@@ -0,0 +1,2 @@
+2013-07-31 10:27:47 <3> app42(29019) [Interpreter] modules/Testsuite.rb:42
Loading module 'Mode' failed
+2013-07-31 10:27:47 <3> app42(29019) [libycp] Import.cc(import):97 No matching
component found

FAIL: Wrong stderr for YaPIStartStopDnsService
See the diff above.
Running YaPIWriteGlobalOptions ...
FAIL: Wrong stderr for YaPIWriteGlobalOptions

The diff follows...

--- tests/YaPIWriteGlobalOptions.err 2013-01-22 11:17:55.000000000 +0100
+++ tmp.err.YaPIWriteGlobalOptions 2013-07-31 10:27:47.000000000 +0200
@@ -0,0 +1,2 @@
+2013-07-31 10:27:47 <3> app42(29045) [Interpreter] modules/Testsuite.rb:42
Loading module 'Mode' failed
+2013-07-31 10:27:47 <3> app42(29045) [libycp] Import.cc(import):97 No matching
component found

FAIL: Wrong stderr for YaPIWriteGlobalOptions
See the diff above.
Running YaPIWriteZones ...
FAIL: Wrong stderr for YaPIWriteZones

The diff follows...

--- tests/YaPIWriteZones.err 2013-01-22 11:17:55.000000000 +0100
+++ tmp.err.YaPIWriteZones 2013-07-31 10:27:47.000000000 +0200
@@ -0,0 +1,2 @@
+2013-07-31 10:27:47 <3> app42(29071) [Interpreter] modules/Testsuite.rb:42
Loading module 'Mode' failed
+2013-07-31 10:27:47 <3> app42(29071) [libycp] Import.cc(import):97 No matching
component found

FAIL: Wrong stderr for YaPIWriteZones
See the diff above.

Checking finished


=== yast2-dns-server Summary ===

# of unexpected failures 20
make[2]: *** [check-DEJAGNU] Error 1
make[2]: Leaving directory
`<http://river.suse.de/job/yast-dns-server-HEAD/ws/checkout/testsuite'>
make[1]: *** [check-am] Error 2
make[1]: Leaving directory
`<http://river.suse.de/job/yast-dns-server-HEAD/ws/checkout/testsuite'>
make: *** [check-recursive] Error 1
++ error_exit 2
++ echo 'ERROR: detected exitcode 2'
ERROR: detected exitcode 2
++ cleanup
++ echo '==> Running cleanup'
==> Running cleanup
++ rm -f
<http://river.suse.de/job/yast-dns-server-HEAD/ws/ICECC/40c0ab7e54f59a1e4e493c1ea90a882a.tar.gz>
++ footer_and_exit 1
++ '[' -z 1 ']'
++ MYEXIT=1
++ '[' 1 == 0 ']'
++ ascii_failed
++ cat

( )
( ) (
) _ )
( \_
_(_\ \)__
(____\___))

build failed

++ exit 1
Build step 'Execute shell' marked build as failure
--
To unsubscribe, e-mail: yast-devel+unsubscribe@xxxxxxxxxxxx
To contact the owner, e-mail: yast-devel+owner@xxxxxxxxxxxx

< Previous Next >
This Thread
Follow Ups
References