Mailinglist Archive: yast-devel (251 mails)

< Previous Next >
[yast-devel] Build failed in Jenkins: yast-backup-HEAD #223
  • From: hudson@xxxxxxx
  • Date: Wed, 31 Jul 2013 10:09:08 +0200 (CEST)
  • Message-id: <1677644936.162.1375258148638.JavaMail.jenkins@river>
See <http://river.suse.de/job/yast-backup-HEAD/223/changes>

Changes:

[yast-devel] YCP Killer: Unify YaST module structure

[yast-devel] YCP Killer: Apply changes needed for Ruby translation

[yast-devel] YCP Killer: Translate YCP files into Ruby

[yast-devel] YCP Killer: Regenerate Makefile.am files in all source directories

------------------------------------------
[...truncated 332 lines...]
-Return /dir/file.ext
-Return file.ext
-Return .ext
-Return f.ext
-Return
-Return /dir.ext/file.ext
-Return /dir.ext/.ext
-Return /dir.ext/file.ext
-Return /dir1.ext/dir2.ext/file.ext
-Return /dev/nst0
-Return /foo/tučňák.png

FAIL: Wrong stdout for AddMissingExtension
See the diff above.
Running ExcludeNodevFS ...
FAIL: Wrong stderr for ExcludeNodevFS

The diff follows...

--- tests/ExcludeNodevFS.err 2013-01-22 11:16:18.000000000 +0100
+++ tmp.err.ExcludeNodevFS 2013-07-31 10:09:05.000000000 +0200
@@ -0,0 +1,2 @@
+2013-07-31 10:09:05 <3> app42(24126) [Interpreter] modules/Testsuite.rb:42
Loading module 'Backup' failed
+2013-07-31 10:09:05 <3> app42(24126) [libycp] Import.cc(import):97 No matching
component found

FAIL: Wrong stderr for ExcludeNodevFS
See the diff above.
Running Ext2Filesystems ...
FAIL: Wrong stdout for Ext2Filesystems

The diff follows...

--- tests/Ext2Filesystems.out 2013-01-22 11:16:18.000000000 +0100
+++ tmp.out.Ext2Filesystems 2013-07-31 10:09:06.000000000 +0200
@@ -1,6 +0,0 @@
-Read .proc.mounts nil
-Read .etc.fstab nil
-Return []
-Read .proc.mounts [$["file":"/", "freq":0, "mntops":"rw", "passno":0,
"spec":"/dev/root", "vfstype":"reiserfs"], $["file":"/proc", "freq":0,
"mntops":"rw", "passno":0, "spec":"proc", "vfstype":"proc"],
$["file":"/dev/pts", "freq":0, "mntops":"rw", "passno":0, "spec":"devpts",
"vfstype":"devpts"], $["file":"/boot", "freq":0, "mntops":"rw", "passno":0,
"spec":"/dev/hda1", "vfstype":"ext2"], $["file":"/local", "freq":0,
"mntops":"rw", "passno":0, "spec":"/dev/hda4", "vfstype":"ext2"]]
-Read .etc.fstab [$["file":"/media/cdrom", "freq":0,
"mntops":"ro,noauto,user,exec", "passno":0, "spec":"/dev/cdrom",
"vfstype":"auto"], $["file":"/unmountedk", "freq":0, "mntops":"defaults",
"passno":0, "spec":"/dev/hdb1", "vfstype":"ext2"]]
-Return [$["mountpoint":"/boot", "partition":"/dev/hda1"],
$["mountpoint":"/local", "partition":"/dev/hda4"],
$["mountpoint":"/unmountedk", "partition":"/dev/hdb1"]]

FAIL: Wrong stdout for Ext2Filesystems
See the diff above.
Running Ext2MountPoint ...
FAIL: Wrong stdout for Ext2MountPoint

The diff follows...

--- tests/Ext2MountPoint.out 2013-01-22 11:16:18.000000000 +0100
+++ tmp.out.Ext2MountPoint 2013-07-31 10:09:06.000000000 +0200
@@ -1,11 +0,0 @@
-Read .proc.mounts nil
-Read .etc.fstab nil
-Return nil
-Read .proc.mounts [$["file":"/", "freq":0, "mntops":"rw", "passno":0,
"spec":"/dev/root", "vfstype":"reiserfs"], $["file":"/proc", "freq":0,
"mntops":"rw", "passno":0, "spec":"proc", "vfstype":"proc"],
$["file":"/dev/pts", "freq":0, "mntops":"rw", "passno":0, "spec":"devpts",
"vfstype":"devpts"], $["file":"/boot", "freq":0, "mntops":"rw", "passno":0,
"spec":"/dev/hda1", "vfstype":"ext2"], $["file":"/local", "freq":0,
"mntops":"rw", "passno":0, "spec":"/dev/hda4", "vfstype":"ext2"]]
-Return /boot
-Read .proc.mounts [$["file":"/", "freq":0, "mntops":"rw", "passno":0,
"spec":"/dev/root", "vfstype":"reiserfs"], $["file":"/proc", "freq":0,
"mntops":"rw", "passno":0, "spec":"proc", "vfstype":"proc"],
$["file":"/dev/pts", "freq":0, "mntops":"rw", "passno":0, "spec":"devpts",
"vfstype":"devpts"], $["file":"/boot", "freq":0, "mntops":"rw", "passno":0,
"spec":"/dev/hda1", "vfstype":"ext2"], $["file":"/local", "freq":0,
"mntops":"rw", "passno":0, "spec":"/dev/hda4", "vfstype":"ext2"]]
-Read .etc.fstab [$["file":"/media/cdrom", "freq":0,
"mntops":"ro,noauto,user,exec", "passno":0, "spec":"/dev/cdrom",
"vfstype":"auto"], $["file":"/unmounted", "freq":0, "mntops":"defaults",
"passno":0, "spec":"/dev/hdb1", "vfstype":"ext2"]]
-Return /unmounted
-Read .proc.mounts [$["file":"/", "freq":0, "mntops":"rw", "passno":0,
"spec":"/dev/root", "vfstype":"reiserfs"], $["file":"/proc", "freq":0,
"mntops":"rw", "passno":0, "spec":"proc", "vfstype":"proc"],
$["file":"/dev/pts", "freq":0, "mntops":"rw", "passno":0, "spec":"devpts",
"vfstype":"devpts"], $["file":"/boot", "freq":0, "mntops":"rw", "passno":0,
"spec":"/dev/hda1", "vfstype":"ext2"], $["file":"/local", "freq":0,
"mntops":"rw", "passno":0, "spec":"/dev/hda4", "vfstype":"ext2"]]
-Read .etc.fstab [$["file":"/media/cdrom", "freq":0,
"mntops":"ro,noauto,user,exec", "passno":0, "spec":"/dev/cdrom",
"vfstype":"auto"], $["file":"/unmounted", "freq":0, "mntops":"defaults",
"passno":0, "spec":"/dev/hdb1", "vfstype":"ext2"]]
-Return nil

FAIL: Wrong stdout for Ext2MountPoint
See the diff above.
Running GetBaseName ...
FAIL: Wrong stdout for GetBaseName

The diff follows...

--- tests/GetBaseName.out 2013-01-22 11:16:18.000000000 +0100
+++ tmp.out.GetBaseName 2013-07-31 10:09:06.000000000 +0200
@@ -1,11 +0,0 @@
-Return
-Return
-Return file
-Return file
-Return
-Return file
-Return file
-Return
-Return file
-Return file
-Return file

FAIL: Wrong stdout for GetBaseName
See the diff above.
Running GetCapacity ...
FAIL: Wrong stderr for GetCapacity

The diff follows...

--- tests/GetCapacity.err 2013-01-22 11:16:18.000000000 +0100
+++ tmp.err.GetCapacity 2013-07-31 10:09:06.000000000 +0200
@@ -0,0 +1,2 @@
+2013-07-31 10:09:06 <3> app42(24230) [Interpreter] modules/Testsuite.rb:42
Loading module 'Backup' failed
+2013-07-31 10:09:06 <3> app42(24230) [libycp] Import.cc(import):97 No matching
component found

FAIL: Wrong stderr for GetCapacity
See the diff above.
Running GetListWithFlags ...
FAIL: Wrong stdout for GetListWithFlags

The diff follows...

--- tests/GetListWithFlags.out 2013-01-22 11:16:18.000000000 +0100
+++ tmp.out.GetListWithFlags 2013-07-31 10:09:06.000000000 +0200
@@ -1,5 +0,0 @@
-Dump []
-Dump []
-Dump []
-Dump [`item (`id ("/dev"), "/dev", false)]
-Dump [`item (`id ("/dev"), "/dev", false), `item (`id ("/etc"), "/etc",
true)]

FAIL: Wrong stdout for GetListWithFlags
See the diff above.
Running GetMountedFilesystems ...
FAIL: Wrong stdout for GetMountedFilesystems

The diff follows...

--- tests/GetMountedFilesystems.out 2013-01-22 11:16:18.000000000 +0100
+++ tmp.out.GetMountedFilesystems 2013-07-31 10:09:07.000000000 +0200
@@ -1,4 +0,0 @@
-Read .proc.mounts nil
-Return []
-Read .proc.mounts [$["file":"/", "freq":0, "mntops":"rw", "passno":0,
"spec":"/dev/root", "vfstype":"reiserfs"], $["file":"/proc", "freq":0,
"mntops":"rw", "passno":0, "spec":"proc", "vfstype":"proc"],
$["file":"/dev/pts", "freq":0, "mntops":"rw", "passno":0, "spec":"devpts",
"vfstype":"devpts"], $["file":"/boot", "freq":0, "mntops":"rw", "passno":0,
"spec":"/dev/hda1", "vfstype":"ext2"], $["file":"/local", "freq":0,
"mntops":"rw", "passno":0, "spec":"/dev/hda4", "vfstype":"ext2"]]
-Return ["devpts", "ext2", "proc", "reiserfs"]

FAIL: Wrong stdout for GetMountedFilesystems
See the diff above.
Running MapFilesToString ...
FAIL: Wrong stderr for MapFilesToString

The diff follows...

--- tests/MapFilesToString.err 2013-01-22 11:16:18.000000000 +0100
+++ tmp.err.MapFilesToString 2013-07-31 10:09:07.000000000 +0200
@@ -0,0 +1,2 @@
+2013-07-31 10:09:07 <3> app42(24308) [Interpreter] modules/Testsuite.rb:42
Loading module 'Backup' failed
+2013-07-31 10:09:07 <3> app42(24308) [libycp] Import.cc(import):97 No matching
component found

FAIL: Wrong stderr for MapFilesToString
See the diff above.
Running MediaList2UIList ...
FAIL: Wrong stdout for MediaList2UIList

The diff follows...

--- tests/MediaList2UIList.out 2013-01-22 11:16:18.000000000 +0100
+++ tmp.out.MediaList2UIList 2013-07-31 10:09:07.000000000 +0200
@@ -1,4 +0,0 @@
-Dump []
-Dump []
-Dump []
-Dump [`item (`id (`fd144), "Floppy 1.44 MB"), `item (`id (`fd12), "Floppy
1.2 MB")]

FAIL: Wrong stdout for MediaList2UIList
See the diff above.
Running ReadBackupProfiles ...
FAIL: Wrong stderr for ReadBackupProfiles

The diff follows...

--- tests/ReadBackupProfiles.err 2013-01-22 11:16:18.000000000 +0100
+++ tmp.err.ReadBackupProfiles 2013-07-31 10:09:07.000000000 +0200
@@ -0,0 +1,2 @@
+2013-07-31 10:09:07 <3> app42(24360) [Interpreter] modules/Testsuite.rb:42
Loading module 'Backup' failed
+2013-07-31 10:09:07 <3> app42(24360) [libycp] Import.cc(import):97 No matching
component found

FAIL: Wrong stderr for ReadBackupProfiles
See the diff above.
Running RestoreBackupProfile ...
FAIL: Wrong stderr for RestoreBackupProfile

The diff follows...

--- tests/RestoreBackupProfile.err 2013-01-22 11:16:18.000000000 +0100
+++ tmp.err.RestoreBackupProfile 2013-07-31 10:09:08.000000000 +0200
@@ -0,0 +1,2 @@
+2013-07-31 10:09:08 <3> app42(24386) [Interpreter] modules/Testsuite.rb:42
Loading module 'Backup' failed
+2013-07-31 10:09:08 <3> app42(24386) [libycp] Import.cc(import):97 No matching
component found

FAIL: Wrong stderr for RestoreBackupProfile
See the diff above.
Running RestoreBackupSettings ...
FAIL: Wrong stderr for RestoreBackupSettings

The diff follows...

--- tests/RestoreBackupSettings.err 2013-01-22 11:16:18.000000000 +0100
+++ tmp.err.RestoreBackupSettings 2013-07-31 10:09:08.000000000 +0200
@@ -0,0 +1,2 @@
+2013-07-31 10:09:08 <3> app42(24412) [Interpreter] modules/Testsuite.rb:42
Loading module 'Backup' failed
+2013-07-31 10:09:08 <3> app42(24412) [libycp] Import.cc(import):97 No matching
component found

FAIL: Wrong stderr for RestoreBackupSettings
See the diff above.
Running WriteBackupProfiles ...
FAIL: Wrong stderr for WriteBackupProfiles

The diff follows...

--- tests/WriteBackupProfiles.err 2013-01-22 11:16:18.000000000 +0100
+++ tmp.err.WriteBackupProfiles 2013-07-31 10:09:08.000000000 +0200
@@ -0,0 +1,2 @@
+2013-07-31 10:09:08 <3> app42(24438) [Interpreter] modules/Testsuite.rb:42
Loading module 'Backup' failed
+2013-07-31 10:09:08 <3> app42(24438) [libycp] Import.cc(import):97 No matching
component found

FAIL: Wrong stderr for WriteBackupProfiles
See the diff above.

Checking finished


=== yast2-backup Summary ===

# of unexpected failures 34
make[2]: *** [check-DEJAGNU] Error 1
make[2]: Leaving directory
`<http://river.suse.de/job/yast-backup-HEAD/ws/checkout/testsuite'>
make[1]: *** [check-am] Error 2
make[1]: Leaving directory
`<http://river.suse.de/job/yast-backup-HEAD/ws/checkout/testsuite'>
make: *** [check-recursive] Error 1
++ error_exit 2
++ echo 'ERROR: detected exitcode 2'
ERROR: detected exitcode 2
++ cleanup
++ echo '==> Running cleanup'
==> Running cleanup
++ rm -f
<http://river.suse.de/job/yast-backup-HEAD/ws/ICECC/40c0ab7e54f59a1e4e493c1ea90a882a.tar.gz>
++ footer_and_exit 1
++ '[' -z 1 ']'
++ MYEXIT=1
++ '[' 1 == 0 ']'
++ ascii_failed
++ cat

( )
( ) (
) _ )
( \_
_(_\ \)__
(____\___))

build failed

++ exit 1
Build step 'Execute shell' marked build as failure
--
To unsubscribe, e-mail: yast-devel+unsubscribe@xxxxxxxxxxxx
To contact the owner, e-mail: yast-devel+owner@xxxxxxxxxxxx

< Previous Next >
Follow Ups
References