Mailinglist Archive: yast-devel (251 mails)

< Previous Next >
[yast-devel] Build failed in Jenkins: yast-instserver-HEAD #120
  • From: hudson@xxxxxxx
  • Date: Tue, 30 Jul 2013 14:35:47 +0200 (CEST)
  • Message-id: <1847034093.147.1375187747720.JavaMail.jenkins@river>
See <http://river.suse.de/job/yast-instserver-HEAD/120/>

------------------------------------------
[...truncated 89 lines...]
++ ARTIFACTS=<http://river.suse.de/job/yast-instserver-HEAD/ws/.artifacts>
++ export OBSDIR=<http://river.suse.de/job/yast-instserver-HEAD/ws/OBS>
++ OBSDIR=<http://river.suse.de/job/yast-instserver-HEAD/ws/OBS>
++ export RPMTOPDIR=<http://river.suse.de/job/yast-instserver-HEAD/ws/rpm>
++ RPMTOPDIR=<http://river.suse.de/job/yast-instserver-HEAD/ws/rpm>
++ export RPMOUT=<http://river.suse.de/job/yast-instserver-HEAD/ws/rpm/rpms>
++ RPMOUT=<http://river.suse.de/job/yast-instserver-HEAD/ws/rpm/rpms>
++ export
RPMBUILDDIR=<http://river.suse.de/job/yast-instserver-HEAD/ws/rpm/rpmbuild>
++ RPMBUILDDIR=<http://river.suse.de/job/yast-instserver-HEAD/ws/rpm/rpmbuild>
++ export
RPMBUILDROOT=<http://river.suse.de/job/yast-instserver-HEAD/ws/rpm/rpmbuildroot>
++
RPMBUILDROOT=<http://river.suse.de/job/yast-instserver-HEAD/ws/rpm/rpmbuildroot>
++ rm -rf <http://river.suse.de/job/yast-instserver-HEAD/ws/rpm/rpms>
++ rm -rf <http://river.suse.de/job/yast-instserver-HEAD/ws/rpm/rpmbuild>
++ rm -rf <http://river.suse.de/job/yast-instserver-HEAD/ws/rpm/rpmbuildroot>
++ rm -rf <http://river.suse.de/job/yast-instserver-HEAD/ws/.artifacts>
++ rm -rf <http://river.suse.de/job/yast-instserver-HEAD/ws/OBS>
++ rm -rf
'<http://river.suse.de/job/yast-instserver-HEAD/ws/copy-to-slave*.dir'>
++ [[ 1 == 1 ]]
++ echo 'Using autotools for building'
Using autotools for building
++ export BUILDDIR=<http://river.suse.de/job/yast-instserver-HEAD/ws/checkout>
++ BUILDDIR=<http://river.suse.de/job/yast-instserver-HEAD/ws/checkout>
++ export
PACKAGEDIR=<http://river.suse.de/job/yast-instserver-HEAD/ws/checkout/package>
++
PACKAGEDIR=<http://river.suse.de/job/yast-instserver-HEAD/ws/checkout/package>
++ mkdir -p <http://river.suse.de/job/yast-instserver-HEAD/ws/rpm>
++ mkdir -p <http://river.suse.de/job/yast-instserver-HEAD/ws/rpm/rpms>
++ mkdir -p <http://river.suse.de/job/yast-instserver-HEAD/ws/rpm/rpmbuild>
++ mkdir -p <http://river.suse.de/job/yast-instserver-HEAD/ws/rpm/rpmbuildroot>
++ mkdir -p <http://river.suse.de/job/yast-instserver-HEAD/ws/.artifacts>
++ mkdir -p <http://river.suse.de/job/yast-instserver-HEAD/ws/OBS>
++ cat
+ PACKAGENAME=yast-instserver
+ PACKAGENAME=yast2-instserver
+ cd <http://river.suse.de/job/yast-instserver-HEAD/ws/checkout>
+ make -f Makefile.cvs
y2tool y2autoconf
y2autoconf: Generating toplevel configure.ac
y2tool y2automake
y2automake: Copying automakefiles for inclusion
y2automake: Generating toplevel Makefile.am
autoreconf --force --install
./configure --prefix=/usr --libdir=/usr/lib64
checking build system type... x86_64-suse-linux-gnu
checking host system type... x86_64-suse-linux-gnu
checking target system type... x86_64-suse-linux-gnu
checking for a BSD-compatible install... /usr/bin/install -c
checking whether build environment is sane... yes
checking for a thread-safe mkdir -p... /usr/bin/mkdir -p
checking for gawk... gawk
checking whether make sets $(MAKE)... yes
checking how to create a ustar tar archive... gnutar
checking whether ln -s works... yes
checking whether make sets $(MAKE)... (cached) yes
checking for xgettext... /usr/bin/xgettext
checking for ycpdoc... /usr/lib/YaST2/bin/ycpdoc
checking for ycpmakedep... /usr/lib/YaST2/bin/ycpmakedep
checking for ycpc... /usr/bin/ycpc
checking for /usr/share/YaST2/data/testsuite/Makefile.testsuite... yes
checking that generated files are newer than configure... done
configure: creating ./config.status
config.status: creating Makefile
config.status: creating doc/autodocs/Makefile
config.status: creating doc/Makefile
config.status: creating httpd/Makefile
config.status: creating src/Makefile
config.status: creating testsuite/Makefile
+ make
Making all in doc
make[1]: Entering directory
`<http://river.suse.de/job/yast-instserver-HEAD/ws/checkout/doc'>
Making all in autodocs
make[2]: Entering directory
`<http://river.suse.de/job/yast-instserver-HEAD/ws/checkout/doc/autodocs'>
if [ -n "" ]; then /usr/lib/YaST2/bin/ycpdoc -d. -s./../../src ; fi
for i in ; do \
b=${i##./../../src}; b=${b#/}; b=${b//\//__}; b=${b%.pm}; \
pod2html --title=$b --infile=$i --outfile=$b.html; \
echo "<a href='$b.html'>${b/__/::}</a>" > $b.mod.html; \
done
if [ -n "./../../src/modules/Instserver.rb
./../../src/include/instserver/routines.rb
./../../src/include/instserver/dialogs.rb
./../../src/include/instserver/complex.rb
./../../src/include/instserver/helps.rb
./../../src/include/instserver/wizards.rb" ]; then yard doc --title
"yast2-instserver -- Development Documentation" -o . -m markdown
./../../src/modules/Instserver.rb ./../../src/include/instserver/routines.rb
./../../src/include/instserver/dialogs.rb
./../../src/include/instserver/complex.rb
./../../src/include/instserver/helps.rb
./../../src/include/instserver/wizards.rb; fi
[warn]: @param tag has unknown parameter name: string
in file `../../src/modules/Instserver.rb' near line 139
[warn]: @param tag has unknown parameter name: string
in file `../../src/modules/Instserver.rb' near line 241
[warn]: @param tag has unknown parameter name: string
in file `../../src/modules/Instserver.rb' near line 241
[warn]: @param tag has unknown parameter name: string
in file `../../src/modules/Instserver.rb' near line 335
[warn]: @param tag has unknown parameter name: string
in file `../../src/modules/Instserver.rb' near line 335
[warn]: @param tag has unknown parameter name: string
in file `../../src/modules/Instserver.rb' near line 434
[warn]: @param tag has unknown parameter name: string
in file `../../src/modules/Instserver.rb' near line 480
[warn]: @param tag has unknown parameter name: alias
in file `../../src/modules/Instserver.rb' near line 480
[warn]: @param tag has unknown parameter name: string
in file `../../src/modules/Instserver.rb' near line 554
[warn]: @param tag has unknown parameter name: string
in file `../../src/include/instserver/routines.rb' near line 60
[warn]: @param tag has unknown parameter name: string
in file `../../src/include/instserver/dialogs.rb' near line 34
[warn]: @param tag has unknown parameter name: boolean
in file `../../src/include/instserver/dialogs.rb' near line 34
[warn]: @param tag has unknown parameter name: string
in file `../../src/include/instserver/dialogs.rb' near line 190
[warn]: @param tag has unknown parameter name: symbol
in file `../../src/include/instserver/dialogs.rb' near line 190
[warn]: @param tag has unknown parameter name: boolean
in file `../../src/include/instserver/dialogs.rb' near line 190
[warn]: @param tag has unknown parameter name: boolean
in file `../../src/include/instserver/dialogs.rb' near line 190
Files: 6
Modules: 6 ( 5 undocumented)
Classes: 1 ( 1 undocumented)
Constants: 1 ( 1 undocumented)
Methods: 73 ( 31 undocumented)
53.09% documented
make[2]: Leaving directory
`<http://river.suse.de/job/yast-instserver-HEAD/ws/checkout/doc/autodocs'>
make[2]: Entering directory
`<http://river.suse.de/job/yast-instserver-HEAD/ws/checkout/doc'>
make[2]: Nothing to be done for `all-am'.
make[2]: Leaving directory
`<http://river.suse.de/job/yast-instserver-HEAD/ws/checkout/doc'>
make[1]: Leaving directory
`<http://river.suse.de/job/yast-instserver-HEAD/ws/checkout/doc'>
Making all in httpd
make[1]: Entering directory
`<http://river.suse.de/job/yast-instserver-HEAD/ws/checkout/httpd'>
make[1]: Nothing to be done for `all'.
make[1]: Leaving directory
`<http://river.suse.de/job/yast-instserver-HEAD/ws/checkout/httpd'>
Making all in src
make[1]: Entering directory
`<http://river.suse.de/job/yast-instserver-HEAD/ws/checkout/src'>
make[1]: Nothing to be done for `all'.
make[1]: Leaving directory
`<http://river.suse.de/job/yast-instserver-HEAD/ws/checkout/src'>
Making all in testsuite
make[1]: Entering directory
`<http://river.suse.de/job/yast-instserver-HEAD/ws/checkout/testsuite'>
make -f /usr/share/YaST2/data/testsuite/Makefile.testsuite
RPMNAME=yast2-instserver srcdir=.
make[2]: Entering directory
`<http://river.suse.de/job/yast-instserver-HEAD/ws/checkout/testsuite'>
make[2]: Nothing to be done for `all'.
make[2]: Leaving directory
`<http://river.suse.de/job/yast-instserver-HEAD/ws/checkout/testsuite'>
make[1]: Leaving directory
`<http://river.suse.de/job/yast-instserver-HEAD/ws/checkout/testsuite'>
make[1]: Entering directory
`<http://river.suse.de/job/yast-instserver-HEAD/ws/checkout'>
make[1]: Nothing to be done for `all-am'.
make[1]: Leaving directory
`<http://river.suse.de/job/yast-instserver-HEAD/ws/checkout'>
+ make check
Making check in doc
make[1]: Entering directory
`<http://river.suse.de/job/yast-instserver-HEAD/ws/checkout/doc'>
Making check in autodocs
make[2]: Entering directory
`<http://river.suse.de/job/yast-instserver-HEAD/ws/checkout/doc/autodocs'>
make[2]: Nothing to be done for `check'.
make[2]: Leaving directory
`<http://river.suse.de/job/yast-instserver-HEAD/ws/checkout/doc/autodocs'>
make[2]: Entering directory
`<http://river.suse.de/job/yast-instserver-HEAD/ws/checkout/doc'>
make[2]: Nothing to be done for `check-am'.
make[2]: Leaving directory
`<http://river.suse.de/job/yast-instserver-HEAD/ws/checkout/doc'>
make[1]: Leaving directory
`<http://river.suse.de/job/yast-instserver-HEAD/ws/checkout/doc'>
Making check in httpd
make[1]: Entering directory
`<http://river.suse.de/job/yast-instserver-HEAD/ws/checkout/httpd'>
make[1]: Nothing to be done for `check'.
make[1]: Leaving directory
`<http://river.suse.de/job/yast-instserver-HEAD/ws/checkout/httpd'>
Making check in src
make[1]: Entering directory
`<http://river.suse.de/job/yast-instserver-HEAD/ws/checkout/src'>
make[1]: Nothing to be done for `check'.
make[1]: Leaving directory
`<http://river.suse.de/job/yast-instserver-HEAD/ws/checkout/src'>
Making check in testsuite
make[1]: Entering directory
`<http://river.suse.de/job/yast-instserver-HEAD/ws/checkout/testsuite'>
make -f /usr/share/YaST2/data/testsuite/Makefile.testsuite
RPMNAME=yast2-instserver srcdir=.
make[2]: Entering directory
`<http://river.suse.de/job/yast-instserver-HEAD/ws/checkout/testsuite'>
make[2]: Nothing to be done for `all'.
make[2]: Leaving directory
`<http://river.suse.de/job/yast-instserver-HEAD/ws/checkout/testsuite'>
make check-DEJAGNU check-local
make[2]: Entering directory
`<http://river.suse.de/job/yast-instserver-HEAD/ws/checkout/testsuite'>
Making a new site.exp file ...
srcdir='.'; export srcdir; \
EXPECT=expect; export EXPECT; \
runtest=runtest; \
if /bin/sh -c "$runtest --version" > /dev/null 2>&1; then \
exit_status=0; l='yast2-instserver'; for tool in $l; do \
if $runtest --tool $tool --srcdir $srcdir ; \
then :; else exit_status=1; fi; \
done; \
else echo "WARNING: could not find 'runtest'" 1>&2; :;\
fi; \
exit $exit_status
WARNING: Couldn't find tool init file
Test Run By root on Tue Jul 30 14:35:47 2013
Native configuration is x86_64-suse-linux-gnu

=== yast2-instserver tests ===

Schedule of variations:
unix

Running target unix
Using /usr/share/dejagnu/baseboards/unix.exp as board description file for
target.
Using /usr/share/dejagnu/config/unix.exp as generic interface file for target.
Using ./config/unix.exp as tool-and-target-specific interface file.
Running ./yast2-instserver.test/testsuite.exp ...

Checking started

Running Instserver ...
FAIL: Wrong stderr for Instserver

The diff follows...

--- tests/Instserver.err 2013-01-22 11:22:55.000000000 +0100
+++ tmp.err.Instserver 2013-07-30 14:35:47.000000000 +0200
@@ -0,0 +1,6 @@
+2013-07-30 14:35:47 <3> app42(29927) [Interpreter] modules/Testsuite.rb:42
Loading module 'Progress' failed
+2013-07-30 14:35:47 <3> app42(29927) [libycp] Import.cc(import):97 No matching
component found
+2013-07-30 14:35:47 <3> app42(29927) [Interpreter] modules/Testsuite.rb:42
Import 'Progress' failed...
+2013-07-30 14:35:47 <3> app42(29927) [Interpreter] modules/Testsuite.rb:42
Could not create its namespace
+2013-07-30 14:35:47 <3> app42(29927) [libycp] Bytecode.cc(readFile):1161
Caught invalid bytecode in
'<http://river.suse.de/job/yast-instserver-HEAD/ws/checkout/src/Instserver.ybc'>
+2013-07-30 14:35:47 <3> app42(29927) [Interpreter] modules/Testsuite.rb:42
Loading module 'Instserver' failed

FAIL: Wrong stderr for Instserver
See the diff above.

Checking finished


=== yast2-instserver Summary ===

# of unexpected failures 2
make[2]: *** [check-DEJAGNU] Error 1
make[2]: Leaving directory
`<http://river.suse.de/job/yast-instserver-HEAD/ws/checkout/testsuite'>
make[1]: *** [check-am] Error 2
make[1]: Leaving directory
`<http://river.suse.de/job/yast-instserver-HEAD/ws/checkout/testsuite'>
make: *** [check-recursive] Error 1
++ error_exit 2
++ echo 'ERROR: detected exitcode 2'
ERROR: detected exitcode 2
++ cleanup
++ echo '==> Running cleanup'
==> Running cleanup
++ rm -f
<http://river.suse.de/job/yast-instserver-HEAD/ws/ICECC/40c0ab7e54f59a1e4e493c1ea90a882a.tar.gz>
++ footer_and_exit 1
++ '[' -z 1 ']'
++ MYEXIT=1
++ '[' 1 == 0 ']'
++ ascii_failed
++ cat

( )
( ) (
) _ )
( \_
_(_\ \)__
(____\___))

build failed

++ exit 1
Build step 'Execute shell' marked build as failure
--
To unsubscribe, e-mail: yast-devel+unsubscribe@xxxxxxxxxxxx
To contact the owner, e-mail: yast-devel+owner@xxxxxxxxxxxx

< Previous Next >
This Thread
Follow Ups
References