Mailinglist Archive: yast-devel (251 mails)

< Previous Next >
[yast-devel] Build failed in Jenkins: yast-kerberos-client-HEAD #124
  • From: hudson@xxxxxxx
  • Date: Tue, 30 Jul 2013 13:18:51 +0200 (CEST)
  • Message-id: <2135816807.78.1375183131284.JavaMail.jenkins@river>
See <http://river.suse.de/job/yast-kerberos-client-HEAD/124/changes>

Changes:

[yast-devel] YCP Killer: Unify YaST module structure

[yast-devel] YCP Killer: Apply changes needed for Ruby translation

[yast-devel] YCP Killer: Translate YCP files into Ruby

[yast-devel] YCP Killer: Regenerate Makefile.am files in all source directories

[yast-devel] version 3.0.0

------------------------------------------
[...truncated 181 lines...]
make[1]: Entering directory
`<http://river.suse.de/job/yast-kerberos-client-HEAD/ws/checkout/src'>
make[1]: Nothing to be done for `all'.
make[1]: Leaving directory
`<http://river.suse.de/job/yast-kerberos-client-HEAD/ws/checkout/src'>
Making all in testsuite
make[1]: Entering directory
`<http://river.suse.de/job/yast-kerberos-client-HEAD/ws/checkout/testsuite'>
make -f /usr/share/YaST2/data/testsuite/Makefile.testsuite
RPMNAME=yast2-kerberos-client srcdir=.
make[2]: Entering directory
`<http://river.suse.de/job/yast-kerberos-client-HEAD/ws/checkout/testsuite'>
mkdir -p ./run ./config ./yast2-kerberos-client.test ./tests
cp -f /usr/share/YaST2/data/testsuite/skel/default.exp config/default.exp
cp -f /usr/share/YaST2/data/testsuite/skel/unix.exp config/unix.exp
cp -f /usr/share/YaST2/data/testsuite/skel/unknown.exp config/unknown.exp
cp -f /usr/share/YaST2/data/testsuite/skel/testsuite.exp
yast2-kerberos-client.test/testsuite.exp
cp -f /usr/share/YaST2/data/testsuite/skel/runtest.sh run/runtest.sh
chmod +x run/runtest.sh
make[2]: Leaving directory
`<http://river.suse.de/job/yast-kerberos-client-HEAD/ws/checkout/testsuite'>
make[1]: Leaving directory
`<http://river.suse.de/job/yast-kerberos-client-HEAD/ws/checkout/testsuite'>
make[1]: Entering directory
`<http://river.suse.de/job/yast-kerberos-client-HEAD/ws/checkout'>
make[1]: Nothing to be done for `all-am'.
make[1]: Leaving directory
`<http://river.suse.de/job/yast-kerberos-client-HEAD/ws/checkout'>
+ make check
Making check in agents
make[1]: Entering directory
`<http://river.suse.de/job/yast-kerberos-client-HEAD/ws/checkout/agents'>
make[1]: Nothing to be done for `check'.
make[1]: Leaving directory
`<http://river.suse.de/job/yast-kerberos-client-HEAD/ws/checkout/agents'>
Making check in doc
make[1]: Entering directory
`<http://river.suse.de/job/yast-kerberos-client-HEAD/ws/checkout/doc'>
Making check in autodocs
make[2]: Entering directory
`<http://river.suse.de/job/yast-kerberos-client-HEAD/ws/checkout/doc/autodocs'>
if [ -n "" ]; then /usr/lib/YaST2/bin/ycpdoc -d. -s./../../src ; fi
for i in ; do \
b=${i##./../../src}; b=${b#/}; b=${b//\//__}; b=${b%.pm}; \
pod2html --title=$b --infile=$i --outfile=$b.html; \
echo "<a href='$b.html'>${b/__/::}</a>" > $b.mod.html; \
done
if [ -n "./../../src/modules/Kerberos.rb
./../../src/include/kerberos-client/dialogs.rb
./../../src/include/kerberos-client/wizards.rb" ]; then yard doc --title
"yast2-kerberos-client -- Development Documentation" -o . -m markdown
./../../src/modules/Kerberos.rb ./../../src/include/kerberos-client/dialogs.rb
./../../src/include/kerberos-client/wizards.rb; fi
[error]: Missing 'redcarpet' gem for Markdown formatting. Install it with `gem
install redcarpet`
make[2]: Leaving directory
`<http://river.suse.de/job/yast-kerberos-client-HEAD/ws/checkout/doc/autodocs'>
make[2]: Entering directory
`<http://river.suse.de/job/yast-kerberos-client-HEAD/ws/checkout/doc'>
make[2]: Nothing to be done for `check-am'.
make[2]: Leaving directory
`<http://river.suse.de/job/yast-kerberos-client-HEAD/ws/checkout/doc'>
make[1]: Leaving directory
`<http://river.suse.de/job/yast-kerberos-client-HEAD/ws/checkout/doc'>
Making check in src
make[1]: Entering directory
`<http://river.suse.de/job/yast-kerberos-client-HEAD/ws/checkout/src'>
make[1]: Nothing to be done for `check'.
make[1]: Leaving directory
`<http://river.suse.de/job/yast-kerberos-client-HEAD/ws/checkout/src'>
Making check in testsuite
make[1]: Entering directory
`<http://river.suse.de/job/yast-kerberos-client-HEAD/ws/checkout/testsuite'>
make -f /usr/share/YaST2/data/testsuite/Makefile.testsuite
RPMNAME=yast2-kerberos-client srcdir=.
make[2]: Entering directory
`<http://river.suse.de/job/yast-kerberos-client-HEAD/ws/checkout/testsuite'>
make[2]: Nothing to be done for `all'.
make[2]: Leaving directory
`<http://river.suse.de/job/yast-kerberos-client-HEAD/ws/checkout/testsuite'>
make check-DEJAGNU check-local
make[2]: Entering directory
`<http://river.suse.de/job/yast-kerberos-client-HEAD/ws/checkout/testsuite'>
Making a new site.exp file ...
srcdir='.'; export srcdir; \
EXPECT=expect; export EXPECT; \
runtest=runtest; \
if /bin/sh -c "$runtest --version" > /dev/null 2>&1; then \
exit_status=0; l='yast2-kerberos-client'; for tool in $l; do \
if $runtest --tool $tool --srcdir $srcdir ; \
then :; else exit_status=1; fi; \
done; \
else echo "WARNING: could not find 'runtest'" 1>&2; :;\
fi; \
exit $exit_status
WARNING: Couldn't find tool init file
Test Run By root on Tue Jul 30 13:18:46 2013
Native configuration is x86_64-suse-linux-gnu

=== yast2-kerberos-client tests ===

Schedule of variations:
unix

Running target unix
Using /usr/share/dejagnu/baseboards/unix.exp as board description file for
target.
Using /usr/share/dejagnu/config/unix.exp as generic interface file for target.
Using ./config/unix.exp as tool-and-target-specific interface file.
Running ./yast2-kerberos-client.test/testsuite.exp ...

Checking started

Running ImportExport ...
FAIL: Wrong stdout for ImportExport

The diff follows...

--- tests/ImportExport.out 2013-01-22 11:25:53.000000000 +0100
+++ tmp.out.ImportExport 2013-07-30 13:18:49.000000000 +0200
@@ -1,8 +1,4 @@
-Return true
-Return $["kerberos_client":$["ExpertSettings":$[], "clockskew":"300",
"default_domain":"", "default_realm":"", "forwardable":true,
"ignore_unknown":true, "kdc_server":"", "minimum_uid":"1", "proxiable":false,
"renew_lifetime":"1d", "ssh_support":false, "ticket_lifetime":"1d"],
"pam_login":$["sssd":false, "use_kerberos":false]]
Dump
Dump sssd: false
-Return true
-Return $["kerberos_client":$["ExpertSettings":$[], "clockskew":"300",
"default_domain":"", "default_realm":"", "forwardable":true,
"ignore_unknown":true, "kdc_server":"", "minimum_uid":"1", "proxiable":false,
"renew_lifetime":"1d", "ssh_support":false, "ticket_lifetime":"1d"],
"pam_login":$["sssd":true, "use_kerberos":false]]
Dump
Dump sssd: true

FAIL: Wrong stdout for ImportExport
See the diff above.
Running Read ...
FAIL: Wrong stdout for Read

The diff follows...

--- tests/Read.out 2013-01-22 11:25:53.000000000 +0100
+++ tmp.out.Read 2013-07-30 13:18:49.000000000 +0200
@@ -40,7 +40,6 @@
Read .etc.sssd_conf.v."domain/default"."krb5_renewable_lifetime" nil
Read .etc.sssd_conf.v."domain/default"."krb5_lifetime" nil
Read .etc.sssd_conf.v."domain/default"."krb5_validate" nil
-Return true
Dump ============================================
Dump kerberos used: true
Dump default realm: SUSE.DE
@@ -57,6 +56,5 @@
Read .etc.ssh.ssh_config.v."*"."GSSAPIAuthentication" "yes"
Read .etc.ssh.ssh_config.v."*"."GSSAPIDelegateCredentials" "yes"
Execute .target.bash_output "/usr/sbin/pam-config -q --sss"
$["stdout":"password: "]
-Return true
Dump default realm: SUSE.DE
Dump ============================================

FAIL: Wrong stdout for Read
See the diff above.
Running ReadKrb5ConfValue ...
FAIL: Wrong stdout for ReadKrb5ConfValue

The diff follows...

--- tests/ReadKrb5ConfValue.out 2013-01-22 11:25:53.000000000 +0100
+++ tmp.out.ReadKrb5ConfValue 2013-07-30 13:18:50.000000000 +0200
@@ -1,8 +1,4 @@
Read .etc.krb5_conf.v.libdefaults.default_realm ["SUSE.CZ"]
-Return SUSE.CZ
Read .etc.krb5_conf.v."SUSE.CZ"."kdc" ["chimera.suse.cz"]
-Return chimera.suse.cz
Read .etc.krb5_conf.v."SUSE.DE"."kdc" nil
-Return test.suse.de
Read .etc.krb5_conf.v.pam.ticket_lifetime nil
-Return 1d

FAIL: Wrong stdout for ReadKrb5ConfValue
See the diff above.
Running Write ...
FAIL: Wrong stdout for Write

The diff follows...

--- tests/Write.out 2013-01-22 11:25:53.000000000 +0100
+++ tmp.out.Write 2013-07-30 13:18:50.000000000 +0200
@@ -1,22 +1,18 @@
Dump ==== writing without any changes =================================
-Return true
Dump ==== pam enabled with krb5-ignore_unknown_principals=
Execute .target.bash_output "/usr/sbin/pam-config -a --krb5"
$["stdout":""]
Execute .target.bash_output "/usr/sbin/pam-config -q --ldap"
$["stdout":""]
Execute .target.bash_output "/usr/sbin/pam-config -a
--krb5-ignore_unknown_principals" $["stdout":""]
-Return true
Dump ==== ssh modified (enabled) ======================================
Write .etc.ssh.ssh_config.v."*"."GSSAPIAuthentication" "yes" true
Write .etc.ssh.ssh_config.v."*"."GSSAPIDelegateCredentials" "yes" true
Write .etc.ssh.ssh_config nil true
-Return true
Dump ==== kerberos disabled, ssh support disabled, krb5.conf untouched=
Execute .target.bash_output "/usr/sbin/pam-config -q
--ldap-account_only" $["stdout":""]
Execute .target.bash_output "/usr/sbin/pam-config -d --krb5"
$["stdout":""]
Write .etc.ssh.ssh_config.v."*"."GSSAPIAuthentication" "no" true
Write .etc.ssh.ssh_config.v."*"."GSSAPIDelegateCredentials" "no" true
Write .etc.ssh.ssh_config nil true
-Return true
Dump ==== only krb5.conf modified =====================================
Dump ==== (all sections exist) ========================================
Write .etc.krb5_conf.v.libdefaults.default_realm ["SUSE.CZ"] true
@@ -31,7 +27,6 @@
Write .etc.krb5_conf.v.pam."proxiable" ["false"] true
Write .etc.krb5_conf.v.pam."minimum_uid" ["1"] true
Write .etc.krb5_conf nil true
-Return true
Dump ==== (pam section doesn't exist) =================================
Write .etc.krb5_conf.v.libdefaults.default_realm ["SUSE.CZ"] true
Write .etc.krb5_conf.v.libdefaults.clockskew ["300"] true
@@ -45,4 +40,3 @@
Write .etc.krb5_conf.v.appdefaults.pam."proxiable" ["false"] true
Write .etc.krb5_conf.v.appdefaults.pam."minimum_uid" ["1"] true
Write .etc.krb5_conf nil true
-Return true

FAIL: Wrong stdout for Write
See the diff above.
Running WriteKrb5ConfValue ...
FAIL: Wrong stdout for WriteKrb5ConfValue

The diff follows...

--- tests/WriteKrb5ConfValue.out 2013-01-22 11:25:53.000000000 +0100
+++ tmp.out.WriteKrb5ConfValue 2013-07-30 13:18:51.000000000 +0200
@@ -1,10 +1,5 @@
Write .etc.krb5_conf.v.libdefaults.default_realm ["SUSE"] true
-Return true
Write .etc.krb5_conf.v.libdefaults.default_realm nil true
-Return true
Write .etc.krb5_conf.v.libdefaults.default_realm nil true
-Return true
Write .etc.krb5_conf.v.SUSE.kdc ["kdc.suse.cz", "kdc.suse.de"] true
-Return true
Write .etc.krb5_conf.v.SUSE.kdc ["kdc.suse.cz", "kdc.suse.de"] true
-Return true

FAIL: Wrong stdout for WriteKrb5ConfValue
See the diff above.

Checking finished


=== yast2-kerberos-client Summary ===

# of unexpected failures 10
make[2]: *** [check-DEJAGNU] Error 1
make[2]: Leaving directory
`<http://river.suse.de/job/yast-kerberos-client-HEAD/ws/checkout/testsuite'>
make[1]: *** [check-am] Error 2
make[1]: Leaving directory
`<http://river.suse.de/job/yast-kerberos-client-HEAD/ws/checkout/testsuite'>
make: *** [check-recursive] Error 1
++ error_exit 2
++ echo 'ERROR: detected exitcode 2'
ERROR: detected exitcode 2
++ cleanup
++ echo '==> Running cleanup'
==> Running cleanup
++ rm -f
<http://river.suse.de/job/yast-kerberos-client-HEAD/ws/ICECC/40c0ab7e54f59a1e4e493c1ea90a882a.tar.gz>
++ footer_and_exit 1
++ '[' -z 1 ']'
++ MYEXIT=1
++ '[' 1 == 0 ']'
++ ascii_failed
++ cat

( )
( ) (
) _ )
( \_
_(_\ \)__
(____\___))

build failed

++ exit 1
Build step 'Execute shell' marked build as failure
--
To unsubscribe, e-mail: yast-devel+unsubscribe@xxxxxxxxxxxx
To contact the owner, e-mail: yast-devel+owner@xxxxxxxxxxxx

< Previous Next >
Follow Ups