Mailinglist Archive: yast-devel (251 mails)

< Previous Next >
[yast-devel] Build failed in Jenkins: yast-firstboot-HEAD #236
  • From: hudson@xxxxxxx
  • Date: Tue, 30 Jul 2013 13:03:37 +0200 (CEST)
  • Message-id: <1189604663.54.1375182217969.JavaMail.jenkins@river>
See <http://river.suse.de/job/yast-firstboot-HEAD/236/changes>

Changes:

[yast-devel] YCP Killer: Unify YaST module structure

[yast-devel] YCP Killer: Apply changes needed for Ruby translation

[yast-devel] YCP Killer: Translate YCP files into Ruby

[yast-devel] YCP Killer: Regenerate Makefile.am files in all source directories

------------------------------------------
[...truncated 178 lines...]
/usr/lib/YaST2/bin/ycpmakedep --prefix=/usr > ../.dep.new
cat ../.dep.new > .dep
rm ../.dep.new
make[1]: Leaving directory
`<http://river.suse.de/job/yast-firstboot-HEAD/ws/checkout/desktop'>
make[1]: Entering directory
`<http://river.suse.de/job/yast-firstboot-HEAD/ws/checkout/desktop'>
make[1]: Nothing to be done for `all'.
make[1]: Leaving directory
`<http://river.suse.de/job/yast-firstboot-HEAD/ws/checkout/desktop'>
Making all in doc
make[1]: Entering directory
`<http://river.suse.de/job/yast-firstboot-HEAD/ws/checkout/doc'>
Making all in autodocs
make[2]: Entering directory
`<http://river.suse.de/job/yast-firstboot-HEAD/ws/checkout/doc/autodocs'>
if [ -n "" ]; then /usr/lib/YaST2/bin/ycpdoc -d. -s./../../src ; fi
for i in ; do \
b=${i##./../../src}; b=${b#/}; b=${b//\//__}; b=${b%.pm}; \
pod2html --title=$b --infile=$i --outfile=$b.html; \
echo "<a href='$b.html'>${b/__/::}</a>" > $b.mod.html; \
done
if [ -n "./../../src/modules/Firstboot.rb
./../../src/include/firstboot/routines.rb" ]; then yard doc --title
"yast2-firstboot -- Development Documentation" -o . -m markdown
./../../src/modules/Firstboot.rb ./../../src/include/firstboot/routines.rb; fi
[error]: Missing 'redcarpet' gem for Markdown formatting. Install it with `gem
install redcarpet`
make[2]: Leaving directory
`<http://river.suse.de/job/yast-firstboot-HEAD/ws/checkout/doc/autodocs'>
make[2]: Entering directory
`<http://river.suse.de/job/yast-firstboot-HEAD/ws/checkout/doc'>
XML_CATALOG_FILES=/etc/xml/catalog \
/usr/bin/xsltproc --nonet --xinclude \
/usr/share/YaST2/data/docbook/stylesheets/customize-html.xsl firstboot-doc.xml
Writing html/index.html for article
cp /usr/share/YaST2/data/docbook/css/yast2docs.css html
cp -a `pkg-config --variable=yast2dir yast2-devtools`/data/docbook/images html
make[2]: Leaving directory
`<http://river.suse.de/job/yast-firstboot-HEAD/ws/checkout/doc'>
make[1]: Leaving directory
`<http://river.suse.de/job/yast-firstboot-HEAD/ws/checkout/doc'>
Making all in scripts
make[1]: Entering directory
`<http://river.suse.de/job/yast-firstboot-HEAD/ws/checkout/scripts'>
Making all in Firstboot-Stage
make[2]: Entering directory
`<http://river.suse.de/job/yast-firstboot-HEAD/ws/checkout/scripts/Firstboot-Stage'>
make[2]: Nothing to be done for `all'.
make[2]: Leaving directory
`<http://river.suse.de/job/yast-firstboot-HEAD/ws/checkout/scripts/Firstboot-Stage'>
make[2]: Entering directory
`<http://river.suse.de/job/yast-firstboot-HEAD/ws/checkout/scripts'>
make[2]: Nothing to be done for `all-am'.
make[2]: Leaving directory
`<http://river.suse.de/job/yast-firstboot-HEAD/ws/checkout/scripts'>
make[1]: Leaving directory
`<http://river.suse.de/job/yast-firstboot-HEAD/ws/checkout/scripts'>
Making all in src
make[1]: Entering directory
`<http://river.suse.de/job/yast-firstboot-HEAD/ws/checkout/src'>
make[1]: Nothing to be done for `all'.
make[1]: Leaving directory
`<http://river.suse.de/job/yast-firstboot-HEAD/ws/checkout/src'>
Making all in testsuite
make[1]: Entering directory
`<http://river.suse.de/job/yast-firstboot-HEAD/ws/checkout/testsuite'>
make -f /usr/share/YaST2/data/testsuite/Makefile.testsuite
RPMNAME=yast2-firstboot srcdir=.
make[2]: Entering directory
`<http://river.suse.de/job/yast-firstboot-HEAD/ws/checkout/testsuite'>
mkdir -p ./run ./config ./yast2-firstboot.test ./tests
cp -f /usr/share/YaST2/data/testsuite/skel/default.exp config/default.exp
cp -f /usr/share/YaST2/data/testsuite/skel/unix.exp config/unix.exp
cp -f /usr/share/YaST2/data/testsuite/skel/unknown.exp config/unknown.exp
cp -f /usr/share/YaST2/data/testsuite/skel/testsuite.exp
yast2-firstboot.test/testsuite.exp
cp -f /usr/share/YaST2/data/testsuite/skel/runtest.sh run/runtest.sh
chmod +x run/runtest.sh
make[2]: Leaving directory
`<http://river.suse.de/job/yast-firstboot-HEAD/ws/checkout/testsuite'>
make[1]: Leaving directory
`<http://river.suse.de/job/yast-firstboot-HEAD/ws/checkout/testsuite'>
make[1]: Entering directory
`<http://river.suse.de/job/yast-firstboot-HEAD/ws/checkout'>
make[1]: Nothing to be done for `all-am'.
make[1]: Leaving directory
`<http://river.suse.de/job/yast-firstboot-HEAD/ws/checkout'>
+ make check
Making check in agents
make[1]: Entering directory
`<http://river.suse.de/job/yast-firstboot-HEAD/ws/checkout/agents'>
make[1]: Nothing to be done for `check'.
make[1]: Leaving directory
`<http://river.suse.de/job/yast-firstboot-HEAD/ws/checkout/agents'>
Making check in control
make[1]: Entering directory
`<http://river.suse.de/job/yast-firstboot-HEAD/ws/checkout/control'>
make[1]: Nothing to be done for `check'.
make[1]: Leaving directory
`<http://river.suse.de/job/yast-firstboot-HEAD/ws/checkout/control'>
Making check in desktop
make[1]: Entering directory
`<http://river.suse.de/job/yast-firstboot-HEAD/ws/checkout/desktop'>
make[1]: Nothing to be done for `check'.
make[1]: Leaving directory
`<http://river.suse.de/job/yast-firstboot-HEAD/ws/checkout/desktop'>
Making check in doc
make[1]: Entering directory
`<http://river.suse.de/job/yast-firstboot-HEAD/ws/checkout/doc'>
Making check in autodocs
make[2]: Entering directory
`<http://river.suse.de/job/yast-firstboot-HEAD/ws/checkout/doc/autodocs'>
if [ -n "" ]; then /usr/lib/YaST2/bin/ycpdoc -d. -s./../../src ; fi
for i in ; do \
b=${i##./../../src}; b=${b#/}; b=${b//\//__}; b=${b%.pm}; \
pod2html --title=$b --infile=$i --outfile=$b.html; \
echo "<a href='$b.html'>${b/__/::}</a>" > $b.mod.html; \
done
if [ -n "./../../src/modules/Firstboot.rb
./../../src/include/firstboot/routines.rb" ]; then yard doc --title
"yast2-firstboot -- Development Documentation" -o . -m markdown
./../../src/modules/Firstboot.rb ./../../src/include/firstboot/routines.rb; fi
[error]: Missing 'redcarpet' gem for Markdown formatting. Install it with `gem
install redcarpet`
make[2]: Leaving directory
`<http://river.suse.de/job/yast-firstboot-HEAD/ws/checkout/doc/autodocs'>
make[2]: Entering directory
`<http://river.suse.de/job/yast-firstboot-HEAD/ws/checkout/doc'>
make[2]: Nothing to be done for `check-am'.
make[2]: Leaving directory
`<http://river.suse.de/job/yast-firstboot-HEAD/ws/checkout/doc'>
make[1]: Leaving directory
`<http://river.suse.de/job/yast-firstboot-HEAD/ws/checkout/doc'>
Making check in scripts
make[1]: Entering directory
`<http://river.suse.de/job/yast-firstboot-HEAD/ws/checkout/scripts'>
Making check in Firstboot-Stage
make[2]: Entering directory
`<http://river.suse.de/job/yast-firstboot-HEAD/ws/checkout/scripts/Firstboot-Stage'>
make[2]: Nothing to be done for `check'.
make[2]: Leaving directory
`<http://river.suse.de/job/yast-firstboot-HEAD/ws/checkout/scripts/Firstboot-Stage'>
make[2]: Entering directory
`<http://river.suse.de/job/yast-firstboot-HEAD/ws/checkout/scripts'>
make[2]: Nothing to be done for `check-am'.
make[2]: Leaving directory
`<http://river.suse.de/job/yast-firstboot-HEAD/ws/checkout/scripts'>
make[1]: Leaving directory
`<http://river.suse.de/job/yast-firstboot-HEAD/ws/checkout/scripts'>
Making check in src
make[1]: Entering directory
`<http://river.suse.de/job/yast-firstboot-HEAD/ws/checkout/src'>
make[1]: Nothing to be done for `check'.
make[1]: Leaving directory
`<http://river.suse.de/job/yast-firstboot-HEAD/ws/checkout/src'>
Making check in testsuite
make[1]: Entering directory
`<http://river.suse.de/job/yast-firstboot-HEAD/ws/checkout/testsuite'>
make -f /usr/share/YaST2/data/testsuite/Makefile.testsuite
RPMNAME=yast2-firstboot srcdir=.
make[2]: Entering directory
`<http://river.suse.de/job/yast-firstboot-HEAD/ws/checkout/testsuite'>
make[2]: Nothing to be done for `all'.
make[2]: Leaving directory
`<http://river.suse.de/job/yast-firstboot-HEAD/ws/checkout/testsuite'>
make check-DEJAGNU check-local
make[2]: Entering directory
`<http://river.suse.de/job/yast-firstboot-HEAD/ws/checkout/testsuite'>
Making a new site.exp file ...
srcdir='.'; export srcdir; \
EXPECT=expect; export EXPECT; \
runtest=runtest; \
if /bin/sh -c "$runtest --version" > /dev/null 2>&1; then \
exit_status=0; l='yast2-firstboot'; for tool in $l; do \
if $runtest --tool $tool --srcdir $srcdir ; \
then :; else exit_status=1; fi; \
done; \
else echo "WARNING: could not find 'runtest'" 1>&2; :;\
fi; \
exit $exit_status
WARNING: Couldn't find tool init file
Test Run By root on Tue Jul 30 13:03:37 2013
Native configuration is x86_64-suse-linux-gnu

=== yast2-firstboot tests ===

Schedule of variations:
unix

Running target unix
Using /usr/share/dejagnu/baseboards/unix.exp as board description file for
target.
Using /usr/share/dejagnu/config/unix.exp as generic interface file for target.
Using ./config/unix.exp as tool-and-target-specific interface file.
Running ./yast2-firstboot.test/testsuite.exp ...
ERROR: tcl error sourcing ./yast2-firstboot.test/testsuite.exp.
ERROR: no files matched glob pattern "./tests/*.{ycp,rb}"
while executing
"glob "$srcdir/tests/$pattern.{ycp,rb}""
invoked from within
"lsort [glob "$srcdir/tests/$pattern.{ycp,rb}"]"
invoked from within
"set filenames [lsort [glob "$srcdir/tests/$pattern.{ycp,rb}"]]"
(file "./yast2-firstboot.test/testsuite.exp" line 18)
invoked from within
"source ./yast2-firstboot.test/testsuite.exp"
("uplevel" body line 1)
invoked from within
"uplevel #0 source ./yast2-firstboot.test/testsuite.exp"
invoked from within
"catch "uplevel #0 source $test_file_name""

=== yast2-firstboot Summary ===

make -f /usr/share/YaST2/data/testsuite/Makefile.testsuite
RPMNAME=yast2-firstboot srcdir=. check
make[3]: Entering directory
`<http://river.suse.de/job/yast-firstboot-HEAD/ws/checkout/testsuite'>

Parse YCP
NOT RUNNING

make[3]: Leaving directory
`<http://river.suse.de/job/yast-firstboot-HEAD/ws/checkout/testsuite'>
make[2]: Leaving directory
`<http://river.suse.de/job/yast-firstboot-HEAD/ws/checkout/testsuite'>
make[1]: Leaving directory
`<http://river.suse.de/job/yast-firstboot-HEAD/ws/checkout/testsuite'>
make[1]: Entering directory
`<http://river.suse.de/job/yast-firstboot-HEAD/ws/checkout'>
make[1]: Nothing to be done for `check-am'.
make[1]: Leaving directory
`<http://river.suse.de/job/yast-firstboot-HEAD/ws/checkout'>
+ make install
Making install in agents
make[1]: Entering directory
`<http://river.suse.de/job/yast-firstboot-HEAD/ws/checkout/agents'>
make[2]: Entering directory
`<http://river.suse.de/job/yast-firstboot-HEAD/ws/checkout/agents'>
make[2]: Nothing to be done for `install-exec-am'.
make[2]: Nothing to be done for `install-data-am'.
make[2]: Leaving directory
`<http://river.suse.de/job/yast-firstboot-HEAD/ws/checkout/agents'>
make[1]: Leaving directory
`<http://river.suse.de/job/yast-firstboot-HEAD/ws/checkout/agents'>
Making install in control
make[1]: Entering directory
`<http://river.suse.de/job/yast-firstboot-HEAD/ws/checkout/control'>
make[2]: Entering directory
`<http://river.suse.de/job/yast-firstboot-HEAD/ws/checkout/control'>
make[2]: Nothing to be done for `install-exec-am'.
/usr/bin/mkdir -p '/etc/YaST2'
/usr/bin/install -c -p -m 644 firstboot.xml '/etc/YaST2'
make[2]: Leaving directory
`<http://river.suse.de/job/yast-firstboot-HEAD/ws/checkout/control'>
make[1]: Leaving directory
`<http://river.suse.de/job/yast-firstboot-HEAD/ws/checkout/control'>
Making install in desktop
make[1]: Entering directory
`<http://river.suse.de/job/yast-firstboot-HEAD/ws/checkout/desktop'>
make[2]: Entering directory
`<http://river.suse.de/job/yast-firstboot-HEAD/ws/checkout/desktop'>
make[2]: Nothing to be done for `install-exec-am'.
/usr/bin/mkdir -p '/usr/share/autoinstall/modules'
/usr/bin/install -c -p -m 644 firstboot.desktop
'/usr/share/autoinstall/modules'
make[2]: Leaving directory
`<http://river.suse.de/job/yast-firstboot-HEAD/ws/checkout/desktop'>
make[1]: Leaving directory
`<http://river.suse.de/job/yast-firstboot-HEAD/ws/checkout/desktop'>
Making install in doc
make[1]: Entering directory
`<http://river.suse.de/job/yast-firstboot-HEAD/ws/checkout/doc'>
Making install in autodocs
make[2]: Entering directory
`<http://river.suse.de/job/yast-firstboot-HEAD/ws/checkout/doc/autodocs'>
if [ -n "" ]; then /usr/lib/YaST2/bin/ycpdoc -d. -s./../../src ; fi
for i in ; do \
b=${i##./../../src}; b=${b#/}; b=${b//\//__}; b=${b%.pm}; \
pod2html --title=$b --infile=$i --outfile=$b.html; \
echo "<a href='$b.html'>${b/__/::}</a>" > $b.mod.html; \
done
if [ -n "./../../src/modules/Firstboot.rb
./../../src/include/firstboot/routines.rb" ]; then yard doc --title
"yast2-firstboot -- Development Documentation" -o . -m markdown
./../../src/modules/Firstboot.rb ./../../src/include/firstboot/routines.rb; fi
[error]: Missing 'redcarpet' gem for Markdown formatting. Install it with `gem
install redcarpet`
make[3]: Entering directory
`<http://river.suse.de/job/yast-firstboot-HEAD/ws/checkout/doc/autodocs'>
make[3]: Nothing to be done for `install-exec-am'.
if [ -n "" ]; then /usr/lib/YaST2/bin/ycpdoc -d. -s./../../src ; fi
for i in ; do \
b=${i##./../../src}; b=${b#/}; b=${b//\//__}; b=${b%.pm}; \
pod2html --title=$b --infile=$i --outfile=$b.html; \
echo "<a href='$b.html'>${b/__/::}</a>" > $b.mod.html; \
done
if [ -n "./../../src/modules/Firstboot.rb
./../../src/include/firstboot/routines.rb" ]; then yard doc --title
"yast2-firstboot -- Development Documentation" -o . -m markdown
./../../src/modules/Firstboot.rb ./../../src/include/firstboot/routines.rb; fi
[error]: Missing 'redcarpet' gem for Markdown formatting. Install it with `gem
install redcarpet`
/usr/bin/mkdir -p '/usr/share/doc/packages/yast2-firstboot//autodocs'
/usr/bin/install -c -p -m 644 ./index.html
'/usr/share/doc/packages/yast2-firstboot//autodocs/.'
/usr/bin/install: cannot stat ‘./index.html’: No such file or directory
make[3]: *** [install-nobase_htmlDATA] Error 1
make[3]: Leaving directory
`<http://river.suse.de/job/yast-firstboot-HEAD/ws/checkout/doc/autodocs'>
make[2]: *** [install-am] Error 2
make[2]: Leaving directory
`<http://river.suse.de/job/yast-firstboot-HEAD/ws/checkout/doc/autodocs'>
make[1]: *** [install-recursive] Error 1
make[1]: Leaving directory
`<http://river.suse.de/job/yast-firstboot-HEAD/ws/checkout/doc'>
make: *** [install-recursive] Error 1
++ error_exit 2
++ echo 'ERROR: detected exitcode 2'
ERROR: detected exitcode 2
++ cleanup
++ echo '==> Running cleanup'
==> Running cleanup
++ rm -f
<http://river.suse.de/job/yast-firstboot-HEAD/ws/ICECC/40c0ab7e54f59a1e4e493c1ea90a882a.tar.gz>
++ footer_and_exit 1
++ '[' -z 1 ']'
++ MYEXIT=1
++ '[' 1 == 0 ']'
++ ascii_failed
++ cat

( )
( ) (
) _ )
( \_
_(_\ \)__
(____\___))

build failed

++ exit 1
Build step 'Execute shell' marked build as failure
--
To unsubscribe, e-mail: yast-devel+unsubscribe@xxxxxxxxxxxx
To contact the owner, e-mail: yast-devel+owner@xxxxxxxxxxxx

< Previous Next >
This Thread
Follow Ups