Mailinglist Archive: yast-commit (1173 mails)

< Previous Next >
[yast-commit] Build failed in Jenkins: yast-yast-autoinstallation-master #7
  • From: admin@xxxxxxxxxxxx
  • Date: Thu, 23 Aug 2018 13:58:52 +0000 (UTC)
  • Message-id: <530200067.16.1535032732919.JavaMail.jenkins@ci-opensuse>
See
<http://ci.opensuse.org/job/yast-yast-autoinstallation-master/7/display/redirect?page=changes>

Changes:

[teclator] AutoInstallRules: increased maxdepth default for merging profiles

[teclator] Bump version & changelog.

[teclator] Changes based on CR.

[teclator] Use the new Popup Api for showing the XML errors

[schubi] fixed typo and added testcases

[schubi] packaging

[schubi] spelling

------------------------------------------
[...truncated 172.04 KB...]
[ 27s]
[ 27s] An error occurred while loading ./AutoinstPartPlan_test.rb.
[ 27s] Failure/Error: import_pure(mname)
[ 27s]
[ 27s] RuntimeError:
[ 27s] Failed to load Module 'Profile' due to: Failed to load Module
'AutoinstConfig' due to: Failed to load Module 'ServicesManagerTarget' due to:
component cannot import namespace 'SystemdTarget'
[ 27s] # /usr/share/YaST2/modules/services_manager_target.rb:5:in
`<module:Yast>'
[ 27s] # /usr/share/YaST2/modules/services_manager_target.rb:3:in `<top
(required)>'
[ 27s] #
/home/abuild/rpmbuild/BUILD/autoyast2-4.0.61/src/modules/AutoinstConfig.rb:13:in
`<module:Yast>'
[ 27s] #
/home/abuild/rpmbuild/BUILD/autoyast2-4.0.61/src/modules/AutoinstConfig.rb:12:in
`<top (required)>'
[ 27s] #
/home/abuild/rpmbuild/BUILD/autoyast2-4.0.61/src/modules/Profile.rb:67:in `main'
[ 27s] #
/home/abuild/rpmbuild/BUILD/autoyast2-4.0.61/src/modules/Profile.rb:960:in
`<module:Yast>'
[ 27s] #
/home/abuild/rpmbuild/BUILD/autoyast2-4.0.61/src/modules/Profile.rb:12:in `<top
(required)>'
[ 27s] # ./AutoinstPartPlan_test.rb:7:in `<top (required)>'
[ 27s] No examples found.
[ 27s]
[ 27s]
[ 27s] Finished in 0.00034 seconds (files took 0.81937 seconds to load)
[ 27s] 0 examples, 0 failures, 1 error occurred outside of examples
[ 27s]
[ 27s] FAIL AutoinstPartPlan_test.rb (exit status: 1)
[ 27s]
[ 27s] FAIL: AutoinstSoftware_test
[ 27s] ===========================
[ 27s]
[ 27s]
[ 27s] An error occurred while loading ./AutoinstSoftware_test.rb.
[ 27s] Failure/Error: import_pure(mname)
[ 27s]
[ 27s] RuntimeError:
[ 27s] Failed to load Module 'AutoinstSoftware' due to: Failed to load
Module 'Profile' due to: Failed to load Module 'AutoinstConfig' due to: Failed
to load Module 'ServicesManagerTarget' due to: component cannot import
namespace 'SystemdTarget'
[ 27s] # /usr/share/YaST2/modules/services_manager_target.rb:5:in
`<module:Yast>'
[ 27s] # /usr/share/YaST2/modules/services_manager_target.rb:3:in `<top
(required)>'
[ 27s] #
/home/abuild/rpmbuild/BUILD/autoyast2-4.0.61/src/modules/AutoinstConfig.rb:13:in
`<module:Yast>'
[ 27s] #
/home/abuild/rpmbuild/BUILD/autoyast2-4.0.61/src/modules/AutoinstConfig.rb:12:in
`<top (required)>'
[ 27s] #
/home/abuild/rpmbuild/BUILD/autoyast2-4.0.61/src/modules/Profile.rb:67:in `main'
[ 27s] #
/home/abuild/rpmbuild/BUILD/autoyast2-4.0.61/src/modules/Profile.rb:960:in
`<module:Yast>'
[ 27s] #
/home/abuild/rpmbuild/BUILD/autoyast2-4.0.61/src/modules/Profile.rb:12:in `<top
(required)>'
[ 27s] #
/home/abuild/rpmbuild/BUILD/autoyast2-4.0.61/src/modules/AutoinstSoftware.rb:31:in
`main'
[ 27s] #
/home/abuild/rpmbuild/BUILD/autoyast2-4.0.61/src/modules/AutoinstSoftware.rb:1218:in
`<module:Yast>'
[ 27s] #
/home/abuild/rpmbuild/BUILD/autoyast2-4.0.61/src/modules/AutoinstSoftware.rb:14:in
`<top (required)>'
[ 27s] # ./AutoinstSoftware_test.rb:5:in `<top (required)>'
[ 27s] No examples found.
[ 27s]
[ 27s]
[ 27s] Finished in 0.00031 seconds (files took 0.86761 seconds to load)
[ 27s] 0 examples, 0 failures, 1 error occurred outside of examples
[ 27s]
[ 27s] FAIL AutoinstSoftware_test.rb (exit status: 1)
[ 27s]
[ 27s] FAIL: profile_test
[ 27s] ==================
[ 27s]
[ 27s]
[ 27s] An error occurred while loading ./profile_test.rb.
[ 27s] Failure/Error: import_pure(mname)
[ 27s]
[ 27s] RuntimeError:
[ 27s] Failed to load Module 'Profile' due to: Failed to load Module
'AutoinstConfig' due to: Failed to load Module 'ServicesManagerTarget' due to:
component cannot import namespace 'SystemdTarget'
[ 27s] # /usr/share/YaST2/modules/services_manager_target.rb:5:in
`<module:Yast>'
[ 27s] # /usr/share/YaST2/modules/services_manager_target.rb:3:in `<top
(required)>'
[ 27s] #
/home/abuild/rpmbuild/BUILD/autoyast2-4.0.61/src/modules/AutoinstConfig.rb:13:in
`<module:Yast>'
[ 27s] #
/home/abuild/rpmbuild/BUILD/autoyast2-4.0.61/src/modules/AutoinstConfig.rb:12:in
`<top (required)>'
[ 27s] #
/home/abuild/rpmbuild/BUILD/autoyast2-4.0.61/src/modules/Profile.rb:67:in `main'
[ 27s] #
/home/abuild/rpmbuild/BUILD/autoyast2-4.0.61/src/modules/Profile.rb:960:in
`<module:Yast>'
[ 27s] #
/home/abuild/rpmbuild/BUILD/autoyast2-4.0.61/src/modules/Profile.rb:12:in `<top
(required)>'
[ 27s] # ./profile_test.rb:5:in `<top (required)>'
[ 27s] No examples found.
[ 27s]
[ 27s]
[ 27s] Finished in 0.00034 seconds (files took 0.36457 seconds to load)
[ 27s] 0 examples, 0 failures, 1 error occurred outside of examples
[ 27s]
[ 27s] FAIL profile_test.rb (exit status: 1)
[ 27s]
[ 27s] FAIL: Y2ModuleConfig_test
[ 27s] =========================
[ 27s]
[ 27s]
[ 27s] An error occurred while loading ./Y2ModuleConfig_test.rb.
[ 27s] Failure/Error: import_pure(mname)
[ 27s]
[ 27s] RuntimeError:
[ 27s] Failed to load Module 'Y2ModuleConfig' due to: Failed to load Module
'Profile' due to: Failed to load Module 'AutoinstConfig' due to: Failed to load
Module 'ServicesManagerTarget' due to: component cannot import namespace
'SystemdTarget'
[ 27s] # /usr/share/YaST2/modules/services_manager_target.rb:5:in
`<module:Yast>'
[ 27s] # /usr/share/YaST2/modules/services_manager_target.rb:3:in `<top
(required)>'
[ 27s] #
/home/abuild/rpmbuild/BUILD/autoyast2-4.0.61/src/modules/AutoinstConfig.rb:13:in
`<module:Yast>'
[ 27s] #
/home/abuild/rpmbuild/BUILD/autoyast2-4.0.61/src/modules/AutoinstConfig.rb:12:in
`<top (required)>'
[ 27s] #
/home/abuild/rpmbuild/BUILD/autoyast2-4.0.61/src/modules/Profile.rb:67:in `main'
[ 27s] #
/home/abuild/rpmbuild/BUILD/autoyast2-4.0.61/src/modules/Profile.rb:960:in
`<module:Yast>'
[ 27s] #
/home/abuild/rpmbuild/BUILD/autoyast2-4.0.61/src/modules/Profile.rb:12:in `<top
(required)>'
[ 27s] #
/home/abuild/rpmbuild/BUILD/autoyast2-4.0.61/src/modules/Y2ModuleConfig.rb:26:in
`main'
[ 27s] #
/home/abuild/rpmbuild/BUILD/autoyast2-4.0.61/src/modules/Y2ModuleConfig.rb:434:in
`<module:Yast>'
[ 27s] #
/home/abuild/rpmbuild/BUILD/autoyast2-4.0.61/src/modules/Y2ModuleConfig.rb:11:in
`<top (required)>'
[ 27s] # ./Y2ModuleConfig_test.rb:6:in `<top (required)>'
[ 27s] No examples found.
[ 27s]
[ 27s]
[ 27s] Finished in 0.00036 seconds (files took 0.39743 seconds to load)
[ 27s] 0 examples, 0 failures, 1 error occurred outside of examples
[ 27s]
[ 27s] FAIL Y2ModuleConfig_test.rb (exit status: 1)
[ 27s]
[ 27s] FAIL: include/ask_test
[ 27s] ======================
[ 27s]
[ 27s]
[ 27s] An error occurred while loading ./include/ask_test.rb.
[ 27s] Failure/Error: import_pure(mname)
[ 27s]
[ 27s] RuntimeError:
[ 27s] Failed to load Module 'Profile' due to: Failed to load Module
'AutoinstConfig' due to: Failed to load Module 'ServicesManagerTarget' due to:
component cannot import namespace 'SystemdTarget'
[ 27s] # /usr/share/YaST2/modules/services_manager_target.rb:5:in
`<module:Yast>'
[ 27s] # /usr/share/YaST2/modules/services_manager_target.rb:3:in `<top
(required)>'
[ 27s] #
/home/abuild/rpmbuild/BUILD/autoyast2-4.0.61/src/modules/AutoinstConfig.rb:13:in
`<module:Yast>'
[ 27s] #
/home/abuild/rpmbuild/BUILD/autoyast2-4.0.61/src/modules/AutoinstConfig.rb:12:in
`<top (required)>'
[ 27s] #
/home/abuild/rpmbuild/BUILD/autoyast2-4.0.61/src/modules/Profile.rb:67:in `main'
[ 27s] #
/home/abuild/rpmbuild/BUILD/autoyast2-4.0.61/src/modules/Profile.rb:960:in
`<module:Yast>'
[ 27s] #
/home/abuild/rpmbuild/BUILD/autoyast2-4.0.61/src/modules/Profile.rb:12:in `<top
(required)>'
[ 27s] # ./include/ask_test.rb:7:in `<top (required)>'
[ 27s] No examples found.
[ 27s]
[ 27s]
[ 27s] Finished in 0.00029 seconds (files took 0.34894 seconds to load)
[ 27s] 0 examples, 0 failures, 1 error occurred outside of examples
[ 27s]
[ 27s] FAIL include/ask_test.rb (exit status: 1)
[ 27s]
[ 27s] FAIL: lib/activate_callbacks_test
[ 27s] =================================
[ 27s]
[ 27s]
[ 27s] An error occurred while loading ./lib/activate_callbacks_test.rb.
[ 27s] Failure/Error: require "autoinstall/activate_callbacks"
[ 27s]
[ 27s] RuntimeError:
[ 27s] Failed to load Module 'Profile' due to: Failed to load Module
'AutoinstConfig' due to: Failed to load Module 'ServicesManagerTarget' due to:
component cannot import namespace 'SystemdTarget'
[ 27s] # /usr/share/YaST2/modules/services_manager_target.rb:5:in
`<module:Yast>'
[ 27s] # /usr/share/YaST2/modules/services_manager_target.rb:3:in `<top
(required)>'
[ 27s] #
/home/abuild/rpmbuild/BUILD/autoyast2-4.0.61/src/modules/AutoinstConfig.rb:13:in
`<module:Yast>'
[ 27s] #
/home/abuild/rpmbuild/BUILD/autoyast2-4.0.61/src/modules/AutoinstConfig.rb:12:in
`<top (required)>'
[ 27s] #
/home/abuild/rpmbuild/BUILD/autoyast2-4.0.61/src/modules/Profile.rb:67:in `main'
[ 27s] #
/home/abuild/rpmbuild/BUILD/autoyast2-4.0.61/src/modules/Profile.rb:960:in
`<module:Yast>'
[ 27s] #
/home/abuild/rpmbuild/BUILD/autoyast2-4.0.61/src/modules/Profile.rb:12:in `<top
(required)>'
[ 27s] #
/home/abuild/rpmbuild/BUILD/autoyast2-4.0.61/src/lib/autoinstall/activate_callbacks.rb:25:in
`<top (required)>'
[ 27s] # ./lib/activate_callbacks_test.rb:24:in `<top (required)>'
[ 27s] No examples found.
[ 27s]
[ 27s]
[ 27s] Finished in 0.00036 seconds (files took 1.01 seconds to load)
[ 27s] 0 examples, 0 failures, 1 error occurred outside of examples
[ 27s]
[ 27s] FAIL lib/activate_callbacks_test.rb (exit status: 1)
[ 27s]
[ 27s] FAIL: lib/module_config_builder_test
[ 27s] ====================================
[ 27s]
[ 27s]
[ 27s] An error occurred while loading ./lib/module_config_builder_test.rb.
[ 27s] Failure/Error: Yast.import "Y2ModuleConfig"
[ 27s]
[ 27s] RuntimeError:
[ 27s] Failed to load Module 'Y2ModuleConfig' due to: Failed to load Module
'Profile' due to: Failed to load Module 'AutoinstConfig' due to: Failed to load
Module 'ServicesManagerTarget' due to: component cannot import namespace
'SystemdTarget'
[ 27s] # /usr/share/YaST2/modules/services_manager_target.rb:5:in
`<module:Yast>'
[ 27s] # /usr/share/YaST2/modules/services_manager_target.rb:3:in `<top
(required)>'
[ 27s] #
/home/abuild/rpmbuild/BUILD/autoyast2-4.0.61/src/modules/AutoinstConfig.rb:13:in
`<module:Yast>'
[ 27s] #
/home/abuild/rpmbuild/BUILD/autoyast2-4.0.61/src/modules/AutoinstConfig.rb:12:in
`<top (required)>'
[ 27s] #
/home/abuild/rpmbuild/BUILD/autoyast2-4.0.61/src/modules/Profile.rb:67:in `main'
[ 27s] #
/home/abuild/rpmbuild/BUILD/autoyast2-4.0.61/src/modules/Profile.rb:960:in
`<module:Yast>'
[ 27s] #
/home/abuild/rpmbuild/BUILD/autoyast2-4.0.61/src/modules/Profile.rb:12:in `<top
(required)>'
[ 27s] #
/home/abuild/rpmbuild/BUILD/autoyast2-4.0.61/src/modules/Y2ModuleConfig.rb:26:in
`main'
[ 27s] #
/home/abuild/rpmbuild/BUILD/autoyast2-4.0.61/src/modules/Y2ModuleConfig.rb:434:in
`<module:Yast>'
[ 27s] #
/home/abuild/rpmbuild/BUILD/autoyast2-4.0.61/src/modules/Y2ModuleConfig.rb:11:in
`<top (required)>'
[ 27s] # ./lib/module_config_builder_test.rb:8:in `<top (required)>'
[ 27s] No examples found.
[ 27s]
[ 27s]
[ 27s] Finished in 0.00029 seconds (files took 0.33079 seconds to load)
[ 27s] 0 examples, 0 failures, 1 error occurred outside of examples
[ 27s]
[ 27s] FAIL lib/module_config_builder_test.rb (exit status: 1)
[ 27s]
[ 27s] FAIL: lib/clients/ayast_probe_test
[ 27s] ==================================
[ 27s]
[ 27s]
[ 27s] An error occurred while loading ./lib/clients/ayast_probe_test.rb.
[ 27s] Failure/Error: require "autoinstall/clients/ayast_probe"
[ 27s]
[ 27s] RuntimeError:
[ 27s] Failed to load Module 'AutoInstallRules' due to: Failed to load
Module 'AutoinstConfig' due to: Failed to load Module 'ServicesManagerTarget'
due to: component cannot import namespace 'SystemdTarget'
[ 27s] # /usr/share/YaST2/modules/services_manager_target.rb:5:in
`<module:Yast>'
[ 27s] # /usr/share/YaST2/modules/services_manager_target.rb:3:in `<top
(required)>'
[ 27s] #
/home/abuild/rpmbuild/BUILD/autoyast2-4.0.61/src/modules/AutoinstConfig.rb:13:in
`<module:Yast>'
[ 27s] #
/home/abuild/rpmbuild/BUILD/autoyast2-4.0.61/src/modules/AutoinstConfig.rb:12:in
`<top (required)>'
[ 27s] #
/home/abuild/rpmbuild/BUILD/autoyast2-4.0.61/src/modules/AutoInstallRules.rb:25:in
`main'
[ 27s] #
/home/abuild/rpmbuild/BUILD/autoyast2-4.0.61/src/modules/AutoInstallRules.rb:1156:in
`<module:Yast>'
[ 27s] #
/home/abuild/rpmbuild/BUILD/autoyast2-4.0.61/src/modules/AutoInstallRules.rb:13:in
`<top (required)>'
[ 27s] #
/home/abuild/rpmbuild/BUILD/autoyast2-4.0.61/src/lib/autoinstall/clients/ayast_probe.rb:24:in
`<top (required)>'
[ 27s] # ./lib/clients/ayast_probe_test.rb:24:in `<top (required)>'
[ 27s] No examples found.
[ 27s]
[ 27s]
[ 27s] Finished in 0.00039 seconds (files took 0.80306 seconds to load)
[ 27s] 0 examples, 0 failures, 1 error occurred outside of examples
[ 27s]
[ 27s] FAIL lib/clients/ayast_probe_test.rb (exit status: 1)
[ 27s]
[ 27s]
============================================================================
[ 27s] Testsuite summary for autoyast2 4.0.61
[ 27s]
============================================================================
[ 27s] # TOTAL: 21
[ 27s] # PASS: 7
[ 27s] # SKIP: 0
[ 27s] # XFAIL: 0
[ 27s] # FAIL: 14
[ 27s] # XPASS: 0
[ 27s] # ERROR: 0
[ 27s]
============================================================================
[ 27s] See test/test-suite.log
[ 27s] Please report to http://bugs.opensuse.org/
[ 27s]
============================================================================
[ 27s] make[3]: *** [Makefile:522: test-suite.log] Error 1
[ 27s] make[3]: Leaving directory
'/home/abuild/rpmbuild/BUILD/autoyast2-4.0.61/test'
[ 27s] make[2]: *** [Makefile:630: check-TESTS] Error 2
[ 27s] make[2]: Leaving directory
'/home/abuild/rpmbuild/BUILD/autoyast2-4.0.61/test'
[ 27s] make[1]: *** [Makefile:689: check-am] Error 2
[ 27s] make[1]: Leaving directory
'/home/abuild/rpmbuild/BUILD/autoyast2-4.0.61/test'
[ 27s] make: *** [Makefile:497: check-recursive] Error 1
[ 27s] error: Bad exit status from /var/tmp/rpm-tmp.sfoKfX (%install)
[ 27s]
[ 27s]
[ 27s] RPM build errors:
[ 27s] Bad exit status from /var/tmp/rpm-tmp.sfoKfX (%install)
[ 27s]
[ 27s] yast-jenkins failed "build autoyast2.spec" at Thu Aug 23 13:58:52 UTC
2018.
[ 27s]

The buildroot was: /var/tmp/build-root-openSUSE_Factory
rm -rf YaST:Head
rake aborted!
Command failed with status (1): [yes | osc -A 'https://api.opensuse.org/' b...]

Tasks: TOP => osc:sr => osc:commit => osc:build
(See full trace by running task with --trace)
cleaning
Build step 'Execute shell' marked build as failure
Not sending mail to unregistered user schubi@xxxxxxx
Not sending mail to unregistered user teclator@xxxxxxxxx

< Previous Next >
This Thread