Mailinglist Archive: yast-commit (1990 mails)

< Previous Next >
[yast-commit] Build failed in Jenkins: autoyast-profiles-test #885
  • From: jenkins@xxxxxxx
  • Date: Tue, 10 Apr 2018 00:03:37 +0000 (UTC)
  • Message-id: <-1717116613.2400.1523318617626.JavaMail.jenkins@ci>
See <https://ci.suse.de/job/autoyast-profiles-test/885/display/redirect>

------------------------------------------
[...truncated 15.37 KB...]
Building repository 'temporary_2' cache [....done]
yast2-schema:
yast2-schema-2.17.7-8.1.i586 (temporary_1)
yast2-schema-2.17.7-8.1.x86_64 (temporary_1)
yast2-schema-2.17.5-0.5.42.i586 (temporary_2)
yast2-schema-2.17.5-0.5.42.x86_64 (temporary_2)
Prune to best version...
Retrieving package yast2-schema-2.17.7-8.1.x86_64 (1/1), 71.6 KiB (924.6 KiB
unpacked)
Retrieving: yast2-schema-2.17.7-8.1.x86_64.rpm [.........done]
.done]

download: Done.
Installing
/tmp/schema-validation_sle-11-sp4_20180410-17720-4dq8fx/var/cache/zypp/packages/temporary_1/x86_64/yast2-schema-2.17.7-8.1.x86_64.rpm
to /tmp/schema-validation_sle-11-sp4_20180410-17720-4dq8fx
Preparing packages...
yast2-schema-2.17.7-8.1.x86_64

Test will use latest schema from:
/tmp/schema-validation_sle-11-sp4_20180410-17720-4dq8fx/usr/share/YaST2/schema/autoyast/rng/profile.rng
Test will be done for architecture: x86_64
Test for sle-12 will use temporary root
/tmp/schema-validation_sle-12_20180410-17720-1k3njyg
Installing package yast2-schema to
/tmp/schema-validation_sle-12_20180410-17720-1k3njyg from repositories:
http://download.suse.de/ibs/Devel:/YaST:/SLE-12/SLE_12/
http://download.suse.de/ibs/SUSE:/SLE-12:/GA/standard/
Verbosity: 1
Entering non-interactive mode.
Non-option program arguments:
'http://download.suse.de/ibs/Devel:/YaST:/SLE-12/SLE_12/' 'temporary_1'
Initializing Target
Adding repository 'temporary_1' [......done]
Warning: GPG checking is disabled in configuration of repository 'temporary_1'.
Integrity and origin of packages cannot be verified.
Repository 'temporary_1' successfully added
Enabled : Yes
Autorefresh : Yes
GPG Check : No
Priority : 99
URI : http://download.suse.de/ibs/Devel:/YaST:/SLE-12/SLE_12/

Verbosity: 1
Entering non-interactive mode.
Non-option program arguments:
'http://download.suse.de/ibs/SUSE:/SLE-12:/GA/standard/' 'temporary_2'
Initializing Target
Adding repository 'temporary_2' [......done]
Warning: GPG checking is disabled in configuration of repository 'temporary_2'.
Integrity and origin of packages cannot be verified.
Repository 'temporary_2' successfully added
Enabled : Yes
Autorefresh : Yes
GPG Check : No
Priority : 99
URI : http://download.suse.de/ibs/SUSE:/SLE-12:/GA/standard/

Verbosity: 1
Entering non-interactive mode.
Ignoring installed resolvables.
Non-option program arguments: 'yast2-schema'
Initializing Target
Retrieving: repomd.xml.asc [done]
Retrieving: repomd.xml.key [done]
Retrieving: repomd.xml [done]
Retrieving:
bbc0c0bd60c499a5f289d237a2e9791df14c0245a9a7560939c955ecba7b98f8-primary.xml.gz
[done]
Retrieving: repomd.xml.asc [done]
Retrieving: repomd.xml.key [done]
Retrieving: repomd.xml [done]
Retrieving:
873dcb429a0778f1e29947549c0448694a7716b6235dce52bd0743c7472c5715-app-icons.tar.gz
[done]
Retrieving:
ca2a2bdee6b9efda88ce3b754673a569b9bf1a50e0bd14b617c76ceda66dd120-appdata.xml.gz
[.done (255.1 KiB/s)]
Retrieving:
d0866958f18efd8aca5bec598811fefa5ad3ebfa7cc343e5a0eeae0e42fa4325-primary.xml.gz
[done]
Retrieving:
b503b198b5a9b8e63aa1c4de77c9fb9260234466565ecbdfaf8fe7f8e982f2c7-susedata.xml.gz
[.done]
Loading repository data...
Repository 'temporary_1' not cached. Caching...
Building repository 'temporary_1' cache [....done]
Repository 'temporary_2' not cached. Caching...
Building repository 'temporary_2' cache [....done]
yast2-schema:
yast2-schema-3.1.0.2-1.27.noarch (temporary_1)
yast2-schema-3.1.0-1.217.noarch (temporary_2)
yast2-schema-3.1.0-1.333.noarch (temporary_2)
yast2-schema-3.1.0-1.474.noarch (temporary_2)
Prune to best version...
Retrieving package yast2-schema-3.1.0.2-1.27.noarch (1/1), 77.8 KiB ( 1.1 MiB
unpacked)
Retrieving: yast2-schema-3.1.0.2-1.27.noarch.rpm [.....done]
.done]

download: Done.
Installing
/tmp/schema-validation_sle-12_20180410-17720-1k3njyg/var/cache/zypp/packages/temporary_1/noarch/yast2-schema-3.1.0.2-1.27.noarch.rpm
to /tmp/schema-validation_sle-12_20180410-17720-1k3njyg
Preparing packages...
yast2-schema-3.1.0.2-1.27.noarch

Test will use latest schema from:
/tmp/schema-validation_sle-12_20180410-17720-1k3njyg/usr/share/YaST2/schema/autoyast/rng/profile.rng

When checking correct profiles stored in
<https://ci.suse.de/job/autoyast-profiles-test/ws/test/sle-12-sp2-s390/correct,>
Profile
<https://ci.suse.de/job/autoyast-profiles-test/ws/test/sle-12-sp2-s390/correct/sles-12-sp1-944349-s390.xml>
Checking
<https://ci.suse.de/job/autoyast-profiles-test/ws/test/sle-12-sp2-s390/correct/sles-12-sp1-944349-s390.xml>
according to
/tmp/schema-validation_sle-12-sp2-s390_20180410-17720-1ufzkmy/usr/share/YaST2/schema/autoyast/rng/profile.rng
passes validation according to schema

When checking correct profiles stored in
<https://ci.suse.de/job/autoyast-profiles-test/ws/test/Head/correct,>
Profile
<https://ci.suse.de/job/autoyast-profiles-test/ws/test/Head/correct/sles-12-sp1-954291-bad.xml>
Checking
<https://ci.suse.de/job/autoyast-profiles-test/ws/test/Head/correct/sles-12-sp1-954291-bad.xml>
according to
/tmp/schema-validation_Head_20180410-17720-11zrfer/usr/share/YaST2/schema/autoyast/rng/profile.rng
passes validation according to schema
Profile
<https://ci.suse.de/job/autoyast-profiles-test/ws/test/Head/correct/sles-12-949193.xml>
Checking
<https://ci.suse.de/job/autoyast-profiles-test/ws/test/Head/correct/sles-12-949193.xml>
according to
/tmp/schema-validation_Head_20180410-17720-11zrfer/usr/share/YaST2/schema/autoyast/rng/profile.rng

passes validation according to schema (FAILED - 1)
Profile
<https://ci.suse.de/job/autoyast-profiles-test/ws/test/Head/correct/opensuse-13.2-full_clone.xml>
Checking
<https://ci.suse.de/job/autoyast-profiles-test/ws/test/Head/correct/opensuse-13.2-full_clone.xml>
according to
/tmp/schema-validation_Head_20180410-17720-11zrfer/usr/share/YaST2/schema/autoyast/rng/profile.rng

passes validation according to schema (FAILED - 2)
Profile
<https://ci.suse.de/job/autoyast-profiles-test/ws/test/Head/correct/sles-12-minimalistic.xml>
Checking
<https://ci.suse.de/job/autoyast-profiles-test/ws/test/Head/correct/sles-12-minimalistic.xml>
according to
/tmp/schema-validation_Head_20180410-17720-11zrfer/usr/share/YaST2/schema/autoyast/rng/profile.rng
passes validation according to schema
Profile
<https://ci.suse.de/job/autoyast-profiles-test/ws/test/Head/correct/sles-12-sp1-954291-good.xml>
Checking
<https://ci.suse.de/job/autoyast-profiles-test/ws/test/Head/correct/sles-12-sp1-954291-good.xml>
according to
/tmp/schema-validation_Head_20180410-17720-11zrfer/usr/share/YaST2/schema/autoyast/rng/profile.rng
passes validation according to schema
Profile
<https://ci.suse.de/job/autoyast-profiles-test/ws/test/Head/correct/sles-12-sp1-955217.xml>
Checking
<https://ci.suse.de/job/autoyast-profiles-test/ws/test/Head/correct/sles-12-sp1-955217.xml>
according to
/tmp/schema-validation_Head_20180410-17720-11zrfer/usr/share/YaST2/schema/autoyast/rng/profile.rng

passes validation according to schema (FAILED - 3)
Profile
<https://ci.suse.de/job/autoyast-profiles-test/ws/test/Head/correct/sles-12-sp1-941406.xml>
Checking
<https://ci.suse.de/job/autoyast-profiles-test/ws/test/Head/correct/sles-12-sp1-941406.xml>
according to
/tmp/schema-validation_Head_20180410-17720-11zrfer/usr/share/YaST2/schema/autoyast/rng/profile.rng

passes validation according to schema (FAILED - 4)
Profile
<https://ci.suse.de/job/autoyast-profiles-test/ws/test/Head/correct/sles-11-sp3.xml>
Checking
<https://ci.suse.de/job/autoyast-profiles-test/ws/test/Head/correct/sles-11-sp3.xml>
according to
/tmp/schema-validation_Head_20180410-17720-11zrfer/usr/share/YaST2/schema/autoyast/rng/profile.rng

passes validation according to schema (FAILED - 5)

When checking incorrect profiles,
Profile deploy_image.xml
Checking deploy_image.xml according to
/tmp/schema-validation_Head_20180410-17720-11zrfer/usr/share/YaST2/schema/autoyast/rng/profile.rng

complains about wrong deploy_images definition

When checking correct profiles stored in
<https://ci.suse.de/job/autoyast-profiles-test/ws/test/sle-12-sp1/correct,>
Profile
<https://ci.suse.de/job/autoyast-profiles-test/ws/test/sle-12-sp1/correct/sles-12-sp1-955217.xml>
Checking
<https://ci.suse.de/job/autoyast-profiles-test/ws/test/sle-12-sp1/correct/sles-12-sp1-955217.xml>
according to
/tmp/schema-validation_sle-12-sp1_20180410-17720-om50dw/usr/share/YaST2/schema/autoyast/rng/profile.rng
passes validation according to schema

When checking correct profiles stored in
<https://ci.suse.de/job/autoyast-profiles-test/ws/test/sle-11-sp4/correct,>
Profile
<https://ci.suse.de/job/autoyast-profiles-test/ws/test/sle-11-sp4/correct/minimalistic.xml>
Checking
<https://ci.suse.de/job/autoyast-profiles-test/ws/test/sle-11-sp4/correct/minimalistic.xml>
according to
/tmp/schema-validation_sle-11-sp4_20180410-17720-4dq8fx/usr/share/YaST2/schema/autoyast/rng/profile.rng
passes validation according to schema

When checking correct profiles stored in
<https://ci.suse.de/job/autoyast-profiles-test/ws/test/sle-12/correct,>
Profile
<https://ci.suse.de/job/autoyast-profiles-test/ws/test/sle-12/correct/minimalistic.xml>
Checking
<https://ci.suse.de/job/autoyast-profiles-test/ws/test/sle-12/correct/minimalistic.xml>
according to
/tmp/schema-validation_sle-12_20180410-17720-1k3njyg/usr/share/YaST2/schema/autoyast/rng/profile.rng
passes validation according to schema
Removing temporary directory
/tmp/schema-validation_sle-12_20180410-17720-1k3njyg
Removing temporary directory
/tmp/schema-validation_sle-11-sp4_20180410-17720-4dq8fx
Removing temporary directory
/tmp/schema-validation_sle-12-sp1_20180410-17720-om50dw
Removing temporary directory /tmp/schema-validation_Head_20180410-17720-11zrfer
Removing temporary directory
/tmp/schema-validation_sle-12-sp2-s390_20180410-17720-1ufzkmy

Failures:

1) When checking correct profiles stored in
<https://ci.suse.de/job/autoyast-profiles-test/ws/test/Head/correct,> Profile
<https://ci.suse.de/job/autoyast-profiles-test/ws/test/Head/correct/sles-12-949193.xml>
passes validation according to schema
Failure/Error: DEFAULT_FAILURE_NOTIFIER = lambda { |failure, _opts| raise
failure }

expected: ""
got:
"<https://ci.suse.de/job/autoyast-profiles-test/ws/test/Head/correct/sles-12-949193.xml>:118:49:
error: e..._time\" not allowed here; expected the element end-tag or element
\"ntp_servers\" or \"ntp_sync\"\n"

(compared using ==)

Diff:
@@ -1 +1,7 @@

+<https://ci.suse.de/job/autoyast-profiles-test/ws/test/Head/correct/sles-12-949193.xml>:118:49:
error: element "partition_alignment" not allowed here; expected the element
end-tag or element "btrfs_set_default_subvolume_name" or "start_multipath"

+<https://ci.suse.de/job/autoyast-profiles-test/ws/test/Head/correct/sles-12-949193.xml>:207:32:
error: element "peers" not allowed here; expected the element end-tag or
element "ntp_servers" or "ntp_sync"

+<https://ci.suse.de/job/autoyast-profiles-test/ws/test/Head/correct/sles-12-949193.xml>:208:42:
error: element "start_at_boot" not allowed here; expected the element end-tag
or element "ntp_servers" or "ntp_sync"

+<https://ci.suse.de/job/autoyast-profiles-test/ws/test/Head/correct/sles-12-949193.xml>:209:44:
error: element "start_in_chroot" not allowed here; expected the element
end-tag or element "ntp_servers" or "ntp_sync"

+<https://ci.suse.de/job/autoyast-profiles-test/ws/test/Head/correct/sles-12-949193.xml>:210:42:
error: element "sync_interval" not allowed here; expected the element end-tag
or element "ntp_servers" or "ntp_sync"

+<https://ci.suse.de/job/autoyast-profiles-test/ws/test/Head/correct/sles-12-949193.xml>:211:45:
error: element "synchronize_time" not allowed here; expected the element
end-tag or element "ntp_servers" or "ntp_sync"
# ./test/profile_test_helper.rb:121:in `block (4 levels) in
validate_correct_profiles'

2) When checking correct profiles stored in
<https://ci.suse.de/job/autoyast-profiles-test/ws/test/Head/correct,> Profile
<https://ci.suse.de/job/autoyast-profiles-test/ws/test/Head/correct/opensuse-13.2-full_clone.xml>
passes validation according to schema
Failure/Error: DEFAULT_FAILURE_NOTIFIER = lambda { |failure, _opts| raise
failure }

expected: ""
got:
"<https://ci.suse.de/job/autoyast-profiles-test/ws/test/Head/correct/opensuse-13.2-full_clone.xml>:72:49:..._time\"
not allowed here; expected the element end-tag or element \"ntp_servers\" or
\"ntp_sync\"\n"

(compared using ==)

Diff:
@@ -1 +1,8 @@

+<https://ci.suse.de/job/autoyast-profiles-test/ws/test/Head/correct/opensuse-13.2-full_clone.xml>:72:49:
error: element "partition_alignment" not allowed here; expected the element
end-tag or element "btrfs_set_default_subvolume_name" or "start_multipath"

+<https://ci.suse.de/job/autoyast-profiles-test/ws/test/Head/correct/opensuse-13.2-full_clone.xml>:514:31:
error: element "peers" not allowed here; expected the element end-tag or
element "ntp_servers" or "ntp_sync"

+<https://ci.suse.de/job/autoyast-profiles-test/ws/test/Head/correct/opensuse-13.2-full_clone.xml>:577:36:
error: element "restricts" not allowed here; expected the element end-tag or
element "ntp_servers" or "ntp_sync"

+<https://ci.suse.de/job/autoyast-profiles-test/ws/test/Head/correct/opensuse-13.2-full_clone.xml>:578:42:
error: element "start_at_boot" not allowed here; expected the element end-tag
or element "ntp_servers" or "ntp_sync"

+<https://ci.suse.de/job/autoyast-profiles-test/ws/test/Head/correct/opensuse-13.2-full_clone.xml>:579:44:
error: element "start_in_chroot" not allowed here; expected the element
end-tag or element "ntp_servers" or "ntp_sync"

+<https://ci.suse.de/job/autoyast-profiles-test/ws/test/Head/correct/opensuse-13.2-full_clone.xml>:580:42:
error: element "sync_interval" not allowed here; expected the element end-tag
or element "ntp_servers" or "ntp_sync"

+<https://ci.suse.de/job/autoyast-profiles-test/ws/test/Head/correct/opensuse-13.2-full_clone.xml>:581:45:
error: element "synchronize_time" not allowed here; expected the element
end-tag or element "ntp_servers" or "ntp_sync"
# ./test/profile_test_helper.rb:121:in `block (4 levels) in
validate_correct_profiles'

3) When checking correct profiles stored in
<https://ci.suse.de/job/autoyast-profiles-test/ws/test/Head/correct,> Profile
<https://ci.suse.de/job/autoyast-profiles-test/ws/test/Head/correct/sles-12-sp1-955217.xml>
passes validation according to schema
Failure/Error: DEFAULT_FAILURE_NOTIFIER = lambda { |failure, _opts| raise
failure }

expected: ""
got:
"<https://ci.suse.de/job/autoyast-profiles-test/ws/test/Head/correct/sles-12-sp1-955217.xml>:98:49:
error...pected the element end-tag or element
\"btrfs_set_default_subvolume_name\" or \"start_multipath\"\n"

(compared using ==)

Diff:
@@ -1 +1,2 @@

+<https://ci.suse.de/job/autoyast-profiles-test/ws/test/Head/correct/sles-12-sp1-955217.xml>:98:49:
error: element "partition_alignment" not allowed here; expected the element
end-tag or element "btrfs_set_default_subvolume_name" or "start_multipath"
# ./test/profile_test_helper.rb:121:in `block (4 levels) in
validate_correct_profiles'

4) When checking correct profiles stored in
<https://ci.suse.de/job/autoyast-profiles-test/ws/test/Head/correct,> Profile
<https://ci.suse.de/job/autoyast-profiles-test/ws/test/Head/correct/sles-12-sp1-941406.xml>
passes validation according to schema
Failure/Error: DEFAULT_FAILURE_NOTIFIER = lambda { |failure, _opts| raise
failure }

expected: ""
got:
"<https://ci.suse.de/job/autoyast-profiles-test/ws/test/Head/correct/sles-12-sp1-941406.xml>:95:49:
error..._time\" not allowed here; expected the element end-tag or element
\"ntp_servers\" or \"ntp_sync\"\n"

(compared using ==)

Diff:
@@ -1 +1,8 @@

+<https://ci.suse.de/job/autoyast-profiles-test/ws/test/Head/correct/sles-12-sp1-941406.xml>:95:49:
error: element "partition_alignment" not allowed here; expected the element
end-tag or element "btrfs_set_default_subvolume_name" or "start_multipath"

+<https://ci.suse.de/job/autoyast-profiles-test/ws/test/Head/correct/sles-12-sp1-941406.xml>:391:31:
error: element "peers" not allowed here; expected the element end-tag or
element "ntp_servers" or "ntp_sync"

+<https://ci.suse.de/job/autoyast-profiles-test/ws/test/Head/correct/sles-12-sp1-941406.xml>:456:35:
error: element "restricts" not allowed here; expected the element end-tag or
element "ntp_servers" or "ntp_sync"

+<https://ci.suse.de/job/autoyast-profiles-test/ws/test/Head/correct/sles-12-sp1-941406.xml>:538:42:
error: element "start_at_boot" not allowed here; expected the element end-tag
or element "ntp_servers" or "ntp_sync"

+<https://ci.suse.de/job/autoyast-profiles-test/ws/test/Head/correct/sles-12-sp1-941406.xml>:539:44:
error: element "start_in_chroot" not allowed here; expected the element
end-tag or element "ntp_servers" or "ntp_sync"

+<https://ci.suse.de/job/autoyast-profiles-test/ws/test/Head/correct/sles-12-sp1-941406.xml>:540:42:
error: element "sync_interval" not allowed here; expected the element end-tag
or element "ntp_servers" or "ntp_sync"

+<https://ci.suse.de/job/autoyast-profiles-test/ws/test/Head/correct/sles-12-sp1-941406.xml>:541:45:
error: element "synchronize_time" not allowed here; expected the element
end-tag or element "ntp_servers" or "ntp_sync"
# ./test/profile_test_helper.rb:121:in `block (4 levels) in
validate_correct_profiles'

5) When checking correct profiles stored in
<https://ci.suse.de/job/autoyast-profiles-test/ws/test/Head/correct,> Profile
<https://ci.suse.de/job/autoyast-profiles-test/ws/test/Head/correct/sles-11-sp3.xml>
passes validation according to schema
Failure/Error: DEFAULT_FAILURE_NOTIFIER = lambda { |failure, _opts| raise
failure }

expected: ""
got:
"<https://ci.suse.de/job/autoyast-profiles-test/ws/test/Head/correct/sles-11-sp3.xml>:104:31:
error: elem...hroot\" not allowed here; expected the element end-tag or
element \"ntp_servers\" or \"ntp_sync\"\n"

(compared using ==)

Diff:
@@ -1 +1,4 @@

+<https://ci.suse.de/job/autoyast-profiles-test/ws/test/Head/correct/sles-11-sp3.xml>:104:31:
error: element "peers" not allowed here; expected the element end-tag or
element "ntp_servers" or "ntp_sync"

+<https://ci.suse.de/job/autoyast-profiles-test/ws/test/Head/correct/sles-11-sp3.xml>:121:42:
error: element "start_at_boot" not allowed here; expected the element end-tag
or element "ntp_servers" or "ntp_sync"

+<https://ci.suse.de/job/autoyast-profiles-test/ws/test/Head/correct/sles-11-sp3.xml>:122:44:
error: element "start_in_chroot" not allowed here; expected the element
end-tag or element "ntp_servers" or "ntp_sync"
# ./test/profile_test_helper.rb:121:in `block (4 levels) in
validate_correct_profiles'

Finished in 4.77 seconds (files took 28.82 seconds to load)
13 examples, 5 failures

Failed examples:

rspec ./test/profile_test_helper.rb[2:2:1] # When checking correct profiles
stored in <https://ci.suse.de/job/autoyast-profiles-test/ws/test/Head/correct,>
Profile
<https://ci.suse.de/job/autoyast-profiles-test/ws/test/Head/correct/sles-12-949193.xml>
passes validation according to schema
rspec ./test/profile_test_helper.rb[2:3:1] # When checking correct profiles
stored in <https://ci.suse.de/job/autoyast-profiles-test/ws/test/Head/correct,>
Profile
<https://ci.suse.de/job/autoyast-profiles-test/ws/test/Head/correct/opensuse-13.2-full_clone.xml>
passes validation according to schema
rspec ./test/profile_test_helper.rb[2:6:1] # When checking correct profiles
stored in <https://ci.suse.de/job/autoyast-profiles-test/ws/test/Head/correct,>
Profile
<https://ci.suse.de/job/autoyast-profiles-test/ws/test/Head/correct/sles-12-sp1-955217.xml>
passes validation according to schema
rspec ./test/profile_test_helper.rb[2:7:1] # When checking correct profiles
stored in <https://ci.suse.de/job/autoyast-profiles-test/ws/test/Head/correct,>
Profile
<https://ci.suse.de/job/autoyast-profiles-test/ws/test/Head/correct/sles-12-sp1-941406.xml>
passes validation according to schema
rspec ./test/profile_test_helper.rb[2:8:1] # When checking correct profiles
stored in <https://ci.suse.de/job/autoyast-profiles-test/ws/test/Head/correct,>
Profile
<https://ci.suse.de/job/autoyast-profiles-test/ws/test/Head/correct/sles-11-sp3.xml>
passes validation according to schema

rake aborted!
Command failed with status (1): [rspec --color --format doc 'test/sle-12-sp...]

Tasks: TOP => test:unit
(See full trace by running task with --trace)
Build step 'Execute shell' marked build as failure

< Previous Next >
List Navigation
Follow Ups
References