Mailinglist Archive: yast-commit (619 mails)

< Previous Next >
[yast-commit] Build failed in Jenkins: yast-yast2-master #506
  • From: admin@xxxxxxxxxxxx
  • Date: Thu, 1 Feb 2018 11:26:45 +0000 (UTC)
  • Message-id: <1998543449.17.1517484405648.JavaMail.jenkins@ci-opensuse>
See
<http://ci.opensuse.org/job/yast-yast2-master/506/display/redirect?page=changes>

Changes:

[github] Y2packager integration (#686)

------------------------------------------
[...truncated 387.00 KB...]
[ 48s] WARNING: Couldn't find tool init file
[ 48s] Test run by abuild on Thu Feb 1 11:26:37 2018
[ 48s] Native configuration is x86_64-suse-linux-gnu
[ 48s]
[ 48s] === yast2 tests ===
[ 48s]
[ 48s] Schedule of variations:
[ 48s] unix
[ 48s]
[ 48s] Running target unix
[ 48s] Using /usr/share/dejagnu/baseboards/unix.exp as board description file
for target.
[ 48s] Using /usr/share/dejagnu/config/unix.exp as generic interface file for
target.
[ 48s] Using ./config/unix.exp as tool-and-target-specific interface file.
[ 48s] Running ./yast2.test/testsuite.exp ...
[ 48s]
[ 48s] Checking started
[ 48s]
[ 48s] Running filechanges ...
[ 48s] Running initrd ...
[ 49s] Running kernel ...
[ 49s]
[ 49s] Checking finished
[ 49s]
[ 49s]
[ 49s] === yast2 Summary ===
[ 49s]
[ 49s] # of expected passes 3
[ 49s] make[4]: Leaving directory
'/home/abuild/rpmbuild/BUILD/yast2-4.0.46/library/system/testsuite'
[ 49s] make[3]: Leaving directory
'/home/abuild/rpmbuild/BUILD/yast2-4.0.46/library/system/testsuite'
[ 49s] Making check in test
[ 49s] make[3]: Entering directory
'/home/abuild/rpmbuild/BUILD/yast2-4.0.46/library/system/test'
[ 49s] /usr/bin/make check-TESTS
[ 49s] make[4]: Entering directory
'/home/abuild/rpmbuild/BUILD/yast2-4.0.46/library/system/test'
[ 49s] make[5]: Entering directory
'/home/abuild/rpmbuild/BUILD/yast2-4.0.46/library/system/test'
[ 50s] PASS: execute_test.rb
[ 50s] PASS: kernel_test.rb
[ 50s] PASS: hw_detection_test.rb
[ 51s] PASS: fs_snapshot_test.rb
[ 51s] PASS: fs_snapshot_store_test.rb
[ 51s] PASS: proc_cmdline_test.rb
[ 51s]
============================================================================
[ 51s] Testsuite summary for yast2 4.0.46
[ 51s]
============================================================================
[ 51s] # TOTAL: 6
[ 51s] # PASS: 6
[ 51s] # SKIP: 0
[ 51s] # XFAIL: 0
[ 51s] # FAIL: 0
[ 51s] # XPASS: 0
[ 51s] # ERROR: 0
[ 51s]
============================================================================
[ 51s] make[5]: Leaving directory
'/home/abuild/rpmbuild/BUILD/yast2-4.0.46/library/system/test'
[ 51s] make[4]: Leaving directory
'/home/abuild/rpmbuild/BUILD/yast2-4.0.46/library/system/test'
[ 51s] make[3]: Leaving directory
'/home/abuild/rpmbuild/BUILD/yast2-4.0.46/library/system/test'
[ 51s] make[3]: Entering directory
'/home/abuild/rpmbuild/BUILD/yast2-4.0.46/library/system'
[ 51s] make[3]: Nothing to be done for 'check-am'.
[ 51s] make[3]: Leaving directory
'/home/abuild/rpmbuild/BUILD/yast2-4.0.46/library/system'
[ 51s] make[2]: Leaving directory
'/home/abuild/rpmbuild/BUILD/yast2-4.0.46/library/system'
[ 51s] Making check in packages
[ 51s] make[2]: Entering directory
'/home/abuild/rpmbuild/BUILD/yast2-4.0.46/library/packages'
[ 51s] Making check in src
[ 51s] make[3]: Entering directory
'/home/abuild/rpmbuild/BUILD/yast2-4.0.46/library/packages/src'
[ 51s] make[3]: Nothing to be done for 'check'.
[ 51s] make[3]: Leaving directory
'/home/abuild/rpmbuild/BUILD/yast2-4.0.46/library/packages/src'
[ 51s] Making check in testsuite
[ 51s] make[3]: Entering directory
'/home/abuild/rpmbuild/BUILD/yast2-4.0.46/library/packages/testsuite'
[ 51s] make -f /usr/share/YaST2/data/testsuite/Makefile.testsuite
RPMNAME=yast2 srcdir=.
[ 51s] make[4]: Entering directory
'/home/abuild/rpmbuild/BUILD/yast2-4.0.46/library/packages/testsuite'
[ 51s] make[4]: warning: jobserver unavailable: using -j1. Add '+' to parent
make rule.
[ 51s] make[4]: Nothing to be done for 'all'.
[ 51s] make[4]: Leaving directory
'/home/abuild/rpmbuild/BUILD/yast2-4.0.46/library/packages/testsuite'
[ 51s] /usr/bin/make check-DEJAGNU check-local
[ 51s] make[4]: Entering directory
'/home/abuild/rpmbuild/BUILD/yast2-4.0.46/library/packages/testsuite'
[ 51s] make -f /usr/share/YaST2/data/testsuite/Makefile.testsuite
RPMNAME=yast2 srcdir=. check
[ 51s] Making a new site.exp file ...
[ 51s] make[5]: Entering directory
'/home/abuild/rpmbuild/BUILD/yast2-4.0.46/library/packages/testsuite'
[ 51s] make[5]: warning: jobserver unavailable: using -j1. Add '+' to parent
make rule.
[ 51s]
[ 51s] Parse YCP
[ 51s] NOT RUNNING
[ 51s]
[ 51s] make[5]: Leaving directory
'/home/abuild/rpmbuild/BUILD/yast2-4.0.46/library/packages/testsuite'
[ 51s] srcdir='.'; export srcdir; \
[ 51s] EXPECT=expect; export EXPECT; \
[ 51s] if /bin/sh -c "runtest --version" > /dev/null 2>&1; then \
[ 51s] exit_status=0; l='yast2'; for tool in $l; do \
[ 51s] if runtest --tool $tool --srcdir $srcdir ; \
[ 51s] then :; else exit_status=1; fi; \
[ 51s] done; \
[ 51s] else echo "WARNING: could not find 'runtest'" 1>&2; :;\
[ 51s] fi; \
[ 51s] exit $exit_status
[ 51s] WARNING: Couldn't find tool init file
[ 51s] Test run by abuild on Thu Feb 1 11:26:40 2018
[ 51s] Native configuration is x86_64-suse-linux-gnu
[ 51s]
[ 51s] === yast2 tests ===
[ 51s]
[ 51s] Schedule of variations:
[ 51s] unix
[ 51s]
[ 51s] Running target unix
[ 51s] Using /usr/share/dejagnu/baseboards/unix.exp as board description file
for target.
[ 51s] Using /usr/share/dejagnu/config/unix.exp as generic interface file for
target.
[ 51s] Using ./config/unix.exp as tool-and-target-specific interface file.
[ 51s] Running ./yast2.test/testsuite.exp ...
[ 51s]
[ 51s] No test cases found
[ 51s]
[ 51s] make[4]: Leaving directory
'/home/abuild/rpmbuild/BUILD/yast2-4.0.46/library/packages/testsuite'
[ 51s] make[3]: Leaving directory
'/home/abuild/rpmbuild/BUILD/yast2-4.0.46/library/packages/testsuite'
[ 51s] Making check in test
[ 51s] make[3]: Entering directory
'/home/abuild/rpmbuild/BUILD/yast2-4.0.46/library/packages/test'
[ 51s] /usr/bin/make check-TESTS
[ 51s] make[4]: Entering directory
'/home/abuild/rpmbuild/BUILD/yast2-4.0.46/library/packages/test'
[ 51s] make[5]: Entering directory
'/home/abuild/rpmbuild/BUILD/yast2-4.0.46/library/packages/test'
[ 52s] PASS: commit_result_test.rb
[ 52s] PASS: dummy_callbacks_test.rb
[ 52s] PASS: file_conflict_callbacks_test.rb
[ 53s] PASS: package_callbacks_test.rb
[ 53s] PASS: lib/product_test.rb
[ 53s] PASS: lib/repository_test.rb
[ 54s] PASS: lib/package_downloader_test.rb
[ 54s] PASS: lib/package_extractor_test.rb
[ 54s] FAIL: lib/product_reader_test.rb
[ 54s] FAIL: lib/product_sorter_test.rb
[ 55s] PASS: packages_ui_test.rb
[ 55s] FAIL: product_test.rb
[ 55s] PASS: signature_check_callbacks_test.rb
[ 56s] PASS: slide_show_test.rb
[ 56s] PASS: update_messages_view_test.rb
[ 56s] ========================================================
[ 56s] yast2 4.0.46: library/packages/test/test-suite.log
[ 56s] ========================================================
[ 56s]
[ 56s] # TOTAL: 15
[ 56s] # PASS: 12
[ 56s] # SKIP: 0
[ 56s] # XFAIL: 0
[ 56s] # FAIL: 3
[ 56s] # XPASS: 0
[ 56s] # ERROR: 0
[ 56s]
[ 56s] .. contents:: :depth: 2
[ 56s]
[ 56s] FAIL: lib/product_reader_test
[ 56s] =============================
[ 56s]
[ 56s]
[ 56s] An error occurred while loading ./lib/product_reader_test.rb.
[ 56s] Failure/Error: require "y2packager/product_reader"
[ 56s]
[ 56s] NameError:
[ 56s] component cannot import namespace 'Language'
[ 56s] #
/home/abuild/rpmbuild/BUILD/yast2-4.0.46/library/packages/src/lib/y2packager/product.rb:14:in
`<top (required)>'
[ 56s] #
/home/abuild/rpmbuild/BUILD/yast2-4.0.46/library/packages/src/lib/y2packager/product_reader.rb:14:in
`<top (required)>'
[ 56s] # ./lib/product_reader_test.rb:16:in `<top (required)>'
[ 56s] No examples found.
[ 56s]
[ 56s]
[ 56s] Finished in 0.0003 seconds (files took 0.33526 seconds to load)
[ 56s] 0 examples, 0 failures, 1 error occurred outside of examples
[ 56s]
[ 56s] FAIL lib/product_reader_test.rb (exit status: 1)
[ 56s]
[ 56s] FAIL: lib/product_sorter_test
[ 56s] =============================
[ 56s]
[ 56s]
[ 56s] An error occurred while loading ./lib/product_sorter_test.rb.
[ 56s] Failure/Error: require "y2packager/product"
[ 56s]
[ 56s] NameError:
[ 56s] component cannot import namespace 'Language'
[ 56s] #
/home/abuild/rpmbuild/BUILD/yast2-4.0.46/library/packages/src/lib/y2packager/product.rb:14:in
`<top (required)>'
[ 56s] # ./lib/product_sorter_test.rb:15:in `<top (required)>'
[ 56s] No examples found.
[ 56s]
[ 56s]
[ 56s] Finished in 0.00035 seconds (files took 0.29831 seconds to load)
[ 56s] 0 examples, 0 failures, 1 error occurred outside of examples
[ 56s]
[ 56s] FAIL lib/product_sorter_test.rb (exit status: 1)
[ 56s]
[ 56s] FAIL: product_test
[ 56s] ==================
[ 56s]
[ 56s]
[ 56s] An error occurred while loading ./product_test.rb.
[ 56s] Failure/Error: import_pure(mname)
[ 56s]
[ 56s] RuntimeError:
[ 56s] Failed to load Module 'Product' due to: component cannot import
namespace 'Language'
[ 56s] #
/home/abuild/rpmbuild/BUILD/yast2-4.0.46/library/packages/src/lib/y2packager/product.rb:14:in
`<top (required)>'
[ 56s] #
/home/abuild/rpmbuild/BUILD/yast2-4.0.46/library/packages/src/lib/y2packager/product_reader.rb:14:in
`<top (required)>'
[ 56s] #
/home/abuild/rpmbuild/BUILD/yast2-4.0.46/library/packages/src/modules/Product.rb:32:in
`<top (required)>'
[ 56s] # ./product_test.rb:8:in `<top (required)>'
[ 56s] No examples found.
[ 56s]
[ 56s]
[ 56s] Finished in 0.0004 seconds (files took 0.39297 seconds to load)
[ 56s] 0 examples, 0 failures, 1 error occurred outside of examples
[ 56s]
[ 56s] FAIL product_test.rb (exit status: 1)
[ 56s]
[ 56s]
============================================================================
[ 56s] Testsuite summary for yast2 4.0.46
[ 56s]
============================================================================
[ 56s] # TOTAL: 15
[ 56s] # PASS: 12
[ 56s] # SKIP: 0
[ 56s] # XFAIL: 0
[ 56s] # FAIL: 3
[ 56s] # XPASS: 0
[ 56s] # ERROR: 0
[ 56s]
============================================================================
[ 56s] See library/packages/test/test-suite.log
[ 56s] Please report to http://bugs.opensuse.org/
[ 56s]
============================================================================
[ 56s] make[5]: *** [Makefile:515: test-suite.log] Error 1
[ 56s] make[5]: Leaving directory
'/home/abuild/rpmbuild/BUILD/yast2-4.0.46/library/packages/test'
[ 56s] make[4]: *** [Makefile:623: check-TESTS] Error 2
[ 56s] make[4]: Leaving directory
'/home/abuild/rpmbuild/BUILD/yast2-4.0.46/library/packages/test'
[ 56s] make[3]: *** [Makefile:679: check-am] Error 2
[ 56s] make[3]: Leaving directory
'/home/abuild/rpmbuild/BUILD/yast2-4.0.46/library/packages/test'
[ 56s] make[2]: *** [Makefile:342: check-recursive] Error 1
[ 56s] make[2]: Leaving directory
'/home/abuild/rpmbuild/BUILD/yast2-4.0.46/library/packages'
[ 56s] make[1]: *** [Makefile:342: check-recursive] Error 1
[ 56s] make[1]: Leaving directory
'/home/abuild/rpmbuild/BUILD/yast2-4.0.46/library'
[ 56s] make: *** [Makefile:503: check-recursive] Error 1
[ 56s] error: Bad exit status from /var/tmp/rpm-tmp.7EhZRU (%install)
[ 56s]
[ 56s]
[ 56s] RPM build errors:
[ 56s] Bad exit status from /var/tmp/rpm-tmp.7EhZRU (%install)
[ 56s]
[ 56s] yast-jenkins failed "build yast2.spec" at Thu Feb 1 11:26:45 UTC 2018.
[ 56s]

The buildroot was: /var/tmp/build-root-openSUSE_Factory
rm -rf YaST:Head
rake aborted!
Command failed with status (1): [yes | osc -A 'https://api.opensuse.org/' b...]

Tasks: TOP => osc:sr => osc:commit => osc:build
(See full trace by running task with --trace)
cleaning
Build step 'Execute shell' marked build as failure
Not sending mail to unregistered user github@xxxxxxxxxxxxxxxx

< Previous Next >
This Thread
Follow Ups