Mailinglist Archive: yast-commit (977 mails)

< Previous Next >
[yast-commit] Build failed in Jenkins: yast-core-werror-clang-master #13
  • From: admin@xxxxxxxxxxxx
  • Date: Fri, 6 Jan 2017 13:50:33 +0100 (CET)
  • Message-id: <-1695365293.7.1483707033449.JavaMail.jenkins@ci-opensuse>
http://ci.opensuse.org/job/yast-core-werror-clang-master/13/Changes:

[lslezak] drop ycp debugger

[lslezak] changes for debugger drop. For info about debugging see

[lslezak] remove --debugger* options and try to fix build on travis

------------------------------------------
[...truncated 15860 lines...]
[ 142s] libtool: link: (cd ".libs" && rm -f "libscr.so" && ln -s
"libscr.so.3.0.0" "libscr.so")
[ 142s] libtool: link: ( cd ".libs" && rm -f "libscr.la" && ln -s
"../libscr.la" "libscr.la" )
[ 142s] make[4]: Leaving directory
'/home/abuild/rpmbuild/BUILD/yast2-core-3.2.2/libscr/src'
[ 142s] make[3]: Leaving directory
'/home/abuild/rpmbuild/BUILD/yast2-core-3.2.2/libscr/src'
[ 142s] Making all in doc
[ 142s] make[3]: Entering directory
'/home/abuild/rpmbuild/BUILD/yast2-core-3.2.2/libscr/doc'
[ 142s] make[3]: Nothing to be done for 'all'.
[ 142s] make[3]: Leaving directory
'/home/abuild/rpmbuild/BUILD/yast2-core-3.2.2/libscr/doc'
[ 142s] Making all in testsuite
[ 142s] make[3]: Entering directory
'/home/abuild/rpmbuild/BUILD/yast2-core-3.2.2/libscr/testsuite'
[ 142s] clang++ -DHAVE_CONFIG_H -I. -I../.. -I../../libycp/src/include
-I../../liby2/src/include -I./../src/include -I../../liby2util-r/src/include
-DY2LOG=\"libscr\" -DNDEBUG -fmessage-length=0 -O2 -Wall -D_FORTIFY_SOURCE=2
-fstack-protector-strong -funwind-tables -fasynchronous-unwind-tables -Werror
-std=gnu++0x -Wall -Wformat=2 -c -o runscr.o runscr.cc
[ 143s] /bin/sh ../../libtool --tag=CXX --mode=link clang++
-DY2LOG=\"libscr\" -DNDEBUG -fmessage-length=0 -O2 -Wall -D_FORTIFY_SOURCE=2
-fstack-protector-strong -funwind-tables -fasynchronous-unwind-tables -Werror
-std=gnu++0x -Wall -Wformat=2 -o runscr runscr.o ../../libscr/src/libscr.la
../../libycp/src/libycp.la ../../libycp/src/libycpvalues.la
../../liby2/src/liby2.la ../../liby2util-r/src/liby2util.la
[ 144s] libtool: link: clang++ -DY2LOG=\"libscr\" -DNDEBUG -fmessage-length=0
-O2 -Wall -D_FORTIFY_SOURCE=2 -fstack-protector-strong -funwind-tables
-fasynchronous-unwind-tables -Werror -std=gnu++0x -Wall -Wformat=2 -o
.libs/runscr runscr.o ../../libscr/src/.libs/libscr.so
../../libycp/src/.libs/libycp.so -lowcrypt -lcrypt
/home/abuild/rpmbuild/BUILD/yast2-core-3.2.2/libycp/src/.libs/libycpvalues.so
../../libycp/src/.libs/libycpvalues.so ../../liby2/src/.libs/liby2.so
/home/abuild/rpmbuild/BUILD/yast2-core-3.2.2/liby2util-r/src/.libs/liby2util.so
-ldl -lpthread ../../liby2util-r/src/.libs/liby2util.so -lutil -Wl,-rpath
-Wl,/usr/lib64
[ 144s] make[3]: Leaving directory
'/home/abuild/rpmbuild/BUILD/yast2-core-3.2.2/libscr/testsuite'
[ 144s] make[3]: Entering directory
'/home/abuild/rpmbuild/BUILD/yast2-core-3.2.2/libscr'
[ 144s] make[3]: Nothing to be done for 'all-am'.
[ 144s] make[3]: Leaving directory
'/home/abuild/rpmbuild/BUILD/yast2-core-3.2.2/libscr'
[ 144s] make[2]: Leaving directory
'/home/abuild/rpmbuild/BUILD/yast2-core-3.2.2/libscr'
[ 144s] Making all in agent-dummy
[ 144s] make[2]: Entering directory
'/home/abuild/rpmbuild/BUILD/yast2-core-3.2.2/agent-dummy'
[ 144s] Making all in conf
[ 144s] make[3]: Entering directory
'/home/abuild/rpmbuild/BUILD/yast2-core-3.2.2/agent-dummy/conf'
[ 144s] make[3]: Nothing to be done for 'all'.
[ 144s] make[3]: Leaving directory
'/home/abuild/rpmbuild/BUILD/yast2-core-3.2.2/agent-dummy/conf'
[ 144s] Making all in doc
[ 144s] make[3]: Entering directory
'/home/abuild/rpmbuild/BUILD/yast2-core-3.2.2/agent-dummy/doc'
[ 144s] make[4]: Entering directory
'/home/abuild/rpmbuild/BUILD/yast2-core-3.2.2/agent-dummy/doc'
[ 144s] make[4]: Nothing to be done for 'all-am'.
[ 144s] make[4]: Leaving directory
'/home/abuild/rpmbuild/BUILD/yast2-core-3.2.2/agent-dummy/doc'
[ 144s] make[3]: Leaving directory
'/home/abuild/rpmbuild/BUILD/yast2-core-3.2.2/agent-dummy/doc'
[ 144s] Making all in src
[ 144s] make[3]: Entering directory
'/home/abuild/rpmbuild/BUILD/yast2-core-3.2.2/agent-dummy/src'
[ 144s] /bin/sh ../../libtool --tag=CXX --mode=compile clang++
-DHAVE_CONFIG_H -I. -I../.. -I../../libycp/src/include
-I../../liby2/src/include -I../../libscr/src/include
-I../../liby2util-r/src/include -DY2LOG=\"agent-dummy\" -DNDEBUG
-fmessage-length=0 -O2 -Wall -D_FORTIFY_SOURCE=2 -fstack-protector-strong
-funwind-tables -fasynchronous-unwind-tables -Werror -std=gnu++0x -Wall
-Wformat=2 -c -o DummyAgent.lo DummyAgent.cc
[ 144s] /bin/sh ../../libtool --tag=CXX --mode=compile clang++
-DHAVE_CONFIG_H -I. -I../.. -I../../libycp/src/include
-I../../liby2/src/include -I../../libscr/src/include
-I../../liby2util-r/src/include -DY2LOG=\"agent-dummy\" -DNDEBUG
-fmessage-length=0 -O2 -Wall -D_FORTIFY_SOURCE=2 -fstack-protector-strong
-funwind-tables -fasynchronous-unwind-tables -Werror -std=gnu++0x -Wall
-Wformat=2 -c -o Y2CCDummyAgent.lo Y2CCDummyAgent.cc
[ 144s] libtool: compile: clang++ -DHAVE_CONFIG_H -I. -I../..
-I../../libycp/src/include -I../../liby2/src/include -I../../libscr/src/include
-I../../liby2util-r/src/include -DY2LOG=\"agent-dummy\" -DNDEBUG
-fmessage-length=0 -O2 -Wall -D_FORTIFY_SOURCE=2 -fstack-protector-strong
-funwind-tables -fasynchronous-unwind-tables -Werror -std=gnu++0x -Wall
-Wformat=2 -c DummyAgent.cc -fPIC -DPIC -o .libs/DummyAgent.o
[ 144s] libtool: compile: clang++ -DHAVE_CONFIG_H -I. -I../..
-I../../libycp/src/include -I../../liby2/src/include -I../../libscr/src/include
-I../../liby2util-r/src/include -DY2LOG=\"agent-dummy\" -DNDEBUG
-fmessage-length=0 -O2 -Wall -D_FORTIFY_SOURCE=2 -fstack-protector-strong
-funwind-tables -fasynchronous-unwind-tables -Werror -std=gnu++0x -Wall
-Wformat=2 -c Y2CCDummyAgent.cc -fPIC -DPIC -o .libs/Y2CCDummyAgent.o
[ 146s] /bin/sh ../../libtool --tag=CXX --mode=link clang++
-DY2LOG=\"agent-dummy\" -DNDEBUG -fmessage-length=0 -O2 -Wall
-D_FORTIFY_SOURCE=2 -fstack-protector-strong -funwind-tables
-fasynchronous-unwind-tables -Werror -std=gnu++0x -Wall -Wformat=2
-version-info 2:0 -o libpy2ag_dummy.la -rpath /usr/lib64/YaST2/plugin
DummyAgent.lo Y2CCDummyAgent.lo ../../libscr/src/libscr.la
../../libycp/src/libycp.la ../../libycp/src/libycpvalues.la
../../liby2/src/liby2.la ../../liby2util-r/src/liby2util.la
[ 146s] libtool: link: clang++ -fPIC -DPIC -shared -nostdlib
/usr/bin/../lib64/gcc/x86_64-suse-linux/6/../../../../lib64/crti.o
/usr/bin/../lib64/gcc/x86_64-suse-linux/6/crtbeginS.o .libs/DummyAgent.o
.libs/Y2CCDummyAgent.o -Wl,-rpath
-Wl,/home/abuild/rpmbuild/BUILD/yast2-core-3.2.2/libscr/src/.libs -Wl,-rpath
-Wl,/home/abuild/rpmbuild/BUILD/yast2-core-3.2.2/libycp/src/.libs -Wl,-rpath
-Wl,/home/abuild/rpmbuild/BUILD/yast2-core-3.2.2/liby2/src/.libs -Wl,-rpath
-Wl,/home/abuild/rpmbuild/BUILD/yast2-core-3.2.2/liby2util-r/src/.libs
-Wl,-rpath -Wl,/usr/lib64
-L/home/abuild/rpmbuild/BUILD/yast2-core-3.2.2/libycp/src/.libs
-L/home/abuild/rpmbuild/BUILD/yast2-core-3.2.2/liby2util-r/src/.libs
../../libscr/src/.libs/libscr.so ../../libycp/src/.libs/libycp.so -lowcrypt
-lcrypt
/home/abuild/rpmbuild/BUILD/yast2-core-3.2.2/libycp/src/.libs/libycpvalues.so
../../libycp/src/.libs/libycpvalues.so ../../liby2/src/.libs/liby2.so
/home/abuild/rpmbuild/BUILD/yast2-core-3.2.2/liby2util-r/src/.libs/liby2util.so
-ldl -lpthread ../../liby2util-r/src/.libs/liby2util.so -lutil
-L/usr/bin/../lib64/gcc/x86_64-suse-linux/6
-L/usr/bin/../lib64/gcc/x86_64-suse-linux/6/../../../../lib64
-L/usr/bin/../lib64 -L/lib/../lib64 -L/usr/lib/../lib64
-L/usr/bin/../lib64/gcc/x86_64-suse-linux/6/../../../../x86_64-suse-linux/lib
-L/usr/bin/../lib64/gcc/x86_64-suse-linux/6/../../.. -L/usr/bin/../lib -L/lib
-L/usr/lib -lstdc++ -lm -lc -lgcc_s
/usr/bin/../lib64/gcc/x86_64-suse-linux/6/crtendS.o
/usr/bin/../lib64/gcc/x86_64-suse-linux/6/../../../../lib64/crtn.o -O2
-fstack-protector-strong -Wl,-soname -Wl,libpy2ag_dummy.so.2 -o
.libs/libpy2ag_dummy.so.2.0.0
[ 147s] libtool: link: (cd ".libs" && rm -f "libpy2ag_dummy.so.2" && ln -s
"libpy2ag_dummy.so.2.0.0" "libpy2ag_dummy.so.2")
[ 147s] libtool: link: (cd ".libs" && rm -f "libpy2ag_dummy.so" && ln -s
"libpy2ag_dummy.so.2.0.0" "libpy2ag_dummy.so")
[ 147s] libtool: link: ( cd ".libs" && rm -f "libpy2ag_dummy.la" && ln -s
"../libpy2ag_dummy.la" "libpy2ag_dummy.la" )
[ 147s] make[3]: Leaving directory
'/home/abuild/rpmbuild/BUILD/yast2-core-3.2.2/agent-dummy/src'
[ 147s] make[3]: Entering directory
'/home/abuild/rpmbuild/BUILD/yast2-core-3.2.2/agent-dummy'
[ 147s] make[3]: Nothing to be done for 'all-am'.
[ 147s] make[3]: Leaving directory
'/home/abuild/rpmbuild/BUILD/yast2-core-3.2.2/agent-dummy'
[ 147s] make[2]: Leaving directory
'/home/abuild/rpmbuild/BUILD/yast2-core-3.2.2/agent-dummy'
[ 147s] Making all in scr
[ 147s] make[2]: Entering directory
'/home/abuild/rpmbuild/BUILD/yast2-core-3.2.2/scr'
[ 147s] Making all in src
[ 147s] make[3]: Entering directory
'/home/abuild/rpmbuild/BUILD/yast2-core-3.2.2/scr/src'
[ 147s] /bin/sh ../../libtool --tag=CXX --mode=compile clang++
-DHAVE_CONFIG_H -I. -I../.. -I../../libycp/src/include
-I../../liby2/src/include -I../../libscr/src/include
-I../../liby2util-r/src/include -DY2LOG=\"scr\" -DSUSEVERSION=\"3.2\" -DNDEBUG
-fmessage-length=0 -O2 -Wall -D_FORTIFY_SOURCE=2 -fstack-protector-strong
-funwind-tables -fasynchronous-unwind-tables -Werror -std=gnu++0x -Wall
-Wformat=2 -c -o Y2CCSCR.lo Y2CCSCR.cc
[ 147s] /bin/sh ../../libtool --tag=CXX --mode=compile clang++
-DHAVE_CONFIG_H -I. -I../.. -I../../libycp/src/include
-I../../liby2/src/include -I../../libscr/src/include
-I../../liby2util-r/src/include -DY2LOG=\"scr\" -DSUSEVERSION=\"3.2\" -DNDEBUG
-fmessage-length=0 -O2 -Wall -D_FORTIFY_SOURCE=2 -fstack-protector-strong
-funwind-tables -fasynchronous-unwind-tables -Werror -std=gnu++0x -Wall
-Wformat=2 -c -o Y2SCRComponent.lo Y2SCRComponent.cc
[ 147s] libtool: compile: clang++ -DHAVE_CONFIG_H -I. -I../..
-I../../libycp/src/include -I../../liby2/src/include -I../../libscr/src/include
-I../../liby2util-r/src/include -DY2LOG=\"scr\" -DSUSEVERSION=\"3.2\" -DNDEBUG
-fmessage-length=0 -O2 -Wall -D_FORTIFY_SOURCE=2 -fstack-protector-strong
-funwind-tables -fasynchronous-unwind-tables -Werror -std=gnu++0x -Wall
-Wformat=2 -c Y2CCSCR.cc -fPIC -DPIC -o .libs/Y2CCSCR.o
[ 147s] libtool: compile: clang++ -DHAVE_CONFIG_H -I. -I../..
-I../../libycp/src/include -I../../liby2/src/include -I../../libscr/src/include
-I../../liby2util-r/src/include -DY2LOG=\"scr\" -DSUSEVERSION=\"3.2\" -DNDEBUG
-fmessage-length=0 -O2 -Wall -D_FORTIFY_SOURCE=2 -fstack-protector-strong
-funwind-tables -fasynchronous-unwind-tables -Werror -std=gnu++0x -Wall
-Wformat=2 -c Y2SCRComponent.cc -fPIC -DPIC -o .libs/Y2SCRComponent.o
[ 148s] /bin/sh ../../libtool --tag=CXX --mode=compile clang++
-DHAVE_CONFIG_H -I. -I../.. -I../../libycp/src/include
-I../../liby2/src/include -I../../libscr/src/include
-I../../liby2util-r/src/include -DY2LOG=\"scr\" -DSUSEVERSION=\"3.2\" -DNDEBUG
-fmessage-length=0 -O2 -Wall -D_FORTIFY_SOURCE=2 -fstack-protector-strong
-funwind-tables -fasynchronous-unwind-tables -Werror -std=gnu++0x -Wall
-Wformat=2 -c -o ScriptingAgent.lo ScriptingAgent.cc
[ 148s] /bin/sh ../../libtool --tag=CXX --mode=compile clang++
-DHAVE_CONFIG_H -I. -I../.. -I../../libycp/src/include
-I../../liby2/src/include -I../../libscr/src/include
-I../../liby2util-r/src/include -DY2LOG=\"scr\" -DSUSEVERSION=\"3.2\" -DNDEBUG
-fmessage-length=0 -O2 -Wall -D_FORTIFY_SOURCE=2 -fstack-protector-strong
-funwind-tables -fasynchronous-unwind-tables -Werror -std=gnu++0x -Wall
-Wformat=2 -c -o SCRSubAgent.lo SCRSubAgent.cc
[ 148s] libtool: compile: clang++ -DHAVE_CONFIG_H -I. -I../..
-I../../libycp/src/include -I../../liby2/src/include -I../../libscr/src/include
-I../../liby2util-r/src/include -DY2LOG=\"scr\" -DSUSEVERSION=\"3.2\" -DNDEBUG
-fmessage-length=0 -O2 -Wall -D_FORTIFY_SOURCE=2 -fstack-protector-strong
-funwind-tables -fasynchronous-unwind-tables -Werror -std=gnu++0x -Wall
-Wformat=2 -c SCRSubAgent.cc -fPIC -DPIC -o .libs/SCRSubAgent.o
[ 148s] libtool: compile: clang++ -DHAVE_CONFIG_H -I. -I../..
-I../../libycp/src/include -I../../liby2/src/include -I../../libscr/src/include
-I../../liby2util-r/src/include -DY2LOG=\"scr\" -DSUSEVERSION=\"3.2\" -DNDEBUG
-fmessage-length=0 -O2 -Wall -D_FORTIFY_SOURCE=2 -fstack-protector-strong
-funwind-tables -fasynchronous-unwind-tables -Werror -std=gnu++0x -Wall
-Wformat=2 -c ScriptingAgent.cc -fPIC -DPIC -o .libs/ScriptingAgent.o
[ 151s] /bin/sh ../../libtool --tag=CXX --mode=link clang++ -DY2LOG=\"scr\"
-DSUSEVERSION=\"3.2\" -DNDEBUG -fmessage-length=0 -O2 -Wall
-D_FORTIFY_SOURCE=2 -fstack-protector-strong -funwind-tables
-fasynchronous-unwind-tables -Werror -std=gnu++0x -Wall -Wformat=2
-version-info 2:0 -o libpy2scr.la -rpath /usr/lib64/YaST2/plugin Y2CCSCR.lo
Y2SCRComponent.lo ScriptingAgent.lo SCRSubAgent.lo ../../libscr/src/libscr.la
[ 151s] libtool: link: clang++ -fPIC -DPIC -shared -nostdlib
/usr/bin/../lib64/gcc/x86_64-suse-linux/6/../../../../lib64/crti.o
/usr/bin/../lib64/gcc/x86_64-suse-linux/6/crtbeginS.o .libs/Y2CCSCR.o
.libs/Y2SCRComponent.o .libs/ScriptingAgent.o .libs/SCRSubAgent.o -Wl,-rpath
-Wl,/home/abuild/rpmbuild/BUILD/yast2-core-3.2.2/libscr/src/.libs -Wl,-rpath
-Wl,/usr/lib64 ../../libscr/src/.libs/libscr.so
-L/usr/bin/../lib64/gcc/x86_64-suse-linux/6
-L/usr/bin/../lib64/gcc/x86_64-suse-linux/6/../../../../lib64
-L/usr/bin/../lib64 -L/lib/../lib64 -L/usr/lib/../lib64
-L/usr/bin/../lib64/gcc/x86_64-suse-linux/6/../../../../x86_64-suse-linux/lib
-L/usr/bin/../lib64/gcc/x86_64-suse-linux/6/../../.. -L/usr/bin/../lib -L/lib
-L/usr/lib -lstdc++ -lm -lc -lgcc_s
/usr/bin/../lib64/gcc/x86_64-suse-linux/6/crtendS.o
/usr/bin/../lib64/gcc/x86_64-suse-linux/6/../../../../lib64/crtn.o -O2
-fstack-protector-strong -Wl,-soname -Wl,libpy2scr.so.2 -o
.libs/libpy2scr.so.2.0.0
[ 151s] libtool: link: (cd ".libs" && rm -f "libpy2scr.so.2" && ln -s
"libpy2scr.so.2.0.0" "libpy2scr.so.2")
[ 151s] libtool: link: (cd ".libs" && rm -f "libpy2scr.so" && ln -s
"libpy2scr.so.2.0.0" "libpy2scr.so")
[ 151s] libtool: link: ( cd ".libs" && rm -f "libpy2scr.la" && ln -s
"../libpy2scr.la" "libpy2scr.la" )
[ 151s] make[3]: Leaving directory
'/home/abuild/rpmbuild/BUILD/yast2-core-3.2.2/scr/src'
[ 151s] Making all in testsuite
[ 151s] make[3]: Entering directory
'/home/abuild/rpmbuild/BUILD/yast2-core-3.2.2/scr/testsuite'
[ 151s] Making all in config
[ 151s] make[4]: Entering directory
'/home/abuild/rpmbuild/BUILD/yast2-core-3.2.2/scr/testsuite/config'
[ 151s] make[4]: Nothing to be done for 'all'.
[ 151s] make[4]: Leaving directory
'/home/abuild/rpmbuild/BUILD/yast2-core-3.2.2/scr/testsuite/config'
[ 151s] Making all in lib
[ 151s] make[4]: Entering directory
'/home/abuild/rpmbuild/BUILD/yast2-core-3.2.2/scr/testsuite/lib'
[ 151s] make[4]: Nothing to be done for 'all'.
[ 151s] make[4]: Leaving directory
'/home/abuild/rpmbuild/BUILD/yast2-core-3.2.2/scr/testsuite/lib'
[ 151s] Making all in scr.test
[ 151s] make[4]: Entering directory
'/home/abuild/rpmbuild/BUILD/yast2-core-3.2.2/scr/testsuite/scr.test'
[ 151s] make[4]: Nothing to be done for 'all'.
[ 151s] make[4]: Leaving directory
'/home/abuild/rpmbuild/BUILD/yast2-core-3.2.2/scr/testsuite/scr.test'
[ 151s] Making all in tests
[ 151s] make[4]: Entering directory
'/home/abuild/rpmbuild/BUILD/yast2-core-3.2.2/scr/testsuite/tests'
[ 151s] make[4]: Nothing to be done for 'all'.
[ 151s] make[4]: Leaving directory
'/home/abuild/rpmbuild/BUILD/yast2-core-3.2.2/scr/testsuite/tests'
[ 151s] make[4]: Entering directory
'/home/abuild/rpmbuild/BUILD/yast2-core-3.2.2/scr/testsuite'
[ 151s] clang++ -DHAVE_CONFIG_H -I. -I../.. -I../../libycp/src/include
-I../../liby2/src/include -I../../libscr/src/include
-I../../liby2util-r/src/include -DY2LOG=\"scr\" -DNDEBUG -fmessage-length=0
-O2 -Wall -D_FORTIFY_SOURCE=2 -fstack-protector-strong -funwind-tables
-fasynchronous-unwind-tables -Werror -std=gnu++0x -Wall -Wformat=2 -c -o
runscr.o runscr.cc
[ 153s] /bin/sh ../../libtool --tag=CXX --mode=link clang++ -DY2LOG=\"scr\"
-DNDEBUG -fmessage-length=0 -O2 -Wall -D_FORTIFY_SOURCE=2
-fstack-protector-strong -funwind-tables -fasynchronous-unwind-tables -Werror
-std=gnu++0x -Wall -Wformat=2 -Xlinker --whole-archive
../../agent-dummy/src/libpy2ag_dummy.la ../src/libpy2scr.la -Xlinker
--no-whole-archive -o runscr runscr.o ../../libscr/src/libscr.la
../../libycp/src/libycp.la ../../libycp/src/libycpvalues.la
../../liby2/src/liby2.la ../../liby2util-r/src/liby2util.la
[ 153s] libtool: link: clang++ -DY2LOG=\"scr\" -DNDEBUG -fmessage-length=0 -O2
-Wall -D_FORTIFY_SOURCE=2 -fstack-protector-strong -funwind-tables
-fasynchronous-unwind-tables -Werror -std=gnu++0x -Wall -Wformat=2
-Wl,--whole-archive -Wl,--no-whole-archive -o .libs/runscr runscr.o
../../agent-dummy/src/.libs/libpy2ag_dummy.so
/home/abuild/rpmbuild/BUILD/yast2-core-3.2.2/libycp/src/.libs/libycp.so
/home/abuild/rpmbuild/BUILD/yast2-core-3.2.2/liby2/src/.libs/liby2.so
../src/.libs/libpy2scr.so
/home/abuild/rpmbuild/BUILD/yast2-core-3.2.2/libscr/src/.libs/libscr.so
../../libscr/src/.libs/libscr.so ../../libycp/src/.libs/libycp.so -lowcrypt
-lcrypt
/home/abuild/rpmbuild/BUILD/yast2-core-3.2.2/libycp/src/.libs/libycpvalues.so
../../libycp/src/.libs/libycpvalues.so ../../liby2/src/.libs/liby2.so
/home/abuild/rpmbuild/BUILD/yast2-core-3.2.2/liby2util-r/src/.libs/liby2util.so
-ldl -lpthread ../../liby2util-r/src/.libs/liby2util.so -lutil -Wl,-rpath
-Wl,/usr/lib64/YaST2/plugin -Wl,-rpath -Wl,/usr/lib64
[ 154s] make[4]: Leaving directory
'/home/abuild/rpmbuild/BUILD/yast2-core-3.2.2/scr/testsuite'
[ 154s] make[3]: Leaving directory
'/home/abuild/rpmbuild/BUILD/yast2-core-3.2.2/scr/testsuite'
[ 154s] make[3]: Entering directory
'/home/abuild/rpmbuild/BUILD/yast2-core-3.2.2/scr'
[ 154s] make[3]: Nothing to be done for 'all-am'.
[ 154s] make[3]: Leaving directory
'/home/abuild/rpmbuild/BUILD/yast2-core-3.2.2/scr'
[ 154s] make[2]: Leaving directory
'/home/abuild/rpmbuild/BUILD/yast2-core-3.2.2/scr'
[ 154s] Making all in agent-system
[ 154s] make[2]: Entering directory
'/home/abuild/rpmbuild/BUILD/yast2-core-3.2.2/agent-system'
[ 154s] Making all in conf
[ 154s] make[3]: Entering directory
'/home/abuild/rpmbuild/BUILD/yast2-core-3.2.2/agent-system/conf'
[ 154s] make[3]: Nothing to be done for 'all'.
[ 154s] make[3]: Leaving directory
'/home/abuild/rpmbuild/BUILD/yast2-core-3.2.2/agent-system/conf'
[ 154s] Making all in doc
[ 154s] make[3]: Entering directory
'/home/abuild/rpmbuild/BUILD/yast2-core-3.2.2/agent-system/doc'
[ 154s] make[4]: Entering directory
'/home/abuild/rpmbuild/BUILD/yast2-core-3.2.2/agent-system/doc'
[ 154s] make[4]: Nothing to be done for 'all-am'.
[ 154s] make[4]: Leaving directory
'/home/abuild/rpmbuild/BUILD/yast2-core-3.2.2/agent-system/doc'
[ 154s] make[3]: Leaving directory
'/home/abuild/rpmbuild/BUILD/yast2-core-3.2.2/agent-system/doc'
[ 154s] Making all in src
[ 154s] make[3]: Entering directory
'/home/abuild/rpmbuild/BUILD/yast2-core-3.2.2/agent-system/src'
[ 154s] /bin/sh ../../libtool --tag=CXX --mode=compile clang++
-DHAVE_CONFIG_H -I. -I../.. -I../../libycp/src/include
-I../../liby2/src/include -I../../libscr/src/include
-I../../liby2util-r/src/include -DY2LOG=\"agent-system\" -DNDEBUG
-fmessage-length=0 -O2 -Wall -D_FORTIFY_SOURCE=2 -fstack-protector-strong
-funwind-tables -fasynchronous-unwind-tables -Werror -std=gnu++0x -Wall
-Wformat=2 -c -o Y2CCSystemAgent.lo Y2CCSystemAgent.cc
[ 154s] /bin/sh ../../libtool --tag=CXX --mode=compile clang++
-DHAVE_CONFIG_H -I. -I../.. -I../../libycp/src/include
-I../../liby2/src/include -I../../libscr/src/include
-I../../liby2util-r/src/include -DY2LOG=\"agent-system\" -DNDEBUG
-fmessage-length=0 -O2 -Wall -D_FORTIFY_SOURCE=2 -fstack-protector-strong
-funwind-tables -fasynchronous-unwind-tables -Werror -std=gnu++0x -Wall
-Wformat=2 -c -o ShellCommand.lo ShellCommand.cc
[ 154s] libtool: compile: clang++ -DHAVE_CONFIG_H -I. -I../..
-I../../libycp/src/include -I../../liby2/src/include -I../../libscr/src/include
-I../../liby2util-r/src/include -DY2LOG=\"agent-system\" -DNDEBUG
-fmessage-length=0 -O2 -Wall -D_FORTIFY_SOURCE=2 -fstack-protector-strong
-funwind-tables -fasynchronous-unwind-tables -Werror -std=gnu++0x -Wall
-Wformat=2 -c ShellCommand.cc -fPIC -DPIC -o .libs/ShellCommand.o
[ 154s] libtool: compile: clang++ -DHAVE_CONFIG_H -I. -I../..
-I../../libycp/src/include -I../../liby2/src/include -I../../libscr/src/include
-I../../liby2util-r/src/include -DY2LOG=\"agent-system\" -DNDEBUG
-fmessage-length=0 -O2 -Wall -D_FORTIFY_SOURCE=2 -fstack-protector-strong
-funwind-tables -fasynchronous-unwind-tables -Werror -std=gnu++0x -Wall
-Wformat=2 -c Y2CCSystemAgent.cc -fPIC -DPIC -o .libs/Y2CCSystemAgent.o
[ 155s] /bin/sh ../../libtool --tag=CXX --mode=compile clang++
-DHAVE_CONFIG_H -I. -I../.. -I../../libycp/src/include
-I../../liby2/src/include -I../../libscr/src/include
-I../../liby2util-r/src/include -DY2LOG=\"agent-system\" -DNDEBUG
-fmessage-length=0 -O2 -Wall -D_FORTIFY_SOURCE=2 -fstack-protector-strong
-funwind-tables -fasynchronous-unwind-tables -Werror -std=gnu++0x -Wall
-Wformat=2 -c -o SystemAgent.lo SystemAgent.cc
[ 155s] libtool: compile: clang++ -DHAVE_CONFIG_H -I. -I../..
-I../../libycp/src/include -I../../liby2/src/include -I../../libscr/src/include
-I../../liby2util-r/src/include -DY2LOG=\"agent-system\" -DNDEBUG
-fmessage-length=0 -O2 -Wall -D_FORTIFY_SOURCE=2 -fstack-protector-strong
-funwind-tables -fasynchronous-unwind-tables -Werror -std=gnu++0x -Wall
-Wformat=2 -c SystemAgent.cc -fPIC -DPIC -o .libs/SystemAgent.o
[ 158s] /bin/sh ../../libtool --tag=CXX --mode=link clang++
-DY2LOG=\"agent-system\" -DNDEBUG -fmessage-length=0 -O2 -Wall
-D_FORTIFY_SOURCE=2 -fstack-protector-strong -funwind-tables
-fasynchronous-unwind-tables -Werror -std=gnu++0x -Wall -Wformat=2
-version-info 2:0 -o libpy2ag_system.la -rpath /usr/lib64/YaST2/plugin
Y2CCSystemAgent.lo ShellCommand.lo SystemAgent.lo ../../libscr/src/libscr.la
../../libycp/src/libycp.la ../../libycp/src/libycpvalues.la
../../liby2/src/liby2.la ../../liby2util-r/src/liby2util.la
[ 159s] libtool: link: clang++ -fPIC -DPIC -shared -nostdlib
/usr/bin/../lib64/gcc/x86_64-suse-linux/6/../../../../lib64/crti.o
/usr/bin/../lib64/gcc/x86_64-suse-linux/6/crtbeginS.o .libs/Y2CCSystemAgent.o
.libs/ShellCommand.o .libs/SystemAgent.o -Wl,-rpath
-Wl,/home/abuild/rpmbuild/BUILD/yast2-core-3.2.2/libscr/src/.libs -Wl,-rpath
-Wl,/home/abuild/rpmbuild/BUILD/yast2-core-3.2.2/libycp/src/.libs -Wl,-rpath
-Wl,/home/abuild/rpmbuild/BUILD/yast2-core-3.2.2/liby2/src/.libs -Wl,-rpath
-Wl,/home/abuild/rpmbuild/BUILD/yast2-core-3.2.2/liby2util-r/src/.libs
-Wl,-rpath -Wl,/usr/lib64
-L/home/abuild/rpmbuild/BUILD/yast2-core-3.2.2/libycp/src/.libs
-L/home/abuild/rpmbuild/BUILD/yast2-core-3.2.2/liby2util-r/src/.libs
../../libscr/src/.libs/libscr.so ../../libycp/src/.libs/libycp.so -lowcrypt
-lcrypt
/home/abuild/rpmbuild/BUILD/yast2-core-3.2.2/libycp/src/.libs/libycpvalues.so
../../libycp/src/.libs/libycpvalues.so ../../liby2/src/.libs/liby2.so
/home/abuild/rpmbuild/BUILD/yast2-core-3.2.2/liby2util-r/src/.libs/liby2util.so
-ldl -lpthread ../../liby2util-r/src/.libs/liby2util.so -lutil
-L/usr/bin/../lib64/gcc/x86_64-suse-linux/6
-L/usr/bin/../lib64/gcc/x86_64-suse-linux/6/../../../../lib64
-L/usr/bin/../lib64 -L/lib/../lib64 -L/usr/lib/../lib64
-L/usr/bin/../lib64/gcc/x86_64-suse-linux/6/../../../../x86_64-suse-linux/lib
-L/usr/bin/../lib64/gcc/x86_64-suse-linux/6/../../.. -L/usr/bin/../lib -L/lib
-L/usr/lib -lstdc++ -lm -lc -lgcc_s
/usr/bin/../lib64/gcc/x86_64-suse-linux/6/crtendS.o
/usr/bin/../lib64/gcc/x86_64-suse-linux/6/../../../../lib64/crtn.o -O2
-fstack-protector-strong -Wl,-soname -Wl,libpy2ag_system.so.2 -o
.libs/libpy2ag_system.so.2.0.0
[ 159s] libtool: link: (cd ".libs" && rm -f "libpy2ag_system.so.2" && ln -s
"libpy2ag_system.so.2.0.0" "libpy2ag_system.so.2")
[ 159s] libtool: link: (cd ".libs" && rm -f "libpy2ag_system.so" && ln -s
"libpy2ag_system.so.2.0.0" "libpy2ag_system.so")
[ 159s] libtool: link: ( cd ".libs" && rm -f "libpy2ag_system.la" && ln -s
"../libpy2ag_system.la" "libpy2ag_system.la" )
[ 159s] make[3]: Leaving directory
'/home/abuild/rpmbuild/BUILD/yast2-core-3.2.2/agent-system/src'
[ 159s] Making all in testsuite
[ 159s] make[3]: Entering directory
'/home/abuild/rpmbuild/BUILD/yast2-core-3.2.2/agent-system/testsuite'
[ 159s] Making all in config
[ 159s] make[4]: Entering directory
'/home/abuild/rpmbuild/BUILD/yast2-core-3.2.2/agent-system/testsuite/config'
[ 159s] make[4]: Nothing to be done for 'all'.
[ 159s] make[4]: Leaving directory
'/home/abuild/rpmbuild/BUILD/yast2-core-3.2.2/agent-system/testsuite/config'
[ 159s] Making all in lib
[ 159s] make[4]: Entering directory
'/home/abuild/rpmbuild/BUILD/yast2-core-3.2.2/agent-system/testsuite/lib'
[ 159s] make[4]: Nothing to be done for 'all'.
[ 159s] make[4]: Leaving directory
'/home/abuild/rpmbuild/BUILD/yast2-core-3.2.2/agent-system/testsuite/lib'
[ 159s] Making all in ag_system.test
[ 159s] make[4]: Entering directory
'/home/abuild/rpmbuild/BUILD/yast2-core-3.2.2/agent-system/testsuite/ag_system.test'
[ 159s] make[4]: Nothing to be done for 'all'.
[ 159s] make[4]: Leaving directory
'/home/abuild/rpmbuild/BUILD/yast2-core-3.2.2/agent-system/testsuite/ag_system.test'
[ 159s] Making all in tests
[ 159s] make[4]: Entering directory
'/home/abuild/rpmbuild/BUILD/yast2-core-3.2.2/agent-system/testsuite/tests'
[ 159s] make[4]: Nothing to be done for 'all'.
[ 159s] make[4]: Leaving directory
'/home/abuild/rpmbuild/BUILD/yast2-core-3.2.2/agent-system/testsuite/tests'
[ 159s] make[4]: Entering directory
'/home/abuild/rpmbuild/BUILD/yast2-core-3.2.2/agent-system/testsuite'
[ 159s] clang++ -DHAVE_CONFIG_H -I. -I../.. -I../../libycp/src/include
-I../../liby2/src/include -I../../libscr/src/include
-I../../liby2util-r/src/include -DY2LOG=\"agent-system\" -DNDEBUG
-fmessage-length=0 -O2 -Wall -D_FORTIFY_SOURCE=2 -fstack-protector-strong
-funwind-tables -fasynchronous-unwind-tables -Werror -std=gnu++0x -Wall
-Wformat=2 -c -o runag_system.o runag_system.cc
[ 160s] /bin/sh ../../libtool --tag=CXX --mode=link clang++
-DY2LOG=\"agent-system\" -DNDEBUG -fmessage-length=0 -O2 -Wall
-D_FORTIFY_SOURCE=2 -fstack-protector-strong -funwind-tables
-fasynchronous-unwind-tables -Werror -std=gnu++0x -Wall -Wformat=2 -Xlinker
--whole-archive ../src/libpy2ag_system.la -Xlinker --no-whole-archive -o
runag_system runag_system.o ../../libscr/src/libscr.la
../../libycp/src/libycp.la ../../libycp/src/libycpvalues.la
../../liby2/src/liby2.la ../../liby2util-r/src/liby2util.la
[ 161s] libtool: link: clang++ -DY2LOG=\"agent-system\" -DNDEBUG
-fmessage-length=0 -O2 -Wall -D_FORTIFY_SOURCE=2 -fstack-protector-strong
-funwind-tables -fasynchronous-unwind-tables -Werror -std=gnu++0x -Wall
-Wformat=2 -Wl,--whole-archive -Wl,--no-whole-archive -o .libs/runag_system
runag_system.o ../src/.libs/libpy2ag_system.so
/home/abuild/rpmbuild/BUILD/yast2-core-3.2.2/libscr/src/.libs/libscr.so
/home/abuild/rpmbuild/BUILD/yast2-core-3.2.2/libycp/src/.libs/libycp.so
/home/abuild/rpmbuild/BUILD/yast2-core-3.2.2/liby2/src/.libs/liby2.so
../../libscr/src/.libs/libscr.so ../../libycp/src/.libs/libycp.so -lowcrypt
-lcrypt
/home/abuild/rpmbuild/BUILD/yast2-core-3.2.2/libycp/src/.libs/libycpvalues.so
../../libycp/src/.libs/libycpvalues.so ../../liby2/src/.libs/liby2.so
/home/abuild/rpmbuild/BUILD/yast2-core-3.2.2/liby2util-r/src/.libs/liby2util.so
-ldl -lpthread ../../liby2util-r/src/.libs/liby2util.so -lutil -Wl,-rpath
-Wl,/usr/lib64/YaST2/plugin -Wl,-rpath -Wl,/usr/lib64
[ 161s] make[4]: Leaving directory
'/home/abuild/rpmbuild/BUILD/yast2-core-3.2.2/agent-system/testsuite'
[ 161s] make[3]: Leaving directory
'/home/abuild/rpmbuild/BUILD/yast2-core-3.2.2/agent-system/testsuite'
[ 161s] make[3]: Entering directory
'/home/abuild/rpmbuild/BUILD/yast2-core-3.2.2/agent-system'
[ 161s] make[3]: Nothing to be done for 'all-am'.
[ 161s] make[3]: Leaving directory
'/home/abuild/rpmbuild/BUILD/yast2-core-3.2.2/agent-system'
[ 161s] make[2]: Leaving directory
'/home/abuild/rpmbuild/BUILD/yast2-core-3.2.2/agent-system'
[ 161s] Making all in agent-any
[ 161s] make[2]: Entering directory
'/home/abuild/rpmbuild/BUILD/yast2-core-3.2.2/agent-any'
[ 161s] Making all in src
[ 161s] make[3]: Entering directory
'/home/abuild/rpmbuild/BUILD/yast2-core-3.2.2/agent-any/src'
[ 161s] /bin/sh ../../libtool --tag=CXX --mode=compile clang++
-DHAVE_CONFIG_H -I. -I../.. -I../../libycp/src/include
-I../../liby2/src/include -I../../libscr/src/include
-I../../liby2util-r/src/include -DY2LOG=\"agent-any\" -DNDEBUG
-fmessage-length=0 -O2 -Wall -D_FORTIFY_SOURCE=2 -fstack-protector-strong
-funwind-tables -fasynchronous-unwind-tables -Werror -std=gnu++0x -Wall
-Wformat=2 -c -o AnyAgent.lo AnyAgent.cc
[ 161s] /bin/sh ../../libtool --tag=CXX --mode=compile clang++
-DHAVE_CONFIG_H -I. -I../.. -I../../libycp/src/include
-I../../liby2/src/include -I../../libscr/src/include
-I../../liby2util-r/src/include -DY2LOG=\"agent-any\" -DNDEBUG
-fmessage-length=0 -O2 -Wall -D_FORTIFY_SOURCE=2 -fstack-protector-strong
-funwind-tables -fasynchronous-unwind-tables -Werror -std=gnu++0x -Wall
-Wformat=2 -c -o AnyAgentBasic.lo AnyAgentBasic.cc
[ 161s] libtool: compile: clang++ -DHAVE_CONFIG_H -I. -I../..
-I../../libycp/src/include -I../../liby2/src/include -I../../libscr/src/include
-I../../liby2util-r/src/include -DY2LOG=\"agent-any\" -DNDEBUG
-fmessage-length=0 -O2 -Wall -D_FORTIFY_SOURCE=2 -fstack-protector-strong
-funwind-tables -fasynchronous-unwind-tables -Werror -std=gnu++0x -Wall
-Wformat=2 -c AnyAgent.cc -fPIC -DPIC -o .libs/AnyAgent.o
[ 161s] libtool: compile: clang++ -DHAVE_CONFIG_H -I. -I../..
-I../../libycp/src/include -I../../liby2/src/include -I../../libscr/src/include
-I../../liby2util-r/src/include -DY2LOG=\"agent-any\" -DNDEBUG
-fmessage-length=0 -O2 -Wall -D_FORTIFY_SOURCE=2 -fstack-protector-strong
-funwind-tables -fasynchronous-unwind-tables -Werror -std=gnu++0x -Wall
-Wformat=2 -c AnyAgentBasic.cc -fPIC -DPIC -o .libs/AnyAgentBasic.o
[ 163s] /bin/sh ../../libtool --tag=CXX --mode=compile clang++
-DHAVE_CONFIG_H -I. -I../.. -I../../libycp/src/include
-I../../liby2/src/include -I../../libscr/src/include
-I../../liby2util-r/src/include -DY2LOG=\"agent-any\" -DNDEBUG
-fmessage-length=0 -O2 -Wall -D_FORTIFY_SOURCE=2 -fstack-protector-strong
-funwind-tables -fasynchronous-unwind-tables -Werror -std=gnu++0x -Wall
-Wformat=2 -c -o AnyAgentComplex.lo AnyAgentComplex.cc
[ 163s] libtool: compile: clang++ -DHAVE_CONFIG_H -I. -I../..
-I../../libycp/src/include -I../../liby2/src/include -I../../libscr/src/include
-I../../liby2util-r/src/include -DY2LOG=\"agent-any\" -DNDEBUG
-fmessage-length=0 -O2 -Wall -D_FORTIFY_SOURCE=2 -fstack-protector-strong
-funwind-tables -fasynchronous-unwind-tables -Werror -std=gnu++0x -Wall
-Wformat=2 -c AnyAgentComplex.cc -fPIC -DPIC -o .libs/AnyAgentComplex.o
[ 164s] /bin/sh ../../libtool --tag=CXX --mode=compile clang++
-DHAVE_CONFIG_H -I. -I../.. -I../../libycp/src/include
-I../../liby2/src/include -I../../libscr/src/include
-I../../liby2util-r/src/include -DY2LOG=\"agent-any\" -DNDEBUG
-fmessage-length=0 -O2 -Wall -D_FORTIFY_SOURCE=2 -fstack-protector-strong
-funwind-tables -fasynchronous-unwind-tables -Werror -std=gnu++0x -Wall
-Wformat=2 -c -o Y2CCAnyAgent.lo Y2CCAnyAgent.cc
[ 164s] libtool: compile: clang++ -DHAVE_CONFIG_H -I. -I../..
-I../../libycp/src/include -I../../liby2/src/include -I../../libscr/src/include
-I../../liby2util-r/src/include -DY2LOG=\"agent-any\" -DNDEBUG
-fmessage-length=0 -O2 -Wall -D_FORTIFY_SOURCE=2 -fstack-protector-strong
-funwind-tables -fasynchronous-unwind-tables -Werror -std=gnu++0x -Wall
-Wformat=2 -c Y2CCAnyAgent.cc -fPIC -DPIC -o .libs/Y2CCAnyAgent.o
[ 166s] /bin/sh ../../libtool --tag=CXX --mode=link clang++
-DY2LOG=\"agent-any\" -DNDEBUG -fmessage-length=0 -O2 -Wall
-D_FORTIFY_SOURCE=2 -fstack-protector-strong -funwind-tables
-fasynchronous-unwind-tables -Werror -std=gnu++0x -Wall -Wformat=2
-version-info 2:0 -o libpy2ag_anyagent.la -rpath /usr/lib64/YaST2/plugin
AnyAgent.lo AnyAgentBasic.lo AnyAgentComplex.lo Y2CCAnyAgent.lo
../../libscr/src/libscr.la ../../libycp/src/libycp.la
../../libycp/src/libycpvalues.la ../../liby2/src/liby2.la
../../liby2util-r/src/liby2util.la
[ 166s] libtool: link: clang++ -fPIC -DPIC -shared -nostdlib
/usr/bin/../lib64/gcc/x86_64-suse-linux/6/../../../../lib64/crti.o
/usr/bin/../lib64/gcc/x86_64-suse-linux/6/crtbeginS.o .libs/AnyAgent.o
.libs/AnyAgentBasic.o .libs/AnyAgentComplex.o .libs/Y2CCAnyAgent.o -Wl,-rpath
-Wl,/home/abuild/rpmbuild/BUILD/yast2-core-3.2.2/libscr/src/.libs -Wl,-rpath
-Wl,/home/abuild/rpmbuild/BUILD/yast2-core-3.2.2/libycp/src/.libs -Wl,-rpath
-Wl,/home/abuild/rpmbuild/BUILD/yast2-core-3.2.2/liby2/src/.libs -Wl,-rpath
-Wl,/home/abuild/rpmbuild/BUILD/yast2-core-3.2.2/liby2util-r/src/.libs
-Wl,-rpath -Wl,/usr/lib64
-L/home/abuild/rpmbuild/BUILD/yast2-core-3.2.2/libycp/src/.libs
-L/home/abuild/rpmbuild/BUILD/yast2-core-3.2.2/liby2util-r/src/.libs
../../libscr/src/.libs/libscr.so ../../libycp/src/.libs/libycp.so -lowcrypt
-lcrypt
/home/abuild/rpmbuild/BUILD/yast2-core-3.2.2/libycp/src/.libs/libycpvalues.so
../../libycp/src/.libs/libycpvalues.so ../../liby2/src/.libs/liby2.so
/home/abuild/rpmbuild/BUILD/yast2-core-3.2.2/liby2util-r/src/.libs/liby2util.so
-ldl -lpthread ../../liby2util-r/src/.libs/liby2util.so -lutil
-L/usr/bin/../lib64/gcc/x86_64-suse-linux/6
-L/usr/bin/../lib64/gcc/x86_64-suse-linux/6/../../../../lib64
-L/usr/bin/../lib64 -L/lib/../lib64 -L/usr/lib/../lib64
-L/usr/bin/../lib64/gcc/x86_64-suse-linux/6/../../../../x86_64-suse-linux/lib
-L/usr/bin/../lib64/gcc/x86_64-suse-linux/6/../../.. -L/usr/bin/../lib -L/lib
-L/usr/lib -lstdc++ -lm -lc -lgcc_s
/usr/bin/../lib64/gcc/x86_64-suse-linux/6/crtendS.o
/usr/bin/../lib64/gcc/x86_64-suse-linux/6/../../../../lib64/crtn.o -O2
-fstack-protector-strong -Wl,-soname -Wl,libpy2ag_anyagent.so.2 -o
.libs/libpy2ag_anyagent.so.2.0.0
[ 166s] libtool: link: (cd ".libs" && rm -f "libpy2ag_anyagent.so.2" && ln -s
"libpy2ag_anyagent.so.2.0.0" "libpy2ag_anyagent.so.2")
[ 166s] libtool: link: (cd ".libs" && rm -f "libpy2ag_anyagent.so" && ln -s
"libpy2ag_anyagent.so.2.0.0" "libpy2ag_anyagent.so")
[ 166s] libtool: link: ( cd ".libs" && rm -f "libpy2ag_anyagent.la" && ln -s
"../libpy2ag_anyagent.la" "libpy2ag_anyagent.la" )
[ 166s] make[3]: Leaving directory
'/home/abuild/rpmbuild/BUILD/yast2-core-3.2.2/agent-any/src'
[ 166s] Making all in doc
[ 166s] make[3]: Entering directory
'/home/abuild/rpmbuild/BUILD/yast2-core-3.2.2/agent-any/doc'
[ 166s] make[4]: Entering directory
'/home/abuild/rpmbuild/BUILD/yast2-core-3.2.2/agent-any/doc'
[ 166s] make[4]: Nothing to be done for 'all-am'.
[ 166s] make[4]: Leaving directory
'/home/abuild/rpmbuild/BUILD/yast2-core-3.2.2/agent-any/doc'
[ 166s] make[3]: Leaving directory
'/home/abuild/rpmbuild/BUILD/yast2-core-3.2.2/agent-any/doc'
[ 166s] Making all in testsuite
[ 166s] make[3]: Entering directory
'/home/abuild/rpmbuild/BUILD/yast2-core-3.2.2/agent-any/testsuite'
[ 166s] Making all in config
[ 166s] make[4]: Entering directory
'/home/abuild/rpmbuild/BUILD/yast2-core-3.2.2/agent-any/testsuite/config'
[ 166s] make[4]: Nothing to be done for 'all'.
[ 166s] make[4]: Leaving directory
'/home/abuild/rpmbuild/BUILD/yast2-core-3.2.2/agent-any/testsuite/config'
[ 166s] Making all in lib
[ 166s] make[4]: Entering directory
'/home/abuild/rpmbuild/BUILD/yast2-core-3.2.2/agent-any/testsuite/lib'
[ 166s] make[4]: Nothing to be done for 'all'.
[ 166s] make[4]: Leaving directory
'/home/abuild/rpmbuild/BUILD/yast2-core-3.2.2/agent-any/testsuite/lib'
[ 166s] Making all in ag_anyagent.test
[ 166s] make[4]: Entering directory
'/home/abuild/rpmbuild/BUILD/yast2-core-3.2.2/agent-any/testsuite/ag_anyagent.test'
[ 166s] make[4]: Nothing to be done for 'all'.
[ 166s] make[4]: Leaving directory
'/home/abuild/rpmbuild/BUILD/yast2-core-3.2.2/agent-any/testsuite/ag_anyagent.test'
[ 166s] Making all in tests
[ 166s] make[4]: Entering directory
'/home/abuild/rpmbuild/BUILD/yast2-core-3.2.2/agent-any/testsuite/tests'
[ 166s] make[4]: Nothing to be done for 'all'.
[ 166s] make[4]: Leaving directory
'/home/abuild/rpmbuild/BUILD/yast2-core-3.2.2/agent-any/testsuite/tests'
[ 166s] make[4]: Entering directory
'/home/abuild/rpmbuild/BUILD/yast2-core-3.2.2/agent-any/testsuite'
[ 166s] clang++ -DHAVE_CONFIG_H -I. -I../.. -I../../libycp/src/include
-I../../liby2/src/include -I../../libscr/src/include
-I../../liby2util-r/src/include -DY2LOG=\"agent-any\" -DNDEBUG
-fmessage-length=0 -O2 -Wall -D_FORTIFY_SOURCE=2 -fstack-protector-strong
-funwind-tables -fasynchronous-unwind-tables -Werror -std=gnu++0x -Wall
-Wformat=2 -c -o runag_anyagent.o runag_anyagent.cc
[ 168s] /bin/sh ../../libtool --tag=CXX --mode=link clang++
-DY2LOG=\"agent-any\" -DNDEBUG -fmessage-length=0 -O2 -Wall
-D_FORTIFY_SOURCE=2 -fstack-protector-strong -funwind-tables
-fasynchronous-unwind-tables -Werror -std=gnu++0x -Wall -Wformat=2 -Xlinker
--whole-archive ../src/libpy2ag_anyagent.la -Xlinker --no-whole-archive -o
runag_anyagent runag_anyagent.o ../../libscr/src/libscr.la
../../libycp/src/libycp.la ../../libycp/src/libycpvalues.la
../../liby2/src/liby2.la ../../liby2util-r/src/liby2util.la
[ 168s] libtool: link: clang++ -DY2LOG=\"agent-any\" -DNDEBUG
-fmessage-length=0 -O2 -Wall -D_FORTIFY_SOURCE=2 -fstack-protector-strong
-funwind-tables -fasynchronous-unwind-tables -Werror -std=gnu++0x -Wall
-Wformat=2 -Wl,--whole-archive -Wl,--no-whole-archive -o .libs/runag_anyagent
runag_anyagent.o ../src/.libs/libpy2ag_anyagent.so
/home/abuild/rpmbuild/BUILD/yast2-core-3.2.2/libscr/src/.libs/libscr.so
/home/abuild/rpmbuild/BUILD/yast2-core-3.2.2/libycp/src/.libs/libycp.so
/home/abuild/rpmbuild/BUILD/yast2-core-3.2.2/liby2/src/.libs/liby2.so
../../libscr/src/.libs/libscr.so ../../libycp/src/.libs/libycp.so -lowcrypt
-lcrypt
/home/abuild/rpmbuild/BUILD/yast2-core-3.2.2/libycp/src/.libs/libycpvalues.so
../../libycp/src/.libs/libycpvalues.so ../../liby2/src/.libs/liby2.so
/home/abuild/rpmbuild/BUILD/yast2-core-3.2.2/liby2util-r/src/.libs/liby2util.so
-ldl -lpthread ../../liby2util-r/src/.libs/liby2util.so -lutil -Wl,-rpath
-Wl,/usr/lib64/YaST2/plugin -Wl,-rpath -Wl,/usr/lib64
[ 169s] make[4]: Leaving directory
'/home/abuild/rpmbuild/BUILD/yast2-core-3.2.2/agent-any/testsuite'
[ 169s] make[3]: Leaving directory
'/home/abuild/rpmbuild/BUILD/yast2-core-3.2.2/agent-any/testsuite'
[ 169s] make[3]: Entering directory
'/home/abuild/rpmbuild/BUILD/yast2-core-3.2.2/agent-any'
[ 169s] make[3]: Nothing to be done for 'all-am'.
[ 169s] make[3]: Leaving directory
'/home/abuild/rpmbuild/BUILD/yast2-core-3.2.2/agent-any'
[ 169s] make[2]: Leaving directory
'/home/abuild/rpmbuild/BUILD/yast2-core-3.2.2/agent-any'
[ 169s] Making all in agent-ini
[ 169s] make[2]: Entering directory
'/home/abuild/rpmbuild/BUILD/yast2-core-3.2.2/agent-ini'
[ 169s] Making all in conf
[ 169s] make[3]: Entering directory
'/home/abuild/rpmbuild/BUILD/yast2-core-3.2.2/agent-ini/conf'
[ 169s] make[3]: Nothing to be done for 'all'.
[ 169s] make[3]: Leaving directory
'/home/abuild/rpmbuild/BUILD/yast2-core-3.2.2/agent-ini/conf'
[ 169s] Making all in src
[ 169s] make[3]: Entering directory
'/home/abuild/rpmbuild/BUILD/yast2-core-3.2.2/agent-ini/src'
[ 169s] /bin/sh ../../libtool --tag=CXX --mode=compile clang++
-DHAVE_CONFIG_H -I. -I../.. -I../../libycp/src/include
-I../../liby2/src/include -I../../libscr/src/include
-I../../liby2util-r/src/include -DY2LOG=\"agent-ini\" -DNDEBUG
-fmessage-length=0 -O2 -Wall -D_FORTIFY_SOURCE=2 -fstack-protector-strong
-funwind-tables -fasynchronous-unwind-tables -Werror -std=gnu++0x -Wall
-Wformat=2 -c -o IniAgent.lo IniAgent.cc
[ 169s] /bin/sh ../../libtool --tag=CXX --mode=compile clang++
-DHAVE_CONFIG_H -I. -I../.. -I../../libycp/src/include
-I../../liby2/src/include -I../../libscr/src/include
-I../../liby2util-r/src/include -DY2LOG=\"agent-ini\" -DNDEBUG
-fmessage-length=0 -O2 -Wall -D_FORTIFY_SOURCE=2 -fstack-protector-strong
-funwind-tables -fasynchronous-unwind-tables -Werror -std=gnu++0x -Wall
-Wformat=2 -c -o IniParser.lo IniParser.cc
[ 169s] libtool: compile: clang++ -DHAVE_CONFIG_H -I. -I../..
-I../../libycp/src/include -I../../liby2/src/include -I../../libscr/src/include
-I../../liby2util-r/src/include -DY2LOG=\"agent-ini\" -DNDEBUG
-fmessage-length=0 -O2 -Wall -D_FORTIFY_SOURCE=2 -fstack-protector-strong
-funwind-tables -fasynchronous-unwind-tables -Werror -std=gnu++0x -Wall
-Wformat=2 -c IniParser.cc -fPIC -DPIC -o .libs/IniParser.o
[ 169s] libtool: compile: clang++ -DHAVE_CONFIG_H -I. -I../..
-I../../libycp/src/include -I../../liby2/src/include -I../../libscr/src/include
-I../../liby2util-r/src/include -DY2LOG=\"agent-ini\" -DNDEBUG
-fmessage-length=0 -O2 -Wall -D_FORTIFY_SOURCE=2 -fstack-protector-strong
-funwind-tables -fasynchronous-unwind-tables -Werror -std=gnu++0x -Wall
-Wformat=2 -c IniAgent.cc -fPIC -DPIC -o .libs/IniAgent.o
[ 170s] IniParser.cc:1069:34: error: format string is not a string literal
[-Werror,-Wformat-nonliteral]
[ 170s] out_buffer = format (sections[readby].begin.out.c_str (),
ini.getName());
[ 170s] ^~~~~~~~~~~~~~~~~~~~~~~~~~~~~~~~~~~
[ 170s] IniParser.cc:1093:25: error: format string is not a string literal
[-Werror,-Wformat-nonliteral]
[ 170s] out_buffer = format (params[e.getReadBy
()].line.out.c_str (), e.getName(), val.c_str());
[ 170s]
^~~~~~~~~~~~~~~~~~~~~~~~~~~~~~~~~~~~~~~~
[ 170s] IniParser.cc:1104:27: error: format string is not a string literal
[-Werror,-Wformat-nonliteral]
[ 170s] out_buffer = format (sections[readby].end.out.c_str (),
ini.getName());
[ 170s] ^~~~~~~~~~~~~~~~~~~~~~~~~~~~~~~~~
[ 170s] IniParser.cc:1116:16: error: format string is not a string literal
[-Werror,-Wformat-nonliteral]
[ 170s] file = format(rewrites[rb].out.c_str (), sec.c_str());
[ 170s] ^~~~~~~~~~~~~~~~~~~~~~~~~
[ 170s] 4 errors generated.
[ 170s] make[3]: *** [Makefile:522: IniParser.lo] Error 1
[ 170s] make[3]: *** Waiting for unfinished jobs....
[ 171s] make[3]: Leaving directory
'/home/abuild/rpmbuild/BUILD/yast2-core-3.2.2/agent-ini/src'
[ 171s] make[2]: *** [Makefile:406: all-recursive] Error 1
[ 171s] make[2]: Leaving directory
'/home/abuild/rpmbuild/BUILD/yast2-core-3.2.2/agent-ini'
[ 171s] make[1]: *** [Makefile:581: all-recursive] Error 1
[ 171s] make[1]: Leaving directory
'/home/abuild/rpmbuild/BUILD/yast2-core-3.2.2'
[ 171s] make: *** [Makefile:450: all] Error 2
[ 171s] error: Bad exit status from /var/tmp/rpm-tmp.lAfUXu (%build)
[ 171s]
[ 171s]
[ 171s] RPM build errors:
[ 171s] Bad exit status from /var/tmp/rpm-tmp.lAfUXu (%build)
[ 171s]
[ 171s] yast-jenkins failed "build yast2-core.spec" at Fri Jan 6 12:50:33 UTC
2017.
[ 171s]

The buildroot was: /var/tmp/build-root-openSUSE_Factory
rm -rf YaST:Head
rake aborted!
Command failed with status (1): [yes | osc -A 'https://api.opensuse.org/' b...]

Tasks: TOP => osc:build
(See full trace by running task with --trace)
cleaning
Build step 'Execute shell' marked build as failure

< Previous Next >
This Thread
Follow Ups
References