Mailinglist Archive: yast-commit (559 mails)

< Previous Next >
[yast-commit] Build failed in Jenkins: yast-packager-master #331
  • From: admin@xxxxxxxxxxxx
  • Date: Thu, 7 May 2015 17:00:01 +0200 (CEST)
  • Message-id: <1917809231.5.1431010801717.JavaMail.jenkins@ci-opensuse>
See <http://ci.opensuse.org/job/yast-packager-master/331/changes>

Changes:

[ancor] Force installation of libyui-qt for graphical autoinstallation

[ancor] Version and changelog updates

[imobachgs] Refactor packages VNC and X11 calculation to be tag-based

[imobachgs] Update from code review

[imobachgs] Refactor PackagesClasses#modePackages to be tag-based

[imobachgs] PackagesClass#find_providers logs a message when more than 1
provider is found

[imobachgs] Update from code review

[imobachgs] Improve packages selection on Packages module

[igonzalezsosa] Change Packages#find_provider to select the installed provider
if any

[igonzalezsosa] Revert "Change Packages#find_provider to select the installed
provider if any"

[igonzalezsosa] Improve package selection for Packages#find_provider

[igonzalezsosa] Update .changes file

------------------------------------------
[...truncated 1577 lines...]
[ 92s] + cd yast2-packager-3.1.68
[ 92s] + make install
DESTDIR=/home/abuild/rpmbuild/BUILDROOT/yast2-packager-3.1.68-1.x86_64
[ 92s] Making install in desktop
[ 92s] make[1]: Entering directory
'/home/abuild/rpmbuild/BUILD/yast2-packager-3.1.68/desktop'
[ 92s] make[2]: Entering directory
'/home/abuild/rpmbuild/BUILD/yast2-packager-3.1.68/desktop'
[ 92s] make[2]: Nothing to be done for 'install-exec-am'.
[ 92s] /usr/bin/mkdir -p
'/home/abuild/rpmbuild/BUILDROOT/yast2-packager-3.1.68-1.x86_64/usr/share/applications'
[ 92s] /usr/bin/install -c -p -m 644 yast2-packager.desktop
'/home/abuild/rpmbuild/BUILDROOT/yast2-packager-3.1.68-1.x86_64/usr/share/applications'
[ 92s] make[2]: Leaving directory
'/home/abuild/rpmbuild/BUILD/yast2-packager-3.1.68/desktop'
[ 92s] make[1]: Leaving directory
'/home/abuild/rpmbuild/BUILD/yast2-packager-3.1.68/desktop'
[ 92s] Making install in doc
[ 92s] make[1]: Entering directory
'/home/abuild/rpmbuild/BUILD/yast2-packager-3.1.68/doc'
[ 92s] Making install in autodocs
[ 92s] make[2]: Entering directory
'/home/abuild/rpmbuild/BUILD/yast2-packager-3.1.68/doc/autodocs'
[ 92s] make[3]: Entering directory
'/home/abuild/rpmbuild/BUILD/yast2-packager-3.1.68/doc/autodocs'
[ 92s] make[3]: Nothing to be done for 'install-exec-am'.
[ 92s] /usr/bin/mkdir -p
'/home/abuild/rpmbuild/BUILDROOT/yast2-packager-3.1.68-1.x86_64/usr/share/doc/packages/yast2-packager//autodocs'
[ 92s] /usr/bin/mkdir -p
'/home/abuild/rpmbuild/BUILDROOT/yast2-packager-3.1.68-1.x86_64/usr/share/doc/packages/yast2-packager//autodocs/js'
[ 92s] /usr/bin/install -c -p -m 644 js/full_list.js js/jquery.js js/app.js
'/home/abuild/rpmbuild/BUILDROOT/yast2-packager-3.1.68-1.x86_64/usr/share/doc/packages/yast2-packager//autodocs/js'
[ 92s] /usr/bin/install -c -p -m 644 index.html _index.html file_list.html
class_list.html Yast.html method_list.html top-level-namespace.html frames.html
'/home/abuild/rpmbuild/BUILDROOT/yast2-packager-3.1.68-1.x86_64/usr/share/doc/packages/yast2-packager//autodocs/.'
[ 92s] /usr/bin/mkdir -p
'/home/abuild/rpmbuild/BUILDROOT/yast2-packager-3.1.68-1.x86_64/usr/share/doc/packages/yast2-packager//autodocs/Yast'
[ 92s] /usr/bin/install -c -p -m 644 Yast/PackageSlideShowClass.html
Yast/InstShowInfoClass.html Yast/PackagerInstSourceDialogsInclude.html
Yast/PackagerStorageIncludeInclude.html Yast/ProductLicenseClass.html
Yast/AddOnProductClass.html Yast/PackageInstallationClass.html
Yast/PackagesClass.html Yast/OneClickInstallStandardClass.html
Yast/CheckMediaClass.html Yast/PackagerKeyManagerDialogsInclude.html
Yast/SlideShowCallbacksClass.html Yast/SourceManagerSLPClass.html
Yast/DefaultDesktopClass.html Yast/SourceDialogsClass.html
Yast/CheckmediaUiInclude.html Yast/KeyManagerClass.html Yast/InstURLClass.html
Yast/SourceManagerClass.html Yast/PackagerRepositoriesIncludeInclude.html
Yast/PackagerLoadReleaseNotesInclude.html Yast/SpaceCalculationClass.html
'/home/abuild/rpmbuild/BUILDROOT/yast2-packager-3.1.68-1.x86_64/usr/share/doc/packages/yast2-packager//autodocs/Yast'
[ 92s] /usr/bin/mkdir -p
'/home/abuild/rpmbuild/BUILDROOT/yast2-packager-3.1.68-1.x86_64/usr/share/doc/packages/yast2-packager//autodocs/css'
[ 92s] /usr/bin/install -c -p -m 644 css/full_list.css css/style.css
css/common.css
'/home/abuild/rpmbuild/BUILDROOT/yast2-packager-3.1.68-1.x86_64/usr/share/doc/packages/yast2-packager//autodocs/css'
[ 92s] make[3]: Leaving directory
'/home/abuild/rpmbuild/BUILD/yast2-packager-3.1.68/doc/autodocs'
[ 92s] make[2]: Leaving directory
'/home/abuild/rpmbuild/BUILD/yast2-packager-3.1.68/doc/autodocs'
[ 92s] make[2]: Entering directory
'/home/abuild/rpmbuild/BUILD/yast2-packager-3.1.68/doc'
[ 92s] make[3]: Entering directory
'/home/abuild/rpmbuild/BUILD/yast2-packager-3.1.68/doc'
[ 92s] make[3]: Nothing to be done for 'install-exec-am'.
[ 92s] make[3]: Leaving directory
'/home/abuild/rpmbuild/BUILD/yast2-packager-3.1.68/doc'
[ 92s] make[2]: Leaving directory
'/home/abuild/rpmbuild/BUILD/yast2-packager-3.1.68/doc'
[ 92s] make[1]: Leaving directory
'/home/abuild/rpmbuild/BUILD/yast2-packager-3.1.68/doc'
[ 92s] Making install in src
[ 92s] make[1]: Entering directory
'/home/abuild/rpmbuild/BUILD/yast2-packager-3.1.68/src'
[ 92s] make[2]: Entering directory
'/home/abuild/rpmbuild/BUILD/yast2-packager-3.1.68/src'
[ 92s] make[2]: Nothing to be done for 'install-exec-am'.
[ 92s] /usr/bin/mkdir -p
'/home/abuild/rpmbuild/BUILDROOT/yast2-packager-3.1.68-1.x86_64/usr/lib/YaST2/servers_non_y2'
[ 92s] /usr/bin/install -c -p servers_non_y2/ag_zypp_repos
'/home/abuild/rpmbuild/BUILDROOT/yast2-packager-3.1.68-1.x86_64/usr/lib/YaST2/servers_non_y2'
[ 92s] /usr/bin/mkdir -p
'/home/abuild/rpmbuild/BUILDROOT/yast2-packager-3.1.68-1.x86_64/usr/share/YaST2/clients'
[ 92s] /usr/bin/install -c -p -m 644 clients/repositories.rb
clients/inst_check_memsize.rb clients/select_slp_source.rb
clients/software_simple_proposal.rb clients/inst_packages.rb
clients/key_manager.rb clients/wrapper_storage.rb clients/inst_checkmedia.rb
clients/inst_kickoff.rb clients/media_proposal.rb
clients/do_not_show_again_editor.rb clients/inst_rpmcopy.rb
clients/inst_custom_packages.rb clients/inst_productsources.rb
clients/software_proposal.rb clients/pkg_finish.rb clients/inst_sw_select.rb
clients/sw_single.rb clients/add_inst_source_slptype.rb clients/inst_desktop.rb
clients/inst_mediacopy.rb clients/wrapper_slideshow_callbacks.rb
clients/checkmedia.rb
'/home/abuild/rpmbuild/BUILDROOT/yast2-packager-3.1.68-1.x86_64/usr/share/YaST2/clients'
[ 92s] /usr/bin/mkdir -p
'/home/abuild/rpmbuild/BUILDROOT/yast2-packager-3.1.68-1.x86_64/usr/share/applications/YaST2'
[ 92s] /usr/bin/install -c -p -m 644 desktop/sw_source.desktop
desktop/sw_single.desktop desktop/checkmedia.desktop
'/home/abuild/rpmbuild/BUILDROOT/yast2-packager-3.1.68-1.x86_64/usr/share/applications/YaST2'
[ 92s] /usr/bin/mkdir -p
'/home/abuild/rpmbuild/BUILDROOT/yast2-packager-3.1.68-1.x86_64/usr/share/YaST2/modules'
[ 92s] /usr/bin/install -c -p -m 644 modules/InstShowInfo.rb
modules/DefaultDesktop.rb modules/PackageInstallation.rb
modules/PackageSlideShow.rb modules/ProductLicense.rb
modules/SpaceCalculation.rb modules/SourceManager.rb modules/AddOnProduct.rb
modules/InstURL.rb modules/OneClickInstallStandard.rb modules/Packages.rb
modules/SourceDialogs.rb modules/SourceManagerSLP.rb modules/KeyManager.rb
modules/CheckMedia.rb modules/SlideShowCallbacks.rb
'/home/abuild/rpmbuild/BUILDROOT/yast2-packager-3.1.68-1.x86_64/usr/share/YaST2/modules'
[ 92s] /usr/bin/mkdir -p
'/home/abuild/rpmbuild/BUILDROOT/yast2-packager-3.1.68-1.x86_64/usr/share/YaST2/scrconf'
[ 92s] /usr/bin/install -c -p -m 644 scrconf/etc_zypp_conf.scr
scrconf/zypp_repos.scr
'/home/abuild/rpmbuild/BUILDROOT/yast2-packager-3.1.68-1.x86_64/usr/share/YaST2/scrconf'
[ 92s] /usr/bin/mkdir -p
'/home/abuild/rpmbuild/BUILDROOT/yast2-packager-3.1.68-1.x86_64/usr/share/YaST2/include/checkmedia'
[ 92s] /usr/bin/install -c -p -m 644 include/checkmedia/ui.rb
'/home/abuild/rpmbuild/BUILDROOT/yast2-packager-3.1.68-1.x86_64/usr/share/YaST2/include/checkmedia'
[ 92s] /usr/bin/mkdir -p
'/home/abuild/rpmbuild/BUILDROOT/yast2-packager-3.1.68-1.x86_64/usr/share/YaST2/include/packager'
[ 92s] /usr/bin/install -c -p -m 644 include/packager/key_manager_dialogs.rb
include/packager/storage_include.rb include/packager/inst_source_dialogs.rb
include/packager/load_release_notes.rb include/packager/repositories_include.rb
'/home/abuild/rpmbuild/BUILDROOT/yast2-packager-3.1.68-1.x86_64/usr/share/YaST2/include/packager'
[ 92s] make[2]: Leaving directory
'/home/abuild/rpmbuild/BUILD/yast2-packager-3.1.68/src'
[ 92s] make[1]: Leaving directory
'/home/abuild/rpmbuild/BUILD/yast2-packager-3.1.68/src'
[ 92s] Making install in test
[ 92s] make[1]: Entering directory
'/home/abuild/rpmbuild/BUILD/yast2-packager-3.1.68/test'
[ 92s] make[2]: Entering directory
'/home/abuild/rpmbuild/BUILD/yast2-packager-3.1.68/test'
[ 92s] make[2]: Nothing to be done for 'install-exec-am'.
[ 92s] make[2]: Nothing to be done for 'install-data-am'.
[ 92s] make[2]: Leaving directory
'/home/abuild/rpmbuild/BUILD/yast2-packager-3.1.68/test'
[ 92s] make[1]: Leaving directory
'/home/abuild/rpmbuild/BUILD/yast2-packager-3.1.68/test'
[ 92s] Making install in testsuite
[ 92s] make[1]: Entering directory
'/home/abuild/rpmbuild/BUILD/yast2-packager-3.1.68/testsuite'
[ 92s] make -f /usr/share/YaST2/data/testsuite/Makefile.testsuite
RPMNAME=yast2-packager srcdir=.
[ 92s] make[2]: Entering directory
'/home/abuild/rpmbuild/BUILD/yast2-packager-3.1.68/testsuite'
[ 92s] cp -f /usr/share/YaST2/data/testsuite/skel/default.exp
config/default.exp
[ 92s] cp -f /usr/share/YaST2/data/testsuite/skel/unix.exp config/unix.exp
[ 92s] cp -f /usr/share/YaST2/data/testsuite/skel/unknown.exp
config/unknown.exp
[ 92s] make[2]: Leaving directory
'/home/abuild/rpmbuild/BUILD/yast2-packager-3.1.68/testsuite'
[ 92s] make[2]: Entering directory
'/home/abuild/rpmbuild/BUILD/yast2-packager-3.1.68/testsuite'
[ 92s] make[2]: Nothing to be done for 'install-exec-am'.
[ 92s] make[2]: Nothing to be done for 'install-data-am'.
[ 92s] make[2]: Leaving directory
'/home/abuild/rpmbuild/BUILD/yast2-packager-3.1.68/testsuite'
[ 92s] make[1]: Leaving directory
'/home/abuild/rpmbuild/BUILD/yast2-packager-3.1.68/testsuite'
[ 92s] make[1]: Entering directory
'/home/abuild/rpmbuild/BUILD/yast2-packager-3.1.68'
[ 92s] make[2]: Entering directory
'/home/abuild/rpmbuild/BUILD/yast2-packager-3.1.68'
[ 92s] make[2]: Nothing to be done for 'install-exec-am'.
[ 92s] /usr/bin/mkdir -p
'/home/abuild/rpmbuild/BUILDROOT/yast2-packager-3.1.68-1.x86_64/usr/share/doc/packages/yast2-packager'
[ 92s] /usr/bin/install -c -p -m 644 COPYING
'/home/abuild/rpmbuild/BUILDROOT/yast2-packager-3.1.68-1.x86_64/usr/share/doc/packages/yast2-packager'
[ 92s] make[2]: Leaving directory
'/home/abuild/rpmbuild/BUILD/yast2-packager-3.1.68'
[ 92s] make[1]: Leaving directory
'/home/abuild/rpmbuild/BUILD/yast2-packager-3.1.68'
[ 92s] + '[' '!' -f /usr/share/YaST2/data/devtools/NO_MAKE_CHECK ']'
[ 92s] + make check VERBOSE=1
Y2DIR=/home/abuild/rpmbuild/BUILDROOT/yast2-packager-3.1.68-1.x86_64//usr/share/YaST2
DESTDIR=/home/abuild/rpmbuild/BUILDROOT/yast2-packager-3.1.68-1.x86_64
[ 92s] Making check in desktop
[ 92s] make[1]: Entering directory
'/home/abuild/rpmbuild/BUILD/yast2-packager-3.1.68/desktop'
[ 92s] make[1]: Nothing to be done for 'check'.
[ 92s] make[1]: Leaving directory
'/home/abuild/rpmbuild/BUILD/yast2-packager-3.1.68/desktop'
[ 92s] Making check in doc
[ 92s] make[1]: Entering directory
'/home/abuild/rpmbuild/BUILD/yast2-packager-3.1.68/doc'
[ 92s] Making check in autodocs
[ 92s] make[2]: Entering directory
'/home/abuild/rpmbuild/BUILD/yast2-packager-3.1.68/doc/autodocs'
[ 92s] make[2]: Nothing to be done for 'check'.
[ 92s] make[2]: Leaving directory
'/home/abuild/rpmbuild/BUILD/yast2-packager-3.1.68/doc/autodocs'
[ 92s] make[2]: Entering directory
'/home/abuild/rpmbuild/BUILD/yast2-packager-3.1.68/doc'
[ 92s] make[2]: Nothing to be done for 'check-am'.
[ 92s] make[2]: Leaving directory
'/home/abuild/rpmbuild/BUILD/yast2-packager-3.1.68/doc'
[ 92s] make[1]: Leaving directory
'/home/abuild/rpmbuild/BUILD/yast2-packager-3.1.68/doc'
[ 92s] Making check in src
[ 92s] make[1]: Entering directory
'/home/abuild/rpmbuild/BUILD/yast2-packager-3.1.68/src'
[ 92s] make[1]: Nothing to be done for 'check'.
[ 92s] make[1]: Leaving directory
'/home/abuild/rpmbuild/BUILD/yast2-packager-3.1.68/src'
[ 92s] Making check in test
[ 92s] make[1]: Entering directory
'/home/abuild/rpmbuild/BUILD/yast2-packager-3.1.68/test'
[ 92s] make check-TESTS
[ 92s] make[2]: Entering directory
'/home/abuild/rpmbuild/BUILD/yast2-packager-3.1.68/test'
[ 92s] make[3]: Entering directory
'/home/abuild/rpmbuild/BUILD/yast2-packager-3.1.68/test'
[ 92s] FAIL: addon_product_test.rb
[ 92s] FAIL: packages_test.rb
[ 92s] FAIL: source_dialogs_test.rb
[ 92s] FAIL: space_calculation_test.rb
[ 93s] ================================================
[ 93s] yast2-packager 3.1.68: test/test-suite.log
[ 93s] ================================================
[ 93s]
[ 93s] # TOTAL: 4
[ 93s] # PASS: 0
[ 93s] # SKIP: 0
[ 93s] # XFAIL: 0
[ 93s] # FAIL: 4
[ 93s] # XPASS: 0
[ 93s] # ERROR: 0
[ 93s]
[ 93s] .. contents:: :depth: 2
[ 93s]
[ 93s] FAIL: addon_product_test
[ 93s] ========================
[ 93s]
[ 93s] /usr/lib64/ruby/2.2.0/rubygems/core_ext/kernel_require.rb:54:in
`require': cannot load such file -- yast (LoadError)
[ 93s] from
/usr/lib64/ruby/2.2.0/rubygems/core_ext/kernel_require.rb:54:in `require'
[ 93s] from
/home/abuild/rpmbuild/BUILD/yast2-packager-3.1.68/test/test_helper.rb:8:in
`<top (required)>'
[ 93s] from
/home/abuild/rpmbuild/BUILD/yast2-packager-3.1.68/test/addon_product_test.rb:3:in
`require_relative'
[ 93s] from
/home/abuild/rpmbuild/BUILD/yast2-packager-3.1.68/test/addon_product_test.rb:3:in
`<top (required)>'
[ 93s] from
/usr/lib64/ruby/gems/2.2.0/gems/rspec-core-3.2.3/lib/rspec/core/configuration.rb:1226:in
`load'
[ 93s] from
/usr/lib64/ruby/gems/2.2.0/gems/rspec-core-3.2.3/lib/rspec/core/configuration.rb:1226:in
`block in load_spec_files'
[ 93s] from
/usr/lib64/ruby/gems/2.2.0/gems/rspec-core-3.2.3/lib/rspec/core/configuration.rb:1224:in
`each'
[ 93s] from
/usr/lib64/ruby/gems/2.2.0/gems/rspec-core-3.2.3/lib/rspec/core/configuration.rb:1224:in
`load_spec_files'
[ 93s] from
/usr/lib64/ruby/gems/2.2.0/gems/rspec-core-3.2.3/lib/rspec/core/runner.rb:97:in
`setup'
[ 93s] from
/usr/lib64/ruby/gems/2.2.0/gems/rspec-core-3.2.3/lib/rspec/core/runner.rb:85:in
`run'
[ 93s] from
/usr/lib64/ruby/gems/2.2.0/gems/rspec-core-3.2.3/lib/rspec/core/runner.rb:70:in
`run'
[ 93s] from
/usr/lib64/ruby/gems/2.2.0/gems/rspec-core-3.2.3/lib/rspec/core/runner.rb:38:in
`invoke'
[ 93s] from
/usr/lib64/ruby/gems/2.2.0/gems/rspec-core-3.2.3/exe/rspec:4:in `<top
(required)>'
[ 93s] from /usr/bin/rspec:23:in `load'
[ 93s] from /usr/bin/rspec:23:in `<main>'
[ 93s] FAIL addon_product_test.rb (exit status: 1)
[ 93s]
[ 93s] FAIL: packages_test
[ 93s] ===================
[ 93s]
[ 93s] /usr/lib64/ruby/2.2.0/rubygems/core_ext/kernel_require.rb:54:in
`require': cannot load such file -- yast (LoadError)
[ 93s] from
/usr/lib64/ruby/2.2.0/rubygems/core_ext/kernel_require.rb:54:in `require'
[ 93s] from
/home/abuild/rpmbuild/BUILD/yast2-packager-3.1.68/test/test_helper.rb:8:in
`<top (required)>'
[ 93s] from
/home/abuild/rpmbuild/BUILD/yast2-packager-3.1.68/test/packages_test.rb:3:in
`require_relative'
[ 93s] from
/home/abuild/rpmbuild/BUILD/yast2-packager-3.1.68/test/packages_test.rb:3:in
`<top (required)>'
[ 93s] from
/usr/lib64/ruby/gems/2.2.0/gems/rspec-core-3.2.3/lib/rspec/core/configuration.rb:1226:in
`load'
[ 93s] from
/usr/lib64/ruby/gems/2.2.0/gems/rspec-core-3.2.3/lib/rspec/core/configuration.rb:1226:in
`block in load_spec_files'
[ 93s] from
/usr/lib64/ruby/gems/2.2.0/gems/rspec-core-3.2.3/lib/rspec/core/configuration.rb:1224:in
`each'
[ 93s] from
/usr/lib64/ruby/gems/2.2.0/gems/rspec-core-3.2.3/lib/rspec/core/configuration.rb:1224:in
`load_spec_files'
[ 93s] from
/usr/lib64/ruby/gems/2.2.0/gems/rspec-core-3.2.3/lib/rspec/core/runner.rb:97:in
`setup'
[ 93s] from
/usr/lib64/ruby/gems/2.2.0/gems/rspec-core-3.2.3/lib/rspec/core/runner.rb:85:in
`run'
[ 93s] from
/usr/lib64/ruby/gems/2.2.0/gems/rspec-core-3.2.3/lib/rspec/core/runner.rb:70:in
`run'
[ 93s] from
/usr/lib64/ruby/gems/2.2.0/gems/rspec-core-3.2.3/lib/rspec/core/runner.rb:38:in
`invoke'
[ 93s] from
/usr/lib64/ruby/gems/2.2.0/gems/rspec-core-3.2.3/exe/rspec:4:in `<top
(required)>'
[ 93s] from /usr/bin/rspec:23:in `load'
[ 93s] from /usr/bin/rspec:23:in `<main>'
[ 93s] FAIL packages_test.rb (exit status: 1)
[ 93s]
[ 93s] FAIL: source_dialogs_test
[ 93s] =========================
[ 93s]
[ 93s] /usr/lib64/ruby/2.2.0/rubygems/core_ext/kernel_require.rb:54:in
`require': cannot load such file -- yast (LoadError)
[ 93s] from
/usr/lib64/ruby/2.2.0/rubygems/core_ext/kernel_require.rb:54:in `require'
[ 93s] from
/home/abuild/rpmbuild/BUILD/yast2-packager-3.1.68/test/test_helper.rb:8:in
`<top (required)>'
[ 93s] from
/home/abuild/rpmbuild/BUILD/yast2-packager-3.1.68/test/source_dialogs_test.rb:3:in
`require_relative'
[ 93s] from
/home/abuild/rpmbuild/BUILD/yast2-packager-3.1.68/test/source_dialogs_test.rb:3:in
`<top (required)>'
[ 93s] from
/usr/lib64/ruby/gems/2.2.0/gems/rspec-core-3.2.3/lib/rspec/core/configuration.rb:1226:in
`load'
[ 93s] from
/usr/lib64/ruby/gems/2.2.0/gems/rspec-core-3.2.3/lib/rspec/core/configuration.rb:1226:in
`block in load_spec_files'
[ 93s] from
/usr/lib64/ruby/gems/2.2.0/gems/rspec-core-3.2.3/lib/rspec/core/configuration.rb:1224:in
`each'
[ 93s] from
/usr/lib64/ruby/gems/2.2.0/gems/rspec-core-3.2.3/lib/rspec/core/configuration.rb:1224:in
`load_spec_files'
[ 93s] from
/usr/lib64/ruby/gems/2.2.0/gems/rspec-core-3.2.3/lib/rspec/core/runner.rb:97:in
`setup'
[ 93s] from
/usr/lib64/ruby/gems/2.2.0/gems/rspec-core-3.2.3/lib/rspec/core/runner.rb:85:in
`run'
[ 93s] from
/usr/lib64/ruby/gems/2.2.0/gems/rspec-core-3.2.3/lib/rspec/core/runner.rb:70:in
`run'
[ 93s] from
/usr/lib64/ruby/gems/2.2.0/gems/rspec-core-3.2.3/lib/rspec/core/runner.rb:38:in
`invoke'
[ 93s] from
/usr/lib64/ruby/gems/2.2.0/gems/rspec-core-3.2.3/exe/rspec:4:in `<top
(required)>'
[ 93s] from /usr/bin/rspec:23:in `load'
[ 93s] from /usr/bin/rspec:23:in `<main>'
[ 93s] FAIL source_dialogs_test.rb (exit status: 1)
[ 93s]
[ 93s] FAIL: space_calculation_test
[ 93s] ============================
[ 93s]
[ 93s] /usr/lib64/ruby/2.2.0/rubygems/core_ext/kernel_require.rb:54:in
`require': cannot load such file -- yast (LoadError)
[ 93s] from
/usr/lib64/ruby/2.2.0/rubygems/core_ext/kernel_require.rb:54:in `require'
[ 93s] from
/home/abuild/rpmbuild/BUILD/yast2-packager-3.1.68/test/test_helper.rb:8:in
`<top (required)>'
[ 93s] from
/home/abuild/rpmbuild/BUILD/yast2-packager-3.1.68/test/space_calculation_test.rb:3:in
`require_relative'
[ 93s] from
/home/abuild/rpmbuild/BUILD/yast2-packager-3.1.68/test/space_calculation_test.rb:3:in
`<top (required)>'
[ 93s] from
/usr/lib64/ruby/gems/2.2.0/gems/rspec-core-3.2.3/lib/rspec/core/configuration.rb:1226:in
`load'
[ 93s] from
/usr/lib64/ruby/gems/2.2.0/gems/rspec-core-3.2.3/lib/rspec/core/configuration.rb:1226:in
`block in load_spec_files'
[ 93s] from
/usr/lib64/ruby/gems/2.2.0/gems/rspec-core-3.2.3/lib/rspec/core/configuration.rb:1224:in
`each'
[ 93s] from
/usr/lib64/ruby/gems/2.2.0/gems/rspec-core-3.2.3/lib/rspec/core/configuration.rb:1224:in
`load_spec_files'
[ 93s] from
/usr/lib64/ruby/gems/2.2.0/gems/rspec-core-3.2.3/lib/rspec/core/runner.rb:97:in
`setup'
[ 93s] from
/usr/lib64/ruby/gems/2.2.0/gems/rspec-core-3.2.3/lib/rspec/core/runner.rb:85:in
`run'
[ 93s] from
/usr/lib64/ruby/gems/2.2.0/gems/rspec-core-3.2.3/lib/rspec/core/runner.rb:70:in
`run'
[ 93s] from
/usr/lib64/ruby/gems/2.2.0/gems/rspec-core-3.2.3/lib/rspec/core/runner.rb:38:in
`invoke'
[ 93s] from
/usr/lib64/ruby/gems/2.2.0/gems/rspec-core-3.2.3/exe/rspec:4:in `<top
(required)>'
[ 93s] from /usr/bin/rspec:23:in `load'
[ 93s] from /usr/bin/rspec:23:in `<main>'
[ 93s] FAIL space_calculation_test.rb (exit status: 1)
[ 93s]
[ 93s]
============================================================================
[ 93s] Testsuite summary for yast2-packager 3.1.68
[ 93s]
============================================================================
[ 93s] # TOTAL: 4
[ 93s] # PASS: 0
[ 93s] # SKIP: 0
[ 93s] # XFAIL: 0
[ 93s] # FAIL: 4
[ 93s] # XPASS: 0
[ 93s] # ERROR: 0
[ 93s]
============================================================================
[ 93s] See test/test-suite.log
[ 93s] Please report to http://bugs.opensuse.org/
[ 93s]
============================================================================
[ 93s] Makefile:500: recipe for target 'test-suite.log' failed
[ 93s] make[3]: *** [test-suite.log] Error 1
[ 93s] make[3]: Leaving directory
'/home/abuild/rpmbuild/BUILD/yast2-packager-3.1.68/test'
[ 93s] Makefile:606: recipe for target 'check-TESTS' failed
[ 93s] make[2]: *** [check-TESTS] Error 2
[ 93s] make[2]: Leaving directory
'/home/abuild/rpmbuild/BUILD/yast2-packager-3.1.68/test'
[ 93s] Makefile:665: recipe for target 'check-am' failed
[ 93s] make[1]: *** [check-am] Error 2
[ 93s] make[1]: Leaving directory
'/home/abuild/rpmbuild/BUILD/yast2-packager-3.1.68/test'
[ 93s] Makefile:496: recipe for target 'check-recursive' failed
[ 93s] make: *** [check-recursive] Error 1
[ 93s] error: Bad exit status from /var/tmp/rpm-tmp.SMSAjr (%install)
[ 93s]
[ 93s]
[ 93s] RPM build errors:
[ 93s] Bad exit status from /var/tmp/rpm-tmp.SMSAjr (%install)
Skipping verification of package signatures
Writing build configuration
Running build

The buildroot was: /var/tmp/build-root-openSUSE_Factory
rm -rf YaST:Head
rake aborted!
Command failed with status (1): [yes | osc build --no-verify --release=1 --...]

Tasks: TOP => osc:sr => osc:commit => osc:build
(See full trace by running task with --trace)
cleaning
Build step 'Execute shell' marked build as failure

< Previous Next >
This Thread
Follow Ups