Mailinglist Archive: yast-commit (559 mails)

< Previous Next >
[yast-commit] Build failed in Jenkins: yast-autoinstallation-master #116
  • From: hudson@xxxxxxx
  • Date: Wed, 6 May 2015 01:59:25 +0200 (CEST)
  • Message-id: <670705445.489.1430870365759.JavaMail.jenkins@river>
See <http://river.suse.de/job/yast-autoinstallation-master/116/>

------------------------------------------
[...truncated 1988 lines...]
[ 28s] make[1]: Leaving directory
'/home/abuild/rpmbuild/BUILD/autoyast2-3.1.76/control'
[ 28s] Making install in doc
[ 28s] make[1]: Entering directory
'/home/abuild/rpmbuild/BUILD/autoyast2-3.1.76/doc'
[ 28s] Making install in autodocs
[ 28s] make[2]: Entering directory
'/home/abuild/rpmbuild/BUILD/autoyast2-3.1.76/doc/autodocs'
[ 28s] make[3]: Entering directory
'/home/abuild/rpmbuild/BUILD/autoyast2-3.1.76/doc/autodocs'
[ 28s] make[3]: Nothing to be done for 'install-exec-am'.
[ 28s] /usr/bin/mkdir -p
'/home/abuild/rpmbuild/BUILDROOT/autoyast2-3.1.76-1.x86_64/usr/share/doc/packages/autoyast2//autodocs'
[ 28s] /usr/bin/mkdir -p
'/home/abuild/rpmbuild/BUILDROOT/autoyast2-3.1.76-1.x86_64/usr/share/doc/packages/autoyast2//autodocs/Yast'
[ 28s] /usr/bin/install -c -p -m 644 Yast/AutoinstScriptsClass.html
Yast/AutoinstFileClass.html Yast/AutoinstallDriveDialogInclude.html
Yast/AutoinstallAutopartInclude.html
Yast/AutoinstallAdvancedPartitionDialogInclude.html
Yast/AutoinstallPartitionDialogInclude.html Yast/AutoinstDriveClass.html
Yast/AutoinstallXmlInclude.html Yast/AutoinstLVMClass.html
Yast/AutoinstallHelpsInclude.html Yast/Y2ModuleConfigClass.html
Yast/AutoinstallClassesInclude.html Yast/AutoinstClassClass.html
Yast/AutoinstallDialogsInclude.html Yast/KickstartClass.html
Yast/AutoinstallIoInclude.html Yast/AutoInstallRulesClass.html
Yast/AutoinstPartitionClass.html Yast/AutoinstPartPlanClass.html
Yast/AutoinstallConftreeInclude.html Yast/AutoinstallVolgroupDialogInclude.html
Yast/ProfileLocationClass.html Yast/AutoinstRAIDClass.html
Yast/AutoinstallTypesInclude.html Yast/ProfileClass.html
Yast/AutoinstGeneralClass.html Yast/AutoinstallScriptDialogsInclude.html
Yast/AutoinstallWizardsInclude.html Yast/AutoInstallClass.html
Yast/AutoinstSoftwareClass.html Yast/AutoinstCommonClass.html
Yast/AutoinstConfigClass.html Yast/AutoinstallAskInclude.html
Yast/AutoinstallTreeInclude.html Yast/AutoinstallGeneralDialogsInclude.html
Yast/AutoinstallStorageDialogInclude.html Yast/AutoinstStorageClass.html
Yast/AutoinstCloneClass.html Yast/AutoinstallCommonInclude.html
Yast/AutoinstImageClass.html
'/home/abuild/rpmbuild/BUILDROOT/autoyast2-3.1.76-1.x86_64/usr/share/doc/packages/autoyast2//autodocs/Yast'
[ 28s] /usr/bin/mkdir -p
'/home/abuild/rpmbuild/BUILDROOT/autoyast2-3.1.76-1.x86_64/usr/share/doc/packages/autoyast2//autodocs/js'
[ 28s] /usr/bin/install -c -p -m 644 js/full_list.js js/jquery.js js/app.js
'/home/abuild/rpmbuild/BUILDROOT/autoyast2-3.1.76-1.x86_64/usr/share/doc/packages/autoyast2//autodocs/js'
[ 28s] /usr/bin/mkdir -p
'/home/abuild/rpmbuild/BUILDROOT/autoyast2-3.1.76-1.x86_64/usr/share/doc/packages/autoyast2//autodocs/Yast/AutoinstConfigClass'
[ 28s] /usr/bin/install -c -p -m 644 Yast/AutoinstConfigClass/Target.html
'/home/abuild/rpmbuild/BUILDROOT/autoyast2-3.1.76-1.x86_64/usr/share/doc/packages/autoyast2//autodocs/Yast/AutoinstConfigClass'
[ 28s] /usr/bin/install -c -p -m 644 index.html _index.html file_list.html
class_list.html Yast.html method_list.html top-level-namespace.html frames.html
'/home/abuild/rpmbuild/BUILDROOT/autoyast2-3.1.76-1.x86_64/usr/share/doc/packages/autoyast2//autodocs/.'
[ 28s] /usr/bin/mkdir -p
'/home/abuild/rpmbuild/BUILDROOT/autoyast2-3.1.76-1.x86_64/usr/share/doc/packages/autoyast2//autodocs/Yast'
[ 28s] /usr/bin/install -c -p -m 644
Yast/AutoinstallAutoinstDialogsInclude.html
'/home/abuild/rpmbuild/BUILDROOT/autoyast2-3.1.76-1.x86_64/usr/share/doc/packages/autoyast2//autodocs/Yast'
[ 28s] /usr/bin/mkdir -p
'/home/abuild/rpmbuild/BUILDROOT/autoyast2-3.1.76-1.x86_64/usr/share/doc/packages/autoyast2//autodocs/css'
[ 28s] /usr/bin/install -c -p -m 644 css/full_list.css css/style.css
css/common.css
'/home/abuild/rpmbuild/BUILDROOT/autoyast2-3.1.76-1.x86_64/usr/share/doc/packages/autoyast2//autodocs/css'
[ 28s] make[3]: Leaving directory
'/home/abuild/rpmbuild/BUILD/autoyast2-3.1.76/doc/autodocs'
[ 28s] make[2]: Leaving directory
'/home/abuild/rpmbuild/BUILD/autoyast2-3.1.76/doc/autodocs'
[ 28s] make[2]: Entering directory
'/home/abuild/rpmbuild/BUILD/autoyast2-3.1.76/doc'
[ 28s] make[3]: Entering directory
'/home/abuild/rpmbuild/BUILD/autoyast2-3.1.76/doc'
[ 28s] make[3]: Nothing to be done for 'install-exec-am'.
[ 28s] make[3]: Nothing to be done for 'install-data-am'.
[ 28s] make[3]: Leaving directory
'/home/abuild/rpmbuild/BUILD/autoyast2-3.1.76/doc'
[ 28s] make[2]: Leaving directory
'/home/abuild/rpmbuild/BUILD/autoyast2-3.1.76/doc'
[ 28s] make[1]: Leaving directory
'/home/abuild/rpmbuild/BUILD/autoyast2-3.1.76/doc'
[ 28s] Making install in modconfig
[ 28s] make[1]: Entering directory
'/home/abuild/rpmbuild/BUILD/autoyast2-3.1.76/modconfig'
[ 28s] make[2]: Entering directory
'/home/abuild/rpmbuild/BUILD/autoyast2-3.1.76/modconfig'
[ 28s] make[2]: Nothing to be done for 'install-exec-am'.
[ 28s] /usr/bin/mkdir -p
'/home/abuild/rpmbuild/BUILDROOT/autoyast2-3.1.76-1.x86_64/usr/share/autoinstall/modules'
[ 28s] /usr/bin/install -c -p -m 644 partitioning.desktop general.desktop
report.desktop scripts.desktop software.desktop files.desktop
'/home/abuild/rpmbuild/BUILDROOT/autoyast2-3.1.76-1.x86_64/usr/share/autoinstall/modules'
[ 28s] make[2]: Leaving directory
'/home/abuild/rpmbuild/BUILD/autoyast2-3.1.76/modconfig'
[ 28s] make[1]: Leaving directory
'/home/abuild/rpmbuild/BUILD/autoyast2-3.1.76/modconfig'
[ 28s] Making install in scripts
[ 28s] make[1]: Entering directory
'/home/abuild/rpmbuild/BUILD/autoyast2-3.1.76/scripts'
[ 28s] make[2]: Entering directory
'/home/abuild/rpmbuild/BUILD/autoyast2-3.1.76/scripts'
[ 28s] make[2]: Nothing to be done for 'install-exec-am'.
[ 28s] make[2]: Nothing to be done for 'install-data-am'.
[ 28s] make[2]: Leaving directory
'/home/abuild/rpmbuild/BUILD/autoyast2-3.1.76/scripts'
[ 28s] make[1]: Leaving directory
'/home/abuild/rpmbuild/BUILD/autoyast2-3.1.76/scripts'
[ 28s] Making install in src
[ 28s] make[1]: Entering directory
'/home/abuild/rpmbuild/BUILD/autoyast2-3.1.76/src'
[ 28s] make[2]: Entering directory
'/home/abuild/rpmbuild/BUILD/autoyast2-3.1.76/src'
[ 28s] make[2]: Nothing to be done for 'install-exec-am'.
[ 28s] /usr/bin/mkdir -p
'/home/abuild/rpmbuild/BUILDROOT/autoyast2-3.1.76-1.x86_64/usr/lib/YaST2/servers_non_y2'
[ 28s] /usr/bin/install -c -p servers_non_y2/ag_ksimport
'/home/abuild/rpmbuild/BUILDROOT/autoyast2-3.1.76-1.x86_64/usr/lib/YaST2/servers_non_y2'
[ 28s] /usr/bin/mkdir -p
'/home/abuild/rpmbuild/BUILDROOT/autoyast2-3.1.76-1.x86_64/usr/share/YaST2/clients'
[ 28s] /usr/bin/install -c -p -m 644 clients/classes_auto.rb
clients/ayast_setup.rb clients/scripts_auto.rb clients/software_auto.rb
clients/general_auto.rb clients/inst_autopost.rb clients/storage_auto.rb
clients/ayast_probe.rb clients/inst_autoconfigure.rb
clients/inst_autosetup_upgrade.rb clients/autoinst_scripts2_finish.rb
clients/inst_autosetup.rb clients/inst_autoinit.rb clients/report_auto.rb
clients/autoinst_scripts1_finish.rb clients/inst_autoimage.rb
clients/inst_store_upgrade_software.rb clients/files_auto.rb
clients/autoinst_test_clone.rb clients/autoyast.rb clients/clone_system.rb
clients/autoinst_test_stage.rb
'/home/abuild/rpmbuild/BUILDROOT/autoyast2-3.1.76-1.x86_64/usr/share/YaST2/clients'
[ 28s] /usr/bin/mkdir -p
'/home/abuild/rpmbuild/BUILDROOT/autoyast2-3.1.76-1.x86_64/usr/share/applications/YaST2'
[ 28s] /usr/bin/install -c -p -m 644 desktop/autoyast.desktop
'/home/abuild/rpmbuild/BUILDROOT/autoyast2-3.1.76-1.x86_64/usr/share/applications/YaST2'
[ 28s] /usr/bin/mkdir -p
'/home/abuild/rpmbuild/BUILDROOT/autoyast2-3.1.76-1.x86_64/var/adm/fillup-templates'
[ 28s] /usr/bin/install -c -p -m 644 fillup/sysconfig.autoinstall
'/home/abuild/rpmbuild/BUILDROOT/autoyast2-3.1.76-1.x86_64/var/adm/fillup-templates'
[ 28s] /usr/bin/mkdir -p
'/home/abuild/rpmbuild/BUILDROOT/autoyast2-3.1.76-1.x86_64/usr/share/YaST2/modules'
[ 28s] /usr/bin/install -c -p -m 644 modules/AutoinstStorage.rb
modules/AutoinstPartPlan.rb modules/AutoInstallRules.rb modules/Kickstart.rb
modules/Y2ModuleConfig.rb modules/ProfileLocation.rb
modules/AutoinstPartition.rb modules/AutoinstClone.rb modules/AutoinstImage.rb
modules/AutoinstRAID.rb modules/AutoinstConfig.rb modules/AutoinstLVM.rb
modules/Profile.rb modules/AutoinstCommon.rb modules/AutoinstFile.rb
modules/AutoinstScripts.rb modules/AutoInstall.rb modules/AutoinstGeneral.rb
modules/AutoinstSoftware.rb modules/AutoinstDrive.rb modules/AutoinstClass.rb
'/home/abuild/rpmbuild/BUILDROOT/autoyast2-3.1.76-1.x86_64/usr/share/YaST2/modules'
[ 28s] /usr/bin/mkdir -p
'/home/abuild/rpmbuild/BUILDROOT/autoyast2-3.1.76-1.x86_64/usr/share/YaST2/schema/autoyast/rnc'
[ 28s] /usr/bin/install -c -p -m 644 autoyast-rnc/scripts.rnc
autoyast-rnc/rules.rnc autoyast-rnc/common.rnc autoyast-rnc/pxe.rnc
autoyast-rnc/classes-use.rnc autoyast-rnc/classes-decl.rnc
autoyast-rnc/software.rnc autoyast-rnc/reporting.rnc
autoyast-rnc/partitioning.rnc autoyast-rnc/profile-misc.rnc
autoyast-rnc/general.rnc autoyast-rnc/files.rnc
'/home/abuild/rpmbuild/BUILDROOT/autoyast2-3.1.76-1.x86_64/usr/share/YaST2/schema/autoyast/rnc'
[ 28s] /usr/bin/mkdir -p
'/home/abuild/rpmbuild/BUILDROOT/autoyast2-3.1.76-1.x86_64/usr/share/YaST2/scrconf'
[ 28s] /usr/bin/install -c -p -m 644 scrconf/cfg_autoinstall.scr
scrconf/autoinstall.scr scrconf/ksimport.scr
'/home/abuild/rpmbuild/BUILDROOT/autoyast2-3.1.76-1.x86_64/usr/share/YaST2/scrconf'
[ 28s] /usr/bin/mkdir -p
'/home/abuild/rpmbuild/BUILDROOT/autoyast2-3.1.76-1.x86_64/usr/lib/YaST2/bin'
[ 28s] /usr/bin/install -c -p bin/autoyast-initscripts.sh bin/fetch_image.sh
'/home/abuild/rpmbuild/BUILDROOT/autoyast2-3.1.76-1.x86_64/usr/lib/YaST2/bin'
[ 28s] /usr/bin/mkdir -p
'/home/abuild/rpmbuild/BUILDROOT/autoyast2-3.1.76-1.x86_64/usr/share/YaST2/include/autoinstall'
[ 28s] /usr/bin/install -c -p -m 644 include/autoinstall/DriveDialog.rb
include/autoinstall/io.rb include/autoinstall/wizards.rb
include/autoinstall/autoinst_dialogs.rb include/autoinstall/classes.rb
include/autoinstall/types.rb include/autoinstall/PartitionDialog.rb
include/autoinstall/StorageDialog.rb include/autoinstall/tree.rb
include/autoinstall/common.rb include/autoinstall/autopart.rb
include/autoinstall/dialogs.rb include/autoinstall/AdvancedPartitionDialog.rb
include/autoinstall/ask.rb include/autoinstall/VolgroupDialog.rb
include/autoinstall/xml.rb include/autoinstall/script_dialogs.rb
include/autoinstall/conftree.rb include/autoinstall/helps.rb
include/autoinstall/general_dialogs.rb
'/home/abuild/rpmbuild/BUILDROOT/autoyast2-3.1.76-1.x86_64/usr/share/YaST2/include/autoinstall'
[ 28s] make[2]: Leaving directory
'/home/abuild/rpmbuild/BUILD/autoyast2-3.1.76/src'
[ 28s] make[1]: Leaving directory
'/home/abuild/rpmbuild/BUILD/autoyast2-3.1.76/src'
[ 28s] Making install in test
[ 28s] make[1]: Entering directory
'/home/abuild/rpmbuild/BUILD/autoyast2-3.1.76/test'
[ 28s] make[2]: Entering directory
'/home/abuild/rpmbuild/BUILD/autoyast2-3.1.76/test'
[ 28s] make[2]: Nothing to be done for 'install-exec-am'.
[ 28s] make[2]: Nothing to be done for 'install-data-am'.
[ 28s] make[2]: Leaving directory
'/home/abuild/rpmbuild/BUILD/autoyast2-3.1.76/test'
[ 28s] make[1]: Leaving directory
'/home/abuild/rpmbuild/BUILD/autoyast2-3.1.76/test'
[ 28s] Making install in xslt
[ 28s] make[1]: Entering directory
'/home/abuild/rpmbuild/BUILD/autoyast2-3.1.76/xslt'
[ 28s] make[2]: Entering directory
'/home/abuild/rpmbuild/BUILD/autoyast2-3.1.76/xslt'
[ 28s] make[3]: Entering directory
'/home/abuild/rpmbuild/BUILD/autoyast2-3.1.76/xslt'
[ 28s] make[3]: Nothing to be done for 'install-exec-am'.
[ 28s] /usr/bin/mkdir -p
'/home/abuild/rpmbuild/BUILDROOT/autoyast2-3.1.76-1.x86_64/usr/share/autoinstall/xslt'
[ 28s] /usr/bin/install -c -p -m 644 merge.xslt
'/home/abuild/rpmbuild/BUILDROOT/autoyast2-3.1.76-1.x86_64/usr/share/autoinstall/xslt'
[ 28s] make[3]: Leaving directory
'/home/abuild/rpmbuild/BUILD/autoyast2-3.1.76/xslt'
[ 28s] make[2]: Leaving directory
'/home/abuild/rpmbuild/BUILD/autoyast2-3.1.76/xslt'
[ 28s] make[1]: Leaving directory
'/home/abuild/rpmbuild/BUILD/autoyast2-3.1.76/xslt'
[ 28s] make[1]: Entering directory
'/home/abuild/rpmbuild/BUILD/autoyast2-3.1.76'
[ 28s] make[2]: Entering directory
'/home/abuild/rpmbuild/BUILD/autoyast2-3.1.76'
[ 28s] make[2]: Nothing to be done for 'install-exec-am'.
[ 28s] /usr/bin/mkdir -p
'/home/abuild/rpmbuild/BUILDROOT/autoyast2-3.1.76-1.x86_64/usr/share/doc/packages/autoyast2'
[ 28s] /usr/bin/install -c -p -m 644 COPYING
'/home/abuild/rpmbuild/BUILDROOT/autoyast2-3.1.76-1.x86_64/usr/share/doc/packages/autoyast2'
[ 29s] make[2]: Leaving directory
'/home/abuild/rpmbuild/BUILD/autoyast2-3.1.76'
[ 29s] make[1]: Leaving directory
'/home/abuild/rpmbuild/BUILD/autoyast2-3.1.76'
[ 29s] + '[' '!' -f /usr/share/YaST2/data/devtools/NO_MAKE_CHECK ']'
[ 29s] + make check VERBOSE=1
Y2DIR=/home/abuild/rpmbuild/BUILDROOT/autoyast2-3.1.76-1.x86_64//usr/share/YaST2
DESTDIR=/home/abuild/rpmbuild/BUILDROOT/autoyast2-3.1.76-1.x86_64
[ 29s] Making check in control
[ 29s] make[1]: Entering directory
'/home/abuild/rpmbuild/BUILD/autoyast2-3.1.76/control'
[ 29s] make check-local
[ 29s] make[2]: Entering directory
'/home/abuild/rpmbuild/BUILD/autoyast2-3.1.76/control'
[ 29s] xmllint --relaxng /usr/share/YaST2/control/control.rng --noout
control_continue_autoyast.xml
[ 29s] control_continue_autoyast.xml validates
[ 29s] make[2]: Leaving directory
'/home/abuild/rpmbuild/BUILD/autoyast2-3.1.76/control'
[ 29s] make[1]: Leaving directory
'/home/abuild/rpmbuild/BUILD/autoyast2-3.1.76/control'
[ 29s] Making check in doc
[ 29s] make[1]: Entering directory
'/home/abuild/rpmbuild/BUILD/autoyast2-3.1.76/doc'
[ 29s] Making check in autodocs
[ 29s] make[2]: Entering directory
'/home/abuild/rpmbuild/BUILD/autoyast2-3.1.76/doc/autodocs'
[ 29s] make[2]: Nothing to be done for 'check'.
[ 29s] make[2]: Leaving directory
'/home/abuild/rpmbuild/BUILD/autoyast2-3.1.76/doc/autodocs'
[ 29s] make[2]: Entering directory
'/home/abuild/rpmbuild/BUILD/autoyast2-3.1.76/doc'
[ 29s] make[2]: Nothing to be done for 'check-am'.
[ 29s] make[2]: Leaving directory
'/home/abuild/rpmbuild/BUILD/autoyast2-3.1.76/doc'
[ 29s] make[1]: Leaving directory
'/home/abuild/rpmbuild/BUILD/autoyast2-3.1.76/doc'
[ 29s] Making check in modconfig
[ 29s] make[1]: Entering directory
'/home/abuild/rpmbuild/BUILD/autoyast2-3.1.76/modconfig'
[ 29s] make[1]: Nothing to be done for 'check'.
[ 29s] make[1]: Leaving directory
'/home/abuild/rpmbuild/BUILD/autoyast2-3.1.76/modconfig'
[ 29s] Making check in scripts
[ 29s] make[1]: Entering directory
'/home/abuild/rpmbuild/BUILD/autoyast2-3.1.76/scripts'
[ 29s] make[1]: Nothing to be done for 'check'.
[ 29s] make[1]: Leaving directory
'/home/abuild/rpmbuild/BUILD/autoyast2-3.1.76/scripts'
[ 29s] Making check in src
[ 29s] make[1]: Entering directory
'/home/abuild/rpmbuild/BUILD/autoyast2-3.1.76/src'
[ 29s] make[1]: Nothing to be done for 'check'.
[ 29s] make[1]: Leaving directory
'/home/abuild/rpmbuild/BUILD/autoyast2-3.1.76/src'
[ 29s] Making check in test
[ 29s] make[1]: Entering directory
'/home/abuild/rpmbuild/BUILD/autoyast2-3.1.76/test'
[ 29s] make check-TESTS
[ 29s] make[2]: Entering directory
'/home/abuild/rpmbuild/BUILD/autoyast2-3.1.76/test'
[ 29s] make[3]: Entering directory
'/home/abuild/rpmbuild/BUILD/autoyast2-3.1.76/test'
[ 30s] PASS: AutoInstallRules_test.rb
[ 30s] FAIL: AutoinstClass_test.rb
[ 31s] PASS: Y2ModuleConfig_test.rb
[ 31s] make[4]: Entering directory
'/home/abuild/rpmbuild/BUILD/autoyast2-3.1.76/test'
[ 31s] make[4]: Nothing to be done for 'all'.
[ 31s] make[4]: Leaving directory
'/home/abuild/rpmbuild/BUILD/autoyast2-3.1.76/test'
[ 31s] ===========================================
[ 31s] autoyast2 3.1.76: test/test-suite.log
[ 31s] ===========================================
[ 31s]
[ 31s] # TOTAL: 3
[ 31s] # PASS: 2
[ 31s] # SKIP: 0
[ 31s] # XFAIL: 0
[ 31s] # FAIL: 1
[ 31s] # XPASS: 0
[ 31s] # ERROR: 0
[ 31s]
[ 31s] .. contents:: :depth: 2
[ 31s]
[ 31s] FAIL: AutoinstClass_test
[ 31s] ========================
[ 31s]
[ 31s] .................FFF........
[ 31s]
[ 31s] Failures:
[ 31s]
[ 31s] 1) #<Yast::AutoinstClassClass:0x00000002bd49b0> #MergeClasses
executes xsltproc and returns a hash with info about the result
[ 31s] Failure/Error: expect(out).to eq({ 'exit' => 0, 'stderr' => '',
'stdout' => '' })
[ 31s]
[ 31s] expected: {"exit"=>0, "stderr"=>"", "stdout"=>""}
[ 31s] got: {"exit"=>127, "stderr"=>"sh: /usr/bin/xsltproc: No
such file or directory\n", "stdout"=>""}
[ 31s]
[ 31s] (compared using ==)
[ 31s]
[ 31s] Diff:
[ 31s] @@ -1,4 +1,4 @@
[ 31s] -"exit" => 0,
[ 31s] -"stderr" => "",
[ 31s] +"exit" => 127,
[ 31s] +"stderr" => "sh: /usr/bin/xsltproc: No such file or
directory\n",
[ 31s] "stdout" => ""
[ 31s] # ./AutoinstClass_test.rb:252:in `block (3 levels) in <top
(required)>'
[ 31s] # ./AutoinstClass_test.rb:238:in `block (3 levels) in <top
(required)>'
[ 31s]
[ 31s] 2) #<Yast::AutoinstClassClass:0x00000002bd49b0> #MergeClasses when
all elements must be merged merges elements from profile and configuration
[ 31s] Failure/Error: let(:output_xml) { File.read(output_path) }
[ 31s] Errno::ENOENT:
[ 31s] No such file or directory @ rb_sysopen -
/home/abuild/rpmbuild/BUILD/autoyast2-3.1.76/tmp/output.xml
[ 31s] # ./AutoinstClass_test.rb:220:in `read'
[ 31s] # ./AutoinstClass_test.rb:220:in `block (3 levels) in <top
(required)>'
[ 31s] # ./AutoinstClass_test.rb:262:in `block (4 levels) in <top
(required)>'
[ 31s] # ./AutoinstClass_test.rb:238:in `block (3 levels) in <top
(required)>'
[ 31s]
[ 31s] 3) #<Yast::AutoinstClassClass:0x00000002bd49b0> #MergeClasses when
some elements are not intended to be merged does not merge those elements
[ 31s] Failure/Error: let(:output_xml) { File.read(output_path) }
[ 31s] Errno::ENOENT:
[ 31s] No such file or directory @ rb_sysopen -
/home/abuild/rpmbuild/BUILD/autoyast2-3.1.76/tmp/output.xml
[ 31s] # ./AutoinstClass_test.rb:220:in `read'
[ 31s] # ./AutoinstClass_test.rb:220:in `block (3 levels) in <top
(required)>'
[ 31s] # ./AutoinstClass_test.rb:281:in `block (4 levels) in <top
(required)>'
[ 31s] # ./AutoinstClass_test.rb:238:in `block (3 levels) in <top
(required)>'
[ 31s]
[ 31s] Finished in 0.05588 seconds
[ 31s] 28 examples, 3 failures
[ 31s]
[ 31s] Failed examples:
[ 31s]
[ 31s] rspec ./AutoinstClass_test.rb:248 #
#<Yast::AutoinstClassClass:0x00000002bd49b0> #MergeClasses executes xsltproc
and returns a hash with info about the result
[ 31s] rspec ./AutoinstClass_test.rb:258 #
#<Yast::AutoinstClassClass:0x00000002bd49b0> #MergeClasses when all elements
must be merged merges elements from profile and configuration
[ 31s] rspec ./AutoinstClass_test.rb:277 #
#<Yast::AutoinstClassClass:0x00000002bd49b0> #MergeClasses when some elements
are not intended to be merged does not merge those elements
[ 31s]
[ 31s]
============================================================================
[ 31s] Testsuite summary for autoyast2 3.1.76
[ 31s]
============================================================================
[ 31s] # TOTAL: 3
[ 31s] # PASS: 2
[ 31s] # SKIP: 0
[ 31s] # XFAIL: 0
[ 31s] # FAIL: 1
[ 31s] # XPASS: 0
[ 31s] # ERROR: 0
[ 31s]
============================================================================
[ 31s] See test/test-suite.log
[ 31s] Please report to http://bugs.opensuse.org/
[ 31s]
============================================================================
[ 31s] Makefile:494: recipe for target 'test-suite.log' failed
[ 31s] make[3]: *** [test-suite.log] Error 1
[ 31s] make[3]: Leaving directory
'/home/abuild/rpmbuild/BUILD/autoyast2-3.1.76/test'
[ 31s] Makefile:600: recipe for target 'check-TESTS' failed
[ 31s] make[2]: *** [check-TESTS] Error 2
[ 31s] make[2]: Leaving directory
'/home/abuild/rpmbuild/BUILD/autoyast2-3.1.76/test'
[ 31s] Makefile:659: recipe for target 'check-am' failed
[ 31s] make[1]: *** [check-am] Error 2
[ 31s] make[1]: Leaving directory
'/home/abuild/rpmbuild/BUILD/autoyast2-3.1.76/test'
[ 31s] Makefile:486: recipe for target 'check-recursive' failed
[ 31s] make: *** [check-recursive] Error 1
[ 31s] error: Bad exit status from /var/tmp/rpm-tmp.EhICJD (%install)
[ 31s]
[ 31s]
[ 31s] RPM build errors:
[ 31s] Bad exit status from /var/tmp/rpm-tmp.EhICJD (%install)
Building autoyast2.spec for SLE-12-SP1/x86_64
Getting buildinfo from server and store to
<http://river.suse.de/job/yast-autoinstallation-master/ws/Devel>:YaST:Head/autoyast2/.osc/_buildinfo-SLE-12-SP1-x86_64.xml
Getting buildconfig from server and store to
<http://river.suse.de/job/yast-autoinstallation-master/ws/Devel>:YaST:Head/autoyast2/.osc/_buildconfig-SLE-12-SP1-x86_64
Updating cache of required packages
0.0% cache miss. 212/212 dependencies cached.

Skipping verification of package signatures
Writing build configuration
Running build

The buildroot was: /var/tmp/build-root-SLE-12-SP1
rm -rf Devel:YaST:Head
rake aborted!
Command failed with status (1): [yes | osc build --no-verify --release=1 --...]

Tasks: TOP => osc:sr => osc:commit => osc:build
(See full trace by running task with --trace)
cleaning
Build step 'Execute shell' marked build as failure

< Previous Next >
This Thread
Follow Ups
References