Mailinglist Archive: yast-commit (306 mails)

< Previous Next >
[yast-commit] Build failed in Jenkins: yast-ntp-client-HEAD #154
  • From: hudson@xxxxxxx
  • Date: Thu, 15 Aug 2013 09:37:16 +0200 (CEST)
  • Message-id: <979361884.609.1376552236410.JavaMail.jenkins@river>
See <http://river.suse.de/job/yast-ntp-client-HEAD/154/changes>

Changes:

[lslezak] convert data file from YCP to YAML format

[lslezak] replaced "state: ! 'XY '" => "state: XY"

[lslezak] ntp_servers.yml - add extra new lines to make it better human readable

------------------------------------------
[...truncated 156 lines...]
config.status: creating testsuite/Makefile
+ make
Making all in agents
make[1]: Entering directory
`<http://river.suse.de/job/yast-ntp-client-HEAD/ws/checkout/agents'>
make[1]: Nothing to be done for `all'.
make[1]: Leaving directory
`<http://river.suse.de/job/yast-ntp-client-HEAD/ws/checkout/agents'>
Making all in data
make[1]: Entering directory
`<http://river.suse.de/job/yast-ntp-client-HEAD/ws/checkout/data'>
make[1]: Nothing to be done for `all'.
make[1]: Leaving directory
`<http://river.suse.de/job/yast-ntp-client-HEAD/ws/checkout/data'>
Making all in doc
make[1]: Entering directory
`<http://river.suse.de/job/yast-ntp-client-HEAD/ws/checkout/doc'>
Making all in autodocs
make[2]: Entering directory
`<http://river.suse.de/job/yast-ntp-client-HEAD/ws/checkout/doc/autodocs'>
if [ -n "" ]; then /usr/lib/YaST2/bin/ycpdoc -d. -s./../../src ; fi
for i in ; do \
b=${i##./../../src}; b=${b#/}; b=${b//\//__}; b=${b%.pm}; \
pod2html --title=$b --infile=$i --outfile=$b.html; \
echo "<a href='$b.html'>${b/__/::}</a>" > $b.mod.html; \
done
if [ -n "./../../src/modules/NtpClient.rb
./../../src/include/ntp-client/dialogs.rb
./../../src/include/ntp-client/commandline.rb
./../../src/include/ntp-client/helps.rb
./../../src/include/ntp-client/widgets.rb
./../../src/include/ntp-client/clocktypes.rb
./../../src/include/ntp-client/misc.rb
./../../src/include/ntp-client/wizards.rb" ]; then yard doc --title
"yast2-ntp-client -- Development Documentation" -o . -m markdown
./../../src/modules/NtpClient.rb ./../../src/include/ntp-client/dialogs.rb
./../../src/include/ntp-client/commandline.rb
./../../src/include/ntp-client/helps.rb
./../../src/include/ntp-client/widgets.rb
./../../src/include/ntp-client/clocktypes.rb
./../../src/include/ntp-client/misc.rb
./../../src/include/ntp-client/wizards.rb; fi
Files: 8
Modules: 8 ( 7 undocumented)
Classes: 1 ( 1 undocumented)
Constants: 1 ( 1 undocumented)
Methods: 145 ( 24 undocumented)
78.71% documented
make[2]: Leaving directory
`<http://river.suse.de/job/yast-ntp-client-HEAD/ws/checkout/doc/autodocs'>
make[2]: Entering directory
`<http://river.suse.de/job/yast-ntp-client-HEAD/ws/checkout/doc'>
make[2]: Nothing to be done for `all-am'.
make[2]: Leaving directory
`<http://river.suse.de/job/yast-ntp-client-HEAD/ws/checkout/doc'>
make[1]: Leaving directory
`<http://river.suse.de/job/yast-ntp-client-HEAD/ws/checkout/doc'>
Making all in src
make[1]: Entering directory
`<http://river.suse.de/job/yast-ntp-client-HEAD/ws/checkout/src'>
make[1]: Nothing to be done for `all'.
make[1]: Leaving directory
`<http://river.suse.de/job/yast-ntp-client-HEAD/ws/checkout/src'>
Making all in testsuite
make[1]: Entering directory
`<http://river.suse.de/job/yast-ntp-client-HEAD/ws/checkout/testsuite'>
make -f /usr/share/YaST2/data/testsuite/Makefile.testsuite
RPMNAME=yast2-ntp-client srcdir=.
make[2]: Entering directory
`<http://river.suse.de/job/yast-ntp-client-HEAD/ws/checkout/testsuite'>
mkdir -p ./run ./config ./yast2-ntp-client.test ./tests
cp -f /usr/share/YaST2/data/testsuite/skel/default.exp config/default.exp
cp -f /usr/share/YaST2/data/testsuite/skel/unix.exp config/unix.exp
cp -f /usr/share/YaST2/data/testsuite/skel/unknown.exp config/unknown.exp
cp -f /usr/share/YaST2/data/testsuite/skel/testsuite.exp
yast2-ntp-client.test/testsuite.exp
cp -f /usr/share/YaST2/data/testsuite/skel/runtest.sh run/runtest.sh
chmod +x run/runtest.sh
make[2]: Leaving directory
`<http://river.suse.de/job/yast-ntp-client-HEAD/ws/checkout/testsuite'>
make[1]: Leaving directory
`<http://river.suse.de/job/yast-ntp-client-HEAD/ws/checkout/testsuite'>
make[1]: Entering directory
`<http://river.suse.de/job/yast-ntp-client-HEAD/ws/checkout'>
make[1]: Nothing to be done for `all-am'.
make[1]: Leaving directory
`<http://river.suse.de/job/yast-ntp-client-HEAD/ws/checkout'>
+ make install
Making install in agents
make[1]: Entering directory
`<http://river.suse.de/job/yast-ntp-client-HEAD/ws/checkout/agents'>
make[2]: Entering directory
`<http://river.suse.de/job/yast-ntp-client-HEAD/ws/checkout/agents'>
make[2]: Nothing to be done for `install-exec-am'.
make[2]: Nothing to be done for `install-data-am'.
make[2]: Leaving directory
`<http://river.suse.de/job/yast-ntp-client-HEAD/ws/checkout/agents'>
make[1]: Leaving directory
`<http://river.suse.de/job/yast-ntp-client-HEAD/ws/checkout/agents'>
Making install in data
make[1]: Entering directory
`<http://river.suse.de/job/yast-ntp-client-HEAD/ws/checkout/data'>
make[2]: Entering directory
`<http://river.suse.de/job/yast-ntp-client-HEAD/ws/checkout/data'>
make[2]: Nothing to be done for `install-exec-am'.
make[2]: Nothing to be done for `install-data-am'.
make[2]: Leaving directory
`<http://river.suse.de/job/yast-ntp-client-HEAD/ws/checkout/data'>
make[1]: Leaving directory
`<http://river.suse.de/job/yast-ntp-client-HEAD/ws/checkout/data'>
Making install in doc
make[1]: Entering directory
`<http://river.suse.de/job/yast-ntp-client-HEAD/ws/checkout/doc'>
Making install in autodocs
make[2]: Entering directory
`<http://river.suse.de/job/yast-ntp-client-HEAD/ws/checkout/doc/autodocs'>
make[3]: Entering directory
`<http://river.suse.de/job/yast-ntp-client-HEAD/ws/checkout/doc/autodocs'>
make[3]: Nothing to be done for `install-exec-am'.
/usr/bin/mkdir -p '/usr/share/doc/packages/yast2-ntp-client//autodocs'
/usr/bin/mkdir -p '/usr/share/doc/packages/yast2-ntp-client//autodocs/js'
/usr/bin/install -c -p -m 644 js/full_list.js js/jquery.js js/app.js
'/usr/share/doc/packages/yast2-ntp-client//autodocs/js'
/usr/bin/install -c -p -m 644 index.html file_list.html class_list.html
Yast.html _index.html method_list.html top-level-namespace.html frames.html
'/usr/share/doc/packages/yast2-ntp-client//autodocs/.'
/usr/bin/mkdir -p '/usr/share/doc/packages/yast2-ntp-client//autodocs/Yast'
/usr/bin/install -c -p -m 644 Yast/NtpClientMiscInclude.html
Yast/NtpClientClass.html Yast/NtpClientWizardsInclude.html
Yast/NtpClientDialogsInclude.html Yast/NtpClientHelpsInclude.html
Yast/NtpClientWidgetsInclude.html Yast/NtpClientClocktypesInclude.html
Yast/NtpClientCommandlineInclude.html
'/usr/share/doc/packages/yast2-ntp-client//autodocs/Yast'
/usr/bin/mkdir -p '/usr/share/doc/packages/yast2-ntp-client//autodocs/css'
/usr/bin/install -c -p -m 644 css/full_list.css css/style.css css/common.css
'/usr/share/doc/packages/yast2-ntp-client//autodocs/css'
make[3]: Leaving directory
`<http://river.suse.de/job/yast-ntp-client-HEAD/ws/checkout/doc/autodocs'>
make[2]: Leaving directory
`<http://river.suse.de/job/yast-ntp-client-HEAD/ws/checkout/doc/autodocs'>
make[2]: Entering directory
`<http://river.suse.de/job/yast-ntp-client-HEAD/ws/checkout/doc'>
make[3]: Entering directory
`<http://river.suse.de/job/yast-ntp-client-HEAD/ws/checkout/doc'>
make[3]: Nothing to be done for `install-exec-am'.
/usr/bin/mkdir -p '/usr/share/doc/packages/yast2-ntp-client'
/usr/bin/install -c -p -m 644 TODO ntp.conf_agent.txt spec.txt
'/usr/share/doc/packages/yast2-ntp-client'
make[3]: Leaving directory
`<http://river.suse.de/job/yast-ntp-client-HEAD/ws/checkout/doc'>
make[2]: Leaving directory
`<http://river.suse.de/job/yast-ntp-client-HEAD/ws/checkout/doc'>
make[1]: Leaving directory
`<http://river.suse.de/job/yast-ntp-client-HEAD/ws/checkout/doc'>
Making install in src
make[1]: Entering directory
`<http://river.suse.de/job/yast-ntp-client-HEAD/ws/checkout/src'>
make[2]: Entering directory
`<http://river.suse.de/job/yast-ntp-client-HEAD/ws/checkout/src'>
make[2]: Nothing to be done for `install-exec-am'.
/usr/bin/mkdir -p '/usr/share/YaST2/clients'
/usr/bin/install -c -p -m 644 clients/ntp-client.rb clients/ntp-client_auto.rb
clients/ntp-client_finish.rb clients/ntp-client_proposal.rb
'/usr/share/YaST2/clients'
/usr/bin/mkdir -p '/usr/share/applications/YaST2'
/usr/bin/install -c -p -m 644 desktop/ntp-client.desktop
'/usr/share/applications/YaST2'
/usr/bin/mkdir -p '/usr/share/YaST2/modules'
/usr/bin/install -c -p -m 644 modules/NtpClient.rb '/usr/share/YaST2/modules'
/usr/bin/mkdir -p '/usr/share/YaST2/modules'
/usr/bin/install -c -p -m 644 modules/NtpClient.rb '/usr/share/YaST2/modules'
/usr/bin/mkdir -p '/usr/share/YaST2/schema/autoyast/rnc'
/usr/bin/install -c -p -m 644 autoyast-rnc/ntpclient.rnc
'/usr/share/YaST2/schema/autoyast/rnc'
/usr/bin/mkdir -p '/usr/share/YaST2/scrconf'
/usr/bin/install -c -p -m 644 scrconf/cfg_ntp.scr scrconf/etc_ntp.scr
'/usr/share/YaST2/scrconf'
/usr/bin/mkdir -p '/usr/share/YaST2/data'
/usr/bin/install -c -p -m 644 data/ntp_servers.yml '/usr/share/YaST2/data'
/usr/bin/mkdir -p '/usr/share/YaST2/include/ntp-client'
/usr/bin/install -c -p -m 644 include/ntp-client/widgets.rb
include/ntp-client/wizards.rb include/ntp-client/commandline.rb
include/ntp-client/misc.rb include/ntp-client/dialogs.rb
include/ntp-client/helps.rb include/ntp-client/clocktypes.rb
'/usr/share/YaST2/include/ntp-client'
make[2]: Leaving directory
`<http://river.suse.de/job/yast-ntp-client-HEAD/ws/checkout/src'>
make[1]: Leaving directory
`<http://river.suse.de/job/yast-ntp-client-HEAD/ws/checkout/src'>
Making install in testsuite
make[1]: Entering directory
`<http://river.suse.de/job/yast-ntp-client-HEAD/ws/checkout/testsuite'>
make -f /usr/share/YaST2/data/testsuite/Makefile.testsuite
RPMNAME=yast2-ntp-client srcdir=.
make[2]: Entering directory
`<http://river.suse.de/job/yast-ntp-client-HEAD/ws/checkout/testsuite'>
make[2]: Nothing to be done for `all'.
make[2]: Leaving directory
`<http://river.suse.de/job/yast-ntp-client-HEAD/ws/checkout/testsuite'>
make[2]: Entering directory
`<http://river.suse.de/job/yast-ntp-client-HEAD/ws/checkout/testsuite'>
make[2]: Nothing to be done for `install-exec-am'.
make[2]: Nothing to be done for `install-data-am'.
make[2]: Leaving directory
`<http://river.suse.de/job/yast-ntp-client-HEAD/ws/checkout/testsuite'>
make[1]: Leaving directory
`<http://river.suse.de/job/yast-ntp-client-HEAD/ws/checkout/testsuite'>
make[1]: Entering directory
`<http://river.suse.de/job/yast-ntp-client-HEAD/ws/checkout'>
make[2]: Entering directory
`<http://river.suse.de/job/yast-ntp-client-HEAD/ws/checkout'>
make[2]: Nothing to be done for `install-exec-am'.
mkdir -p /usr/share/doc/packages/yast2-ntp-client
/usr/bin/install -c -p -m 644
/usr/share/YaST2/data/devtools/admin/copyright/gpl/README
/usr/share/doc/packages/yast2-ntp-client
/usr/bin/install -c -p -m 644
/usr/share/YaST2/data/devtools/admin/copyright/gpl/COPYING
/usr/share/doc/packages/yast2-ntp-client
make[2]: Leaving directory
`<http://river.suse.de/job/yast-ntp-client-HEAD/ws/checkout'>
make[1]: Leaving directory
`<http://river.suse.de/job/yast-ntp-client-HEAD/ws/checkout'>
+ make check
Making check in agents
make[1]: Entering directory
`<http://river.suse.de/job/yast-ntp-client-HEAD/ws/checkout/agents'>
make[1]: Nothing to be done for `check'.
make[1]: Leaving directory
`<http://river.suse.de/job/yast-ntp-client-HEAD/ws/checkout/agents'>
Making check in data
make[1]: Entering directory
`<http://river.suse.de/job/yast-ntp-client-HEAD/ws/checkout/data'>
make[1]: Nothing to be done for `check'.
make[1]: Leaving directory
`<http://river.suse.de/job/yast-ntp-client-HEAD/ws/checkout/data'>
Making check in doc
make[1]: Entering directory
`<http://river.suse.de/job/yast-ntp-client-HEAD/ws/checkout/doc'>
Making check in autodocs
make[2]: Entering directory
`<http://river.suse.de/job/yast-ntp-client-HEAD/ws/checkout/doc/autodocs'>
make[2]: Nothing to be done for `check'.
make[2]: Leaving directory
`<http://river.suse.de/job/yast-ntp-client-HEAD/ws/checkout/doc/autodocs'>
make[2]: Entering directory
`<http://river.suse.de/job/yast-ntp-client-HEAD/ws/checkout/doc'>
make[2]: Nothing to be done for `check-am'.
make[2]: Leaving directory
`<http://river.suse.de/job/yast-ntp-client-HEAD/ws/checkout/doc'>
make[1]: Leaving directory
`<http://river.suse.de/job/yast-ntp-client-HEAD/ws/checkout/doc'>
Making check in src
make[1]: Entering directory
`<http://river.suse.de/job/yast-ntp-client-HEAD/ws/checkout/src'>
make[1]: Nothing to be done for `check'.
make[1]: Leaving directory
`<http://river.suse.de/job/yast-ntp-client-HEAD/ws/checkout/src'>
Making check in testsuite
make[1]: Entering directory
`<http://river.suse.de/job/yast-ntp-client-HEAD/ws/checkout/testsuite'>
make -f /usr/share/YaST2/data/testsuite/Makefile.testsuite
RPMNAME=yast2-ntp-client srcdir=.
make[2]: Entering directory
`<http://river.suse.de/job/yast-ntp-client-HEAD/ws/checkout/testsuite'>
make[2]: Nothing to be done for `all'.
make[2]: Leaving directory
`<http://river.suse.de/job/yast-ntp-client-HEAD/ws/checkout/testsuite'>
make check-DEJAGNU check-local
make[2]: Entering directory
`<http://river.suse.de/job/yast-ntp-client-HEAD/ws/checkout/testsuite'>
Making a new site.exp file ...
srcdir='.'; export srcdir; \
EXPECT=expect; export EXPECT; \
runtest=runtest; \
if /bin/sh -c "$runtest --version" > /dev/null 2>&1; then \
exit_status=0; l='yast2-ntp-client'; for tool in $l; do \
if $runtest --tool $tool --srcdir $srcdir ; \
then :; else exit_status=1; fi; \
done; \
else echo "WARNING: could not find 'runtest'" 1>&2; :;\
fi; \
exit $exit_status
WARNING: Couldn't find tool init file
Test Run By root on Thu Aug 15 09:37:12 2013
Native configuration is x86_64-suse-linux-gnu

=== yast2-ntp-client tests ===

Schedule of variations:
unix

Running target unix
Using /usr/share/dejagnu/baseboards/unix.exp as board description file for
target.
Using /usr/share/dejagnu/config/unix.exp as generic interface file for target.
Using ./config/unix.exp as tool-and-target-specific interface file.
Running ./yast2-ntp-client.test/testsuite.exp ...

Checking started

Running Read ...
FAIL: Wrong stdout for Read

The diff follows...

--- tests/Read.out 2013-01-22 11:37:01.000000000 +0100
+++ tmp.out.Read 2013-08-15 09:37:14.000000000 +0200
@@ -1,6 +1,4 @@
Read .sysconfig.network.config.NETCONFIG_NTP_POLICY ""
-Read .target.ycp "/usr/share/YaST2/data/ntp_servers.ycp" nil
-Log Failed to read the list of NTP servers
Read .target.ycp "/usr/share/YaST2/data/country.ycp" nil
Read .target.yast2 "country.ycp" nil
Log Failed to read country names

FAIL: Wrong stdout for Read
See the diff above.
Running Write ...
Running selected_record ...

Checking finished


=== yast2-ntp-client Summary ===

# of expected passes 2
# of unexpected failures 2
make[2]: *** [check-DEJAGNU] Error 1
make[2]: Leaving directory
`<http://river.suse.de/job/yast-ntp-client-HEAD/ws/checkout/testsuite'>
make[1]: *** [check-am] Error 2
make[1]: Leaving directory
`<http://river.suse.de/job/yast-ntp-client-HEAD/ws/checkout/testsuite'>
make: *** [check-recursive] Error 1
++ error_exit 2
++ echo 'ERROR: detected exitcode 2'
ERROR: detected exitcode 2
++ cleanup
++ echo '==> Running cleanup'
==> Running cleanup
++ rm -f
<http://river.suse.de/job/yast-ntp-client-HEAD/ws/ICECC/40c0ab7e54f59a1e4e493c1ea90a882a.tar.gz>
++ footer_and_exit 1
++ '[' -z 1 ']'
++ MYEXIT=1
++ '[' 1 == 0 ']'
++ ascii_failed
++ cat

( )
( ) (
) _ )
( \_
_(_\ \)__
(____\___))

build failed

++ exit 1
Build step 'Execute shell' marked build as failure
--
To unsubscribe, e-mail: yast-commit+unsubscribe@xxxxxxxxxxxx
For additional commands, e-mail: yast-commit+help@xxxxxxxxxxxx

< Previous Next >
This Thread
Follow Ups