Mailinglist Archive: yast-commit (306 mails)

< Previous Next >
[yast-commit] Build failed in Jenkins: yast-network-HEAD #366
  • From: hudson@xxxxxxx
  • Date: Thu, 1 Aug 2013 13:52:50 +0200 (CEST)
  • Message-id: <124767444.278.1375357970921.JavaMail.jenkins@river>
See <http://river.suse.de/job/yast-network-HEAD/366/>

------------------------------------------
[...truncated 332 lines...]
/usr/bin/mkdir -p '/usr/share/YaST2/include/network/modem'
/usr/bin/install -c -p -m 644 include/network/modem/wizards.rb
include/network/modem/dialogs.rb include/network/modem/complex.rb
'/usr/share/YaST2/include/network/modem'
/usr/bin/mkdir -p '/usr/share/YaST2/include/network/installation'
/usr/bin/install -c -p -m 644 include/network/installation/dialogs.rb
'/usr/share/YaST2/include/network/installation'
make[2]: Leaving directory
`<http://river.suse.de/job/yast-network-HEAD/ws/checkout/src'>
make[1]: Leaving directory
`<http://river.suse.de/job/yast-network-HEAD/ws/checkout/src'>
Making install in testsuite
make[1]: Entering directory
`<http://river.suse.de/job/yast-network-HEAD/ws/checkout/testsuite'>
make -f /usr/share/YaST2/data/testsuite/Makefile.testsuite
RPMNAME=yast2-network srcdir=.
make[2]: Entering directory
`<http://river.suse.de/job/yast-network-HEAD/ws/checkout/testsuite'>
make[2]: Nothing to be done for `all'.
make[2]: Leaving directory
`<http://river.suse.de/job/yast-network-HEAD/ws/checkout/testsuite'>
make[2]: Entering directory
`<http://river.suse.de/job/yast-network-HEAD/ws/checkout/testsuite'>
make[2]: Nothing to be done for `install-exec-am'.
make[2]: Nothing to be done for `install-data-am'.
make[2]: Leaving directory
`<http://river.suse.de/job/yast-network-HEAD/ws/checkout/testsuite'>
make[1]: Leaving directory
`<http://river.suse.de/job/yast-network-HEAD/ws/checkout/testsuite'>
make[1]: Entering directory
`<http://river.suse.de/job/yast-network-HEAD/ws/checkout'>
make[2]: Entering directory
`<http://river.suse.de/job/yast-network-HEAD/ws/checkout'>
make[2]: Nothing to be done for `install-exec-am'.
mkdir -p /usr/share/doc/packages/yast2-network
/usr/bin/install -c -p -m 644
/usr/share/YaST2/data/devtools/admin/copyright/gpl/README
/usr/share/doc/packages/yast2-network
/usr/bin/install -c -p -m 644
/usr/share/YaST2/data/devtools/admin/copyright/gpl/COPYING
/usr/share/doc/packages/yast2-network
make[2]: Leaving directory
`<http://river.suse.de/job/yast-network-HEAD/ws/checkout'>
make[1]: Leaving directory
`<http://river.suse.de/job/yast-network-HEAD/ws/checkout'>
+ make check
Making check in agents
make[1]: Entering directory
`<http://river.suse.de/job/yast-network-HEAD/ws/checkout/agents'>
make[1]: Nothing to be done for `check'.
make[1]: Leaving directory
`<http://river.suse.de/job/yast-network-HEAD/ws/checkout/agents'>
Making check in data
make[1]: Entering directory
`<http://river.suse.de/job/yast-network-HEAD/ws/checkout/data'>
make[1]: Nothing to be done for `check'.
make[1]: Leaving directory
`<http://river.suse.de/job/yast-network-HEAD/ws/checkout/data'>
Making check in doc
make[1]: Entering directory
`<http://river.suse.de/job/yast-network-HEAD/ws/checkout/doc'>
Making check in autodocs
make[2]: Entering directory
`<http://river.suse.de/job/yast-network-HEAD/ws/checkout/doc/autodocs'>
make[2]: Nothing to be done for `check'.
make[2]: Leaving directory
`<http://river.suse.de/job/yast-network-HEAD/ws/checkout/doc/autodocs'>
make[2]: Entering directory
`<http://river.suse.de/job/yast-network-HEAD/ws/checkout/doc'>
make[2]: Nothing to be done for `check-am'.
make[2]: Leaving directory
`<http://river.suse.de/job/yast-network-HEAD/ws/checkout/doc'>
make[1]: Leaving directory
`<http://river.suse.de/job/yast-network-HEAD/ws/checkout/doc'>
Making check in src
make[1]: Entering directory
`<http://river.suse.de/job/yast-network-HEAD/ws/checkout/src'>
make[1]: Nothing to be done for `check'.
make[1]: Leaving directory
`<http://river.suse.de/job/yast-network-HEAD/ws/checkout/src'>
Making check in testsuite
make[1]: Entering directory
`<http://river.suse.de/job/yast-network-HEAD/ws/checkout/testsuite'>
make -f /usr/share/YaST2/data/testsuite/Makefile.testsuite
RPMNAME=yast2-network srcdir=.
make[2]: Entering directory
`<http://river.suse.de/job/yast-network-HEAD/ws/checkout/testsuite'>
make[2]: Nothing to be done for `all'.
make[2]: Leaving directory
`<http://river.suse.de/job/yast-network-HEAD/ws/checkout/testsuite'>
make check-DEJAGNU check-local
make[2]: Entering directory
`<http://river.suse.de/job/yast-network-HEAD/ws/checkout/testsuite'>
Making a new site.exp file ...
srcdir='.'; export srcdir; \
EXPECT=expect; export EXPECT; \
runtest=runtest; \
if /bin/sh -c "$runtest --version" > /dev/null 2>&1; then \
exit_status=0; l='yast2-network'; for tool in $l; do \
if $runtest --tool $tool --srcdir $srcdir ; \
then :; else exit_status=1; fi; \
done; \
else echo "WARNING: could not find 'runtest'" 1>&2; :;\
fi; \
exit $exit_status
WARNING: Couldn't find tool init file
Test Run By root on Thu Aug 1 13:52:33 2013
Native configuration is x86_64-suse-linux-gnu

=== yast2-network tests ===

Schedule of variations:
unix

Running target unix
Using /usr/share/dejagnu/baseboards/unix.exp as board description file for
target.
Using /usr/share/dejagnu/config/unix.exp as generic interface file for target.
Using ./config/unix.exp as tool-and-target-specific interface file.
Running ./yast2-network.test/testsuite.exp ...

Checking started

Running Host ...
Running InternetDevices ...
Running Lan ...
Running NetworkStorage ...
FAIL: Wrong stderr for NetworkStorage

The diff follows...

--- tests/NetworkStorage.err 2013-01-22 11:31:22.000000000 +0100
+++ tmp.err.NetworkStorage 2013-08-01 13:52:35.000000000 +0200
@@ -0,0 +1,6 @@
+2013-08-01 13:52:35 <3> app42(25736) [Y2Ruby] binary/YRuby.cc(loadModule):148
Module /usr/share/YaST2/modules/Storage load failed:cannot load such file --
dbus at /usr/lib64/ruby/1.9.1/rubygems/custom_require.rb:36:in `require'
+2013-08-01 13:52:35 <3> app42(25736) [Interpreter] modules/Testsuite.rb:42
Ruby::loadModule() / Can't load ruby module '/usr/share/YaST2/modules/Storage'
+2013-08-01 13:52:35 <5> app42(25736) [Y2Ruby]
binary/YRubyNamespace.cc(YRubyNamespace):192 The Ruby module 'Storage' is not
provided by its rb file
+2013-08-01 13:52:35 <3> app42(25736) [Interpreter] modules/Testsuite.rb:42 No
table associated to module 'Storage'
+2013-08-01 13:52:35 <3> app42(25736) [Y2Ruby] binary/YRuby.cc(loadModule):148
Module /usr/share/YaST2/modules/NetworkStorage load failed:component cannot
import namespace 'Storage' at
/usr/lib64/ruby/vendor_ruby/1.9.1/yast/yast.rb:146:in `import_pure'
+2013-08-01 13:52:35 <3> app42(25736) [Interpreter] modules/Testsuite.rb:42
Ruby::loadModule() / Can't load ruby module
'/usr/share/YaST2/modules/NetworkStorage'

FAIL: Wrong stderr for NetworkStorage
See the diff above.
Running Network_YaPI ...
FAIL: Wrong stderr for Network_YaPI

The diff follows...

--- tests/Network_YaPI.err 2013-01-22 11:31:22.000000000 +0100
+++ tmp.err.Network_YaPI 2013-08-01 13:52:38.000000000 +0200
@@ -0,0 +1,8 @@
+2013-08-01 13:52:38 <3> app42(25758) [Y2Ruby] binary/YRuby.cc(loadModule):148
Module /usr/share/YaST2/modules/Storage load failed:cannot load such file --
dbus at /usr/lib64/ruby/1.9.1/rubygems/custom_require.rb:36:in `require'
+2013-08-01 13:52:38 <3> app42(25758) [Interpreter] yast/i18n.rb:83
Ruby::loadModule() / Can't load ruby module '/usr/share/YaST2/modules/Storage'
+2013-08-01 13:52:38 <5> app42(25758) [Y2Ruby]
binary/YRubyNamespace.cc(YRubyNamespace):192 The Ruby module 'Storage' is not
provided by its rb file
+2013-08-01 13:52:38 <3> app42(25758) [Interpreter] yast/i18n.rb:83 No table
associated to module 'Storage'
+2013-08-01 13:52:38 <3> app42(25758) [Y2Ruby] binary/YRuby.cc(loadModule):148
Module /usr/share/YaST2/modules/NetworkStorage load failed:component cannot
import namespace 'Storage' at
/usr/lib64/ruby/vendor_ruby/1.9.1/yast/yast.rb:146:in `import_pure'
+2013-08-01 13:52:38 <3> app42(25758) [Interpreter] yast/i18n.rb:83
Ruby::loadModule() / Can't load ruby module
'/usr/share/YaST2/modules/NetworkStorage'
+2013-08-01 13:52:38 <3> app42(25758) [Y2Ruby] binary/YRuby.cc(loadModule):148
Module /usr/share/YaST2/modules/LanItems load failed:component cannot import
namespace 'Storage' at /usr/lib64/ruby/vendor_ruby/1.9.1/yast/yast.rb:146:in
`import_pure'
+2013-08-01 13:52:38 <3> app42(25758) [Interpreter] yast/i18n.rb:83
Ruby::loadModule() / Can't load ruby module '/usr/share/YaST2/modules/LanItems'

FAIL: Wrong stderr for Network_YaPI
See the diff above.
Running Provider ...
Running Routing ...
Running YaPI_bond ...
Running bond ...
FAIL: Wrong stderr for bond

The diff follows...

--- tests/bond.err 2013-01-22 11:31:22.000000000 +0100
+++ tmp.err.bond 2013-08-01 13:52:42.000000000 +0200
@@ -0,0 +1,8 @@
+2013-08-01 13:52:41 <3> app42(25845) [Y2Ruby] binary/YRuby.cc(loadModule):148
Module /usr/share/YaST2/modules/Storage load failed:cannot load such file --
dbus at /usr/lib64/ruby/1.9.1/rubygems/custom_require.rb:36:in `require'
+2013-08-01 13:52:41 <3> app42(25845) [Interpreter] yast/i18n.rb:83
Ruby::loadModule() / Can't load ruby module '/usr/share/YaST2/modules/Storage'
+2013-08-01 13:52:41 <5> app42(25845) [Y2Ruby]
binary/YRubyNamespace.cc(YRubyNamespace):192 The Ruby module 'Storage' is not
provided by its rb file
+2013-08-01 13:52:41 <3> app42(25845) [Interpreter] yast/i18n.rb:83 No table
associated to module 'Storage'
+2013-08-01 13:52:41 <3> app42(25845) [Y2Ruby] binary/YRuby.cc(loadModule):148
Module /usr/share/YaST2/modules/NetworkStorage load failed:component cannot
import namespace 'Storage' at
/usr/lib64/ruby/vendor_ruby/1.9.1/yast/yast.rb:146:in `import_pure'
+2013-08-01 13:52:41 <3> app42(25845) [Interpreter] yast/i18n.rb:83
Ruby::loadModule() / Can't load ruby module
'/usr/share/YaST2/modules/NetworkStorage'
+2013-08-01 13:52:41 <3> app42(25845) [Y2Ruby] binary/YRuby.cc(loadModule):148
Module /usr/share/YaST2/modules/LanItems load failed:component cannot import
namespace 'Storage' at /usr/lib64/ruby/vendor_ruby/1.9.1/yast/yast.rb:146:in
`import_pure'
+2013-08-01 13:52:41 <3> app42(25845) [Interpreter] yast/i18n.rb:83
Ruby::loadModule() / Can't load ruby module '/usr/share/YaST2/modules/LanItems'

FAIL: Wrong stderr for bond
See the diff above.
Running bridge ...
FAIL: Wrong stderr for bridge

The diff follows...

--- tests/bridge.err 2013-04-17 13:23:13.000000000 +0200
+++ tmp.err.bridge 2013-08-01 13:52:43.000000000 +0200
@@ -0,0 +1,8 @@
+2013-08-01 13:52:42 <3> app42(25867) [Y2Ruby] binary/YRuby.cc(loadModule):148
Module /usr/share/YaST2/modules/Storage load failed:cannot load such file --
dbus at /usr/lib64/ruby/1.9.1/rubygems/custom_require.rb:36:in `require'
+2013-08-01 13:52:42 <3> app42(25867) [Interpreter] yast/i18n.rb:83
Ruby::loadModule() / Can't load ruby module '/usr/share/YaST2/modules/Storage'
+2013-08-01 13:52:42 <5> app42(25867) [Y2Ruby]
binary/YRubyNamespace.cc(YRubyNamespace):192 The Ruby module 'Storage' is not
provided by its rb file
+2013-08-01 13:52:42 <3> app42(25867) [Interpreter] yast/i18n.rb:83 No table
associated to module 'Storage'
+2013-08-01 13:52:42 <3> app42(25867) [Y2Ruby] binary/YRuby.cc(loadModule):148
Module /usr/share/YaST2/modules/NetworkStorage load failed:component cannot
import namespace 'Storage' at
/usr/lib64/ruby/vendor_ruby/1.9.1/yast/yast.rb:146:in `import_pure'
+2013-08-01 13:52:42 <3> app42(25867) [Interpreter] yast/i18n.rb:83
Ruby::loadModule() / Can't load ruby module
'/usr/share/YaST2/modules/NetworkStorage'
+2013-08-01 13:52:43 <3> app42(25867) [Y2Ruby] binary/YRuby.cc(loadModule):148
Module /usr/share/YaST2/modules/LanItems load failed:component cannot import
namespace 'Storage' at /usr/lib64/ruby/vendor_ruby/1.9.1/yast/yast.rb:146:in
`import_pure'
+2013-08-01 13:52:43 <3> app42(25867) [Interpreter] yast/i18n.rb:83
Ruby::loadModule() / Can't load ruby module '/usr/share/YaST2/modules/LanItems'

FAIL: Wrong stderr for bridge
See the diff above.
Running complex ...
Running dns ...
Running hardware ...
Running include ...
FAIL: Wrong stderr for include

The diff follows...

--- tests/include.err 2013-01-22 11:31:22.000000000 +0100
+++ tmp.err.include 2013-08-01 13:52:47.000000000 +0200
@@ -0,0 +1,10 @@
+2013-08-01 13:52:46 <3> app42(25954) [Y2Ruby] binary/YRuby.cc(loadModule):148
Module /usr/share/YaST2/modules/Storage load failed:cannot load such file --
dbus at /usr/lib64/ruby/1.9.1/rubygems/custom_require.rb:36:in `require'
+2013-08-01 13:52:46 <3> app42(25954) [Interpreter] yast/i18n.rb:83
Ruby::loadModule() / Can't load ruby module '/usr/share/YaST2/modules/Storage'
+2013-08-01 13:52:46 <5> app42(25954) [Y2Ruby]
binary/YRubyNamespace.cc(YRubyNamespace):192 The Ruby module 'Storage' is not
provided by its rb file
+2013-08-01 13:52:46 <3> app42(25954) [Interpreter] yast/i18n.rb:83 No table
associated to module 'Storage'
+2013-08-01 13:52:46 <3> app42(25954) [Y2Ruby] binary/YRuby.cc(loadModule):148
Module /usr/share/YaST2/modules/NetworkStorage load failed:component cannot
import namespace 'Storage' at
/usr/lib64/ruby/vendor_ruby/1.9.1/yast/yast.rb:146:in `import_pure'
+2013-08-01 13:52:46 <3> app42(25954) [Interpreter] yast/i18n.rb:83
Ruby::loadModule() / Can't load ruby module
'/usr/share/YaST2/modules/NetworkStorage'
+2013-08-01 13:52:46 <3> app42(25954) [Y2Ruby] binary/YRuby.cc(loadModule):148
Module /usr/share/YaST2/modules/LanItems load failed:component cannot import
namespace 'Storage' at /usr/lib64/ruby/vendor_ruby/1.9.1/yast/yast.rb:146:in
`import_pure'
+2013-08-01 13:52:46 <3> app42(25954) [Interpreter] yast/i18n.rb:83
Ruby::loadModule() / Can't load ruby module '/usr/share/YaST2/modules/LanItems'
+2013-08-01 13:52:47 <3> app42(25954) [Y2Ruby] binary/YRuby.cc(loadModule):148
Module /usr/share/YaST2/modules/Lan load failed:component cannot import
namespace 'Storage' at /usr/lib64/ruby/vendor_ruby/1.9.1/yast/yast.rb:146:in
`import_pure'
+2013-08-01 13:52:47 <3> app42(25954) [Interpreter] yast/i18n.rb:83
Ruby::loadModule() / Can't load ruby module '/usr/share/YaST2/modules/Lan'

FAIL: Wrong stderr for include
See the diff above.
Running remote ...
Running routines ...
Running runtime ...
Running udev ...
FAIL: Wrong stderr for udev

The diff follows...

--- tests/udev.err 2013-01-22 11:31:22.000000000 +0100
+++ tmp.err.udev 2013-08-01 13:52:50.000000000 +0200
@@ -0,0 +1,8 @@
+2013-08-01 13:52:50 <3> app42(26037) [Y2Ruby] binary/YRuby.cc(loadModule):148
Module /usr/share/YaST2/modules/Storage load failed:cannot load such file --
dbus at /usr/lib64/ruby/1.9.1/rubygems/custom_require.rb:36:in `require'
+2013-08-01 13:52:50 <3> app42(26037) [Interpreter] yast/i18n.rb:83
Ruby::loadModule() / Can't load ruby module '/usr/share/YaST2/modules/Storage'
+2013-08-01 13:52:50 <5> app42(26037) [Y2Ruby]
binary/YRubyNamespace.cc(YRubyNamespace):192 The Ruby module 'Storage' is not
provided by its rb file
+2013-08-01 13:52:50 <3> app42(26037) [Interpreter] yast/i18n.rb:83 No table
associated to module 'Storage'
+2013-08-01 13:52:50 <3> app42(26037) [Y2Ruby] binary/YRuby.cc(loadModule):148
Module /usr/share/YaST2/modules/NetworkStorage load failed:component cannot
import namespace 'Storage' at
/usr/lib64/ruby/vendor_ruby/1.9.1/yast/yast.rb:146:in `import_pure'
+2013-08-01 13:52:50 <3> app42(26037) [Interpreter] yast/i18n.rb:83
Ruby::loadModule() / Can't load ruby module
'/usr/share/YaST2/modules/NetworkStorage'
+2013-08-01 13:52:50 <3> app42(26037) [Y2Ruby] binary/YRuby.cc(loadModule):148
Module /usr/share/YaST2/modules/LanItems load failed:component cannot import
namespace 'Storage' at /usr/lib64/ruby/vendor_ruby/1.9.1/yast/yast.rb:146:in
`import_pure'
+2013-08-01 13:52:50 <3> app42(26037) [Interpreter] yast/i18n.rb:83
Ruby::loadModule() / Can't load ruby module '/usr/share/YaST2/modules/LanItems'

FAIL: Wrong stderr for udev
See the diff above.

Checking finished


=== yast2-network Summary ===

# of expected passes 12
# of unexpected failures 12
make[2]: *** [check-DEJAGNU] Error 1
make[2]: Leaving directory
`<http://river.suse.de/job/yast-network-HEAD/ws/checkout/testsuite'>
make[1]: *** [check-am] Error 2
make[1]: Leaving directory
`<http://river.suse.de/job/yast-network-HEAD/ws/checkout/testsuite'>
make: *** [check-recursive] Error 1
++ error_exit 2
++ echo 'ERROR: detected exitcode 2'
ERROR: detected exitcode 2
++ cleanup
++ echo '==> Running cleanup'
==> Running cleanup
++ rm -f
<http://river.suse.de/job/yast-network-HEAD/ws/ICECC/40c0ab7e54f59a1e4e493c1ea90a882a.tar.gz>
++ footer_and_exit 1
++ '[' -z 1 ']'
++ MYEXIT=1
++ '[' 1 == 0 ']'
++ ascii_failed
++ cat

( )
( ) (
) _ )
( \_
_(_\ \)__
(____\___))

build failed

++ exit 1
Build step 'Execute shell' marked build as failure
--
To unsubscribe, e-mail: yast-commit+unsubscribe@xxxxxxxxxxxx
For additional commands, e-mail: yast-commit+help@xxxxxxxxxxxx

< Previous Next >
This Thread
Follow Ups