Mailinglist Archive: opensuse-packaging (284 mails)

< Previous Next >
[opensuse-packaging] grub-1.99~rc1
Hello,
Can someone suggest a fix for this error message when compiling grub-1.99
rc1

I get compile error in grub-1.99 rc1
Part of log se [1]
Full log listing see [2]
other details see [3]
Glenn

[1]
mv -f tests/lib/.deps-core/functional_test_module-test.Tpo
tests/lib/.deps-core/functional_test_module-test.Po
gcc -Os -Wall -W -Wshadow -Wpointer-arith -Wmissing-prototypes -Wundef
-Wstrict-prototypes -g -falign-jumps=1 -falign-loops=1 -falign-functions=1
-mno-mmx -mno-sse -mno-sse2 -mno-3dnow -fno-dwarf2-cfi-asm -m32
-fno-stack-protector -mno-stack-arg-probe -Werror -mrtd -mregparm=3
-ffreestanding -fmessage-length=0 -O2 -Wall -D_FORTIFY_SOURCE=2
-fstack-protector -funwind-tables -fasynchronous-unwind-tables -static -m32
-Wl,--build-id=none -nostdlib -Wl,-N,-r,-d -o functional_test.module
tests/lib/functional_test_module-functional_test.o
tests/lib/functional_test_module-test.o
gcc -DHAVE_CONFIG_H -I. -I.. -Wall -W -I../include -I../include
-DGRUB_MACHINE_PCBIOS=1 -DGRUB_MACHINE=I386_PC -nostdinc -isystem
/usr/lib64/gcc/x86_64-suse-linux/4.5/include
-DGRUB_FILE=\"tests/example_functional_test.c\" -I. -I. -I.. -I..
-I../include -I../include -Os -Wall -W -Wshadow -Wpointer-arith
-Wmissing-prototypes -Wundef -Wstrict-prototypes -g -falign-jumps=1
-falign-loops=1 -falign-functions=1 -mno-mmx -mno-sse -mno-sse2 -mno-3dnow
-fno-dwarf2-cfi-asm -m32 -fno-stack-protector -mno-stack-arg-probe -Werror
-mrtd -mregparm=3 -ffreestanding -Wno-format -fmessage-length=0 -O2 -Wall
-D_FORTIFY_SOURCE=2 -fstack-protector -funwind-tables
-fasynchronous-unwind-tables -MT
tests/example_functional_test_module-example_functional_test.o -MD -MP -MF
tests/.deps-core/example_functional_test_module-example_functional_test.Tpo
-c -o tests/example_functional_test_module-example_functional_test.o `test
-f 'tests/example_functional_test.c' || echo
'./'`tests/example_functional_test.c
cc1: warnings being treated as errors
tests/example_functional_test.c: In function 'example_test':
tests/example_functional_test.c:30:3: error: too many arguments for format
tests/example_functional_test.c:31:3: error: too many arguments for format
make[3]: ***
[tests/example_functional_test_module-example_functional_test.o] Error 1
make[3]: Leaving directory
`/usr/src/packages/BUILD/grub-1.99rc1/grub-core'
make[2]: *** [all] Error 2
make[2]: Leaving directory
`/usr/src/packages/BUILD/grub-1.99rc1/grub-core'
make[1]: *** [all-recursive] Error 1
make[1]: Leaving directory `/usr/src/packages/BUILD/grub-1.99rc1'
make: *** [all] Error 2
error: Bad exit status from /var/tmp/rpm-tmp.FEmX8w (%build)

[2]
https://build.opensuse.org/package/rawlog?arch=x86_64&package=grub2&project=home%3Adoiggl&repository=openSUSE_Factory

[3]
https://build.opensuse.org/package/show?package=grub2&project=home%3Adoiggl
--
To unsubscribe, e-mail: opensuse-packaging+unsubscribe@xxxxxxxxxxxx
For additional commands, e-mail: opensuse-packaging+help@xxxxxxxxxxxx

< Previous Next >