Mailinglist Archive: opensuse-factory (365 mails)

< Previous Next >
[opensuse-factory] New Tumbleweed snapshot 20200118 released!
  • From: Dominique Leuenberger <dimstar@xxxxxxx>
  • Date: Mon, 20 Jan 2020 14:00:34 +0000
  • Message-id: <157952883434.21893.3576257735911825082@go-agent-stagingbot-6>

Please note that this mail was generated by a script.
The described changes are computed based on the x86_64 DVD.
The full online repo contains too many changes to be listed here.

Please check the known defects of this snapshot before upgrading:
https://openqa.opensuse.org/tests/overview?distri=opensuse&groupid=1&version=Tumbleweed&build=20200118

Please do not reply to this email to report issues, rather file a bug
on bugzilla.opensuse.org. For more information on filing bugs please
see https://en.opensuse.org/openSUSE:Submitting_bug_reports

Packages changed:
NetworkManager-branding-openSUSE
aaa_base (84.87+git20191206.1cb88e3 -> 84.87+git20200116.59482ba)
blog (2.19 -> 2.20)
checkpolicy
dconf
dracut (049+git116.e9995c78 -> 049+git118.a6090e2f)
ebtables
flatpak
gcc9 (9.2.1+r279103 -> 9.2.1+r280037)
gpm
health-checker (1.2.3 -> 1.3)
java-11-openjdk (11.0.5.0 -> 11.0.6.0)
kexec-tools (2.0.19 -> 2.0.20)
libatasmart
libostree (2019.1 -> 2019.6)
libsecret (0.19.1 -> 0.20.0)
libtirpc (1.1.4 -> 1.2.5)
lvm2
lvm2-device-mapper
man
mc
mutter (3.34.1+27 -> 3.34.3+0)
python-argparse-manpage (1.2.2 -> 1.3)
python-mailman
python-publicsuffix
salt
spice
sssd
suse-module-tools (15.2.7 -> 15.2.9)
tigervnc
vim (8.2.0063 -> 8.2.0119)
whois (5.5.3 -> 5.5.4)
xorg-x11-server (1.20.6+0 -> 1.20.7+0)

=== Details ===

==== NetworkManager-branding-openSUSE ====

- Switch package to _multibuild.

==== aaa_base ====
Version update (84.87+git20191206.1cb88e3 -> 84.87+git20200116.59482ba)
Subpackages: aaa_base-extras

- Update to version 84.87+git20200116.59482ba:
* drop dev.cdrom.autoclose = 0 from sysctl config (bsc#1160970)
* Call binaries in /usr only, /bin is legacy
- Update to version 84.87+git20200108.0da43d3:
* generalize testing for JVMs when creating the java path
to support sapjvm and others (boo#1157794)

==== blog ====
Version update (2.19 -> 2.20)
Subpackages: libblogger2

- Update to version 2.20
* Silent some gcc warnings, also avoid common variable (boo#1160385)
* Include <sys/sysmacros.h> for makedev
* sort input files (boo#1041090)
* libconsole: never return empty list from getconsoles()
* libconsole: Really allow to use /dev/console as a fallback in showconsole
* libconsole: Add console into the list only when successfully allocated
* libconsole: Correctly ignore early consoles
- Remove obsolate patch blog-Remove-unused-header.patch

==== checkpolicy ====

- Add extern_te_assert_t.patch to mark te_assert_t as extern.
Prevents build failures on gcc10 (bsc#1160259)

==== dconf ====
Subpackages: gsettings-backend-dconf libdconf1

- Add dconf-fix-meson.patch: Update use of link_whole for
meson-0.52 and newer.

==== dracut ====
Version update (049+git116.e9995c78 -> 049+git118.a6090e2f)

- Update to version 049+git118.a6090e2f:
* Implement support for verifying the boot with fipscheck (bsc#1158530)
- Update to version 049+git117.d3206e79:
* Remove purge-kernels scripts and service (jsc#SLE-10162)

==== ebtables ====
Subpackages: libebtc0

- rename /usr/lib/ebtables helper file to /usr/lib/ebtables-helper
otherwise it conflicts with /usr/lib/ebtables library directory
on 32-bit systems [bsc#1159769]

==== flatpak ====
Subpackages: libflatpak0 system-user-flatpak typelib-1_0-Flatpak-1_0

- Update dependencies required by flatpak 1.6.0 .
- Require xdg-dbus-proxy instead of building the (outdated)
builtin version.

==== gcc9 ====
Version update (9.2.1+r279103 -> 9.2.1+r280037)
Subpackages: cpp9 gcc9-c++ gcc9-fortran gcc9-info gcc9-locale gcc9-objc
libasan5 libatomic1 libgcc_s1 libgcc_s1-32bit libgfortran5 libgomp1 libitm1
liblsan0 libobjc4 libquadmath0 libstdc++6 libstdc++6-32bit
libstdc++6-devel-gcc9 libstdc++6-locale libstdc++6-pp-gcc9
libstdc++6-pp-gcc9-32bit libtsan0 libubsan1

- Update to gcc-9-branch head (r280037).
* Includes fix for [gcc#92154]

==== gpm ====
Subpackages: libgpm2

- gpm-fno-common.patch: fix compilation in Tumbleweed (bsc#1160873)
- Add back support for the TAOS evaluation module to inputattach.

==== health-checker ====
Version update (1.2.3 -> 1.3)
Subpackages: health-checker-plugins-MicroOS

- Update to version 1.3
* Support /var on non-root device for reading health data
* Avoid GRUB error message if env_block is not set [boo#1151072]
* Don't show message on manual emergency shell invocation
* Fix handling when booting a non-default snapshot

==== java-11-openjdk ====
Version update (11.0.5.0 -> 11.0.6.0)
Subpackages: java-11-openjdk-headless

- Update to upstream tag jdk-11.0.6-10 (January 2020 CPU,
bsc#1160968)
* Security fixes
+ S8224909, CVE-2020-2583: Unlink Set of LinkedHashSets
+ S8225261: Better method resolutions
+ S8225279: Better XRender interpolation
+ S8226352, CVE-2020-2590: Improve Kerberos interop capabilities
+ S8227758: More valid PKIX processing
+ S8227816: More Colorful ICC profiles
+ S8228548, CVE-2020-2593: Normalize normalization for all
+ S8229728: Implement negotiation parameters
+ S8229951, CVE-2020-2601: Better Ticket Granting Services
+ S8230279: Improve Pack200 file reading
+ S8230318: Better trust store usage
+ S8230967: Improve Registry support of clients
+ S8231139: Improved keystore support
+ S8231422, CVE-2020-2604: Better serial filter handling
+ S8231780, CVE-2020-2655: Better TLS messaging support
+ S8231790: Provide better FileSystemProviders
+ S8232419: Improve Registry registration
+ S8234037, CVE-2020-2654: Improve Object Identifier Processing
* Other changes
+ S8016914: CoreDocumentImpl.setXmlVersion NPE
+ S8048556: Unnecessary GCLocker-initiated young GCs
+ S8080462: Update SunPKCS11 provider with PKCS11 v2.40 support
+ S8134672: [TEST_BUG] Some tests should check
isDisplayChangeSupported
+ S8144125: [macOS] java/awt/event/ComponentEvent/
/MovedResizedTwiceTest/MovedResizedTwiceTest.java failed
automatically
+ S8146238: [macosx] Java2D Queue Flusher crash on OSX after
switching between user accounts
+ S8176837: SunPKCS11 provider needs to check more details on
PKCS11 Mechanism
+ S8185898: setRequestProperty(key, null) results in HTTP header
without colon in request
+ S8190737: use unicode version of the canonicalize() function
to handle long path on windows
+ S8191521: handle long relative path specified in
- Xbootclasspath/a on windows
+ S8193255: Root Certificates should be stored in text format
and assembled at build time
+ S8193325: StackFrameInfo::getByteCodeIndex returns wrong value
if bci > 32767
+ S8198882: Add 10 JNDI tests to com/sun/jndi/dns/AttributeTests
+ S8200381: Typos in javadoc - missing verb "be" and alike
+ S8202359: [GRAAL] compiler/uncommontrap/TestDeoptOOM.java
failed with OutOfMemoryError
+ S8205516: JFR tool
+ S8206115: Use shared macros for JavaClasses::compute_offsets
and MetaspaceShared::serialize_well_known_classes
+ S8207263: Store the Configuration for system modules into CDS
archive.
+ S8207922: ctw of jdk.security.auth failed with "Unexpected
zero exit codebefore finishing all compilations"
+ S8208179: Devanagari not shown with logical fonts on Windows
after removal of Lucida Sans from JDK
+ S8208236: [TESTBUG] vmTestbase/nsk/stress/stack tests fail by
timeout
+ S8208364: java/lang/reflect/callerCache/
/ReflectionCallerCacheTest.java missing module dependencies
declaration
+ S8208582: Introduce native oop barriers in C1 for OopHandle
+ S8208601: Introduce native oop barriers in C2 for OopHandle
+ S8209003: Consolidate use of empty collections in
java.lang.module
+ S8209120: Archive the Integer.IntegerCache
+ S8209178: Proxied HttpsURLConnection doesn't send BODY when
retrying POST request
+ S8209545: Simplify HeapShared::archive_module_graph_objects
+ S8209647: constantPoolHandle::constantPoolHandle(ConstantPool*)
when precompiled header is disabled
+ S8209691: Allow MemBar on single memory slice
+ S8209771: jdk.test.lib.Utils::runAndCheckException error
+ S8209790: SA tools not providing option to connect to debug
server
+ S8209833: C2 compilation fails with
"assert(ex_map->jvms()->same_calls_as(_exceptions->jvms()))
failed: all collected exceptions must come from the same
place"
+ S8209835: Aarch64: elide barriers on all volatile operations
+ S8209972: [GRAAL] Don't run RTM tests with Graal
+ S8210158: Accessorize JFR getEventWriter() intrinsics
+ S8210384: SunLayoutEngine.isAAT() font is expensive on MacOS
+ S8210387: C2 compilation fails with
"assert(node->_last_del == _last) failed: must have deleted
the edge just produced"
+ S8210403: Refactor java.util.Locale:i18n shell tests to plain
java tests
+ S8210559: ClassLoaderData Symbols can leak
+ S8210776: Upgrade X Window System 6.8.2 to the latest
XWD 1.0.7
+ S8210789: langtools/tools/javac/T8152616.java missing @modules
+ S8211037: Load jib jars dynamically from JibArtifactManager
+ S8211147: Incorrect comparator
com.sun.beans.introspect.MethodInfo.MethodOrder
+ S8211385: (zipfs) ZipDirectoryStream yields a stream of
absolute paths when directory is relative
+ S8211740: [AOT] -XX:AOTLibrary doesn't accept windows path
+ S8211866: TLS 1.3 CertificateRequest message sometimes offers
disallowed signature algorithms
+ S8211919: ZipDirectoryStream should provide a stream of paths
that are relative to the directory
+ S8211992: GraphicsConfiguration.getDevice().getDisplayMode()
causes JVM crash on Mac
+ S8212028: Use run-test makefile framework for testing in
Oracle's Mach5
+ S8212071: Need to set the FreeType LCD Filter to reduce
fringing.
+ S8212627: [TESTBUG] runtime/CreateMirror/
/ArraysNewInstanceBug.java timed out
+ S8212673: jtreg/applications/runthese/RunThese30M.java fails
in C2 with "assert(!had_error) failed: bad dominance"
+ S8212738: Incorrectly named signature scheme
ecdsa_secp512r1_sha512
+ S8212752: Typo in SSL log message related to inactive/disabled
signature scheme
+ S8213005: Missing symbols in hs_err files on Windows after
JDK-8212028
+ S8213008: Cipher with UNWRAP_MODE should support the
generation of an AES key type
+ S8213014: Crash in CompileBroker::make_thread due to OOM
+ S8213119: [macos] java/awt/GraphicsDevice/
/CheckDisplayModes.java fails
+ S8213381: Hook to allow GC to inject Node::Ideal() calls
+ S8213448: [TESTBUG] enhance jfr/jvm/TestDumpOnCrash
+ S8213568: Typo in java/awt/GraphicsEnvironment/LoadLock/
/GE_init5.java
+ S8213604: Fix missing includes after JDK-8212673
+ S8214046: [macosx] Undecorated Frame does not Iconify when
set to
+ S8214052: [testbug] vmTestbase/vm/compiler/
/CodeCacheInfoOnCompilation - wrong shell used
+ S8214098: sun.security.ssl.HandshakeHash.T12HandshakeHash
constructor check backwards.
+ S8214311: dtrace gensrc has missing dependencies
+ S8214315: G1: fatal error: acquiring lock SATB_Q_FL_lock/1 out
of order with lock tty_lock/0
+ S8214321: Misleading code in SSLCipher
+ S8214542: JFR: Old Object Sample event slow on a deep heap in
debug builds
+ S8214750: Unnecessary <p> tags in jfr classes
+ S8214773: Replace use of thread unsafe strtok
+ S8214896: JFR Tool left files behind
+ S8214925: JFR tool fails to execute
+ S8214975: No hs-err file if fatal error is raised during
dynamic initialization
+ S8215032: Support Kerberos cross-realm referrals (RFC 6806)
+ S8215105: java/awt/Robot/HiDPIScreenCapture/
/ScreenCaptureTest.java: Wrong Pixel Color
+ S8215200: IllegalArgumentException in
sun.lwawt.macosx.CPlatformWindow
+ S8215411: some GetByteArrayElements calls miss corresponding
Release
+ S8215449: Several tests failing when jtreg run with
- vmoption:--illegal-access=deny
+ S8215524: Finished message validation failure should be
decrypt_error alert
+ S8215699: -Xlog::file cannot be used with named pipe
+ S8215708: ZGC: Add missing LoadBarrierNode::size_of()
+ S8215755: ZGC: split_barrier_thru_phi: check number of inputs
of phi
+ S8215771: The jfr tool should pretty print reference chains
+ S8215913: [Test_bug]java/util/Locale/LocaleProvidersRun.java
failed on de_DE and ja_JP locale.
+ S8216064: -XX:StartFlightRecording:settings= doesn't work
properly
+ S8216135: C2 assert(!had_error) failed: bad dominance
+ S8216283: Allow shorter method sampling interval than 10 ms
+ S8216363: NullPointerException in
java.util.logging.Handler#isLoggable
+ S8216426: Usage of array placement new may lead to memory
corruption
+ S8216561: HttpClient: The logic of retry on connect exception
is inverted
+ S8216977: ShowHiddenFrames use in
java_lang_StackTraceElement::fill_in appears broken
+ S8217362: Emergency dump does not work when disk=false is set
+ S8217610: TLSv1.3 fail with ClassException when EC keys are
stored in PKCS11
+ S8217731: Font rendering and glyph spacing changed from jdk-8
to jdk-11
+ S8218468: Load barrier slow path node should be MachTypeNode
+ S8218580: endpoint identification algorithm should be
case-insensitive
+ S8218935: Make jfr strncpy uses GCC 8.x friendly
+ S8219504: Test for JDK-8211435 can be run on all platforms
+ S8219914: Change the environment variable for Java Access
Bridge logging to have a directory.
+ S8220175: serviceability/dcmd/framework/VMVersionTest.java
fails with a timeout
+ S8220231: Cache HarfBuzz face object for same font's text
layout calls
+ S8220352: Crash with assert(external_guard || result != __null)
failed: Invalid JNI handle
+ S8220394: bufferedStream does not honor size limit
+ S8220474: Incorrect GPL header in src/java.instrument/share/
/classes/java/lang/instrument/package-info.java
+ S8220476: Incorrect GPL header in src/jdk.internal.jvmstat/
/share/classes/sun/jvmstat/perfdata/monitor/protocol/local/
/PerfDataFile.java
+ S8220528: [AIX] Fix basic Xinerama and Xrender functionality
+ S8220555: JFR tool shows potentially misleading message when
it cannot access a file
+ S8220598: Malformed copyright year range in a few files in
java.base
+ S8221092: UseAVX=3 has performance degredation on Skylake (X7)
processors
+ S8221172: SunEC specific test is not limited to SunEC
+ S8221246: NullPointerException within Win32ShellFolder2
+ S8221395: HttpClient leaving connections in CLOSE_WAIT state
until Java process ends
+ S8221406: Windows 32bit build error in
NetworkInterface_winXP.c
+ S8221456: nmethod::make_unloaded() clears _method member too
early
+ S8221532: Incorrect copyright header in FileSystemSupport_md.c
+ S8221539: [metaspace] Improve MetaspaceObj::is_metaspace_obj()
and friends
+ S8221569: JFR tool produces incorrect output when both
- -categories and --events are specified
+ S8221711: [TESTBUG] create more tests for JFR in container
environment
+ S8221913: Add GC.selected() jtreg-ext function
+ S8222015: Small VM.metaspace improvements
+ S8222440: (zipfs) JarFileSystem does not correctly handle
versioned entries if no root entry is present
+ S8222529: sun.jdwp.listenerAddress agent property uses wrong
encoding
+ S8222807: Address iteration with invalid ZIP header entries
+ S8222888: [TESTBUG] docker/TestJFREvents.java fails due to
"RuntimeException: JAVA_MAIN_CLASS_ is not defined"
+ S8223438: add VirtualizationInformation JFR event
+ S8223490: Optimize search algorithm for determining default
time zone
+ S8223697: jfr tool can't format duration values greater than
minute
+ S8223869: Problem list java/awt/FontMetrics/
/MaxAdvanceIsMax.java on more platforms
+ S8224152: [macOS] ProblemList tests that leave rubbish on the
screen
+ S8224157: BCEL: update to version 6.3.1
+ S8224172: assert(jfr_is_event_enabled(id)) failed: invariant
+ S8224193: stringStream should not use Resouce Area
+ S8224217: RecordingInfo should use textual representation of
path
+ S8224502: [TESTBUG] JDK docker test TestSystemMetrics.java
fails with access issues and OOM
+ S8224505: TestQuotedLogOutput failure after ProcessBuilder
changes
+ S8224538: LoadBarrierNode::common_barrier must check address
+ S8224958: add os::dll_load calls to event log
+ S8225101: Crash at sun.awt.X11.XlibWrapper.XkbGetUpdatedMap
when change keybord map
+ S8225225: stringStream internal buffer should always be zero
terminated
+ S8225392: Comparison builds are failing due to cacerts file
+ S8225505: ctrl-F1 does not show the tooltip of a menu item
(JMenuItems)
+ S8225694: Destination option missing in
FlightRecorderMXBeanImpl
+ S8225695: 32-bitbuild failures after JDK-8080462 (Update
SunPKCS11 provider with PKCS11 v2.40 support)
+ S8225745: NoSuchAlgorithmException exception for
SHA256withECDSA with RSASSA-PSS support
+ S8226513: JEditorPane is shown with incorrect size
+ S8226651: Setting the mgfHash in CK_RSA_PKCS_PSS_PARAMS has no
effect
+ S8226719: Kerberos login to Windows 2000 failed with
"Inappropriate type of checksum in message"
+ S8226779: [TESTBUG] Test JFR API from Java agent
+ S8226869: Testjava/util/Locale/LocaleProvidersRun.java should
enable assertions
+ S8226899: Problemlist compiler/rtm tests
+ S8227031: Print NMT statistics on fatal errors
+ S8227032: MetaspaceUtils::print_report crashes when called
before initialization
+ S8227035: JVM::printFlags fails in native OOM situations
+ S8227061: KDC.java test behaves incorrectly when AS-REQ
contains a PAData not PA-ENC-TS-ENC
+ S8227086: Use AS_NO_KEEPALIVE loads in HeapDumper
+ S8227127: Era designator not displayed correctly using the
COMPAT provider
+ S8227338: templateInterpreter.cpp: copy_table() needs to be
safer
+ S8227368: EnumSet.class serialization broken in JDK 9+
+ S8227381: GSS login fails with PREAUTH_FAILED
+ S8227391: Update double-conversion to version 3.1.5
+ S8227397: Add --with-extra-asflags configure option
+ S8227411: TestTimeMultiple.java failed "assert(!lease())
failed: invariant"
+ S8227435: Perf::attach() should not throw a java.lang.Exception
+ S8227437: S4U2proxy cannot continue because server's TGT
cannot be found
+ S8227439: Turn off AOT by default
+ S8227605: Kitchensink fails "assert((((klass)->trace_id() &
(JfrTraceIdEpoch::leakp_in_use_this_epoch_bit())) != 0))
failed: invariant"
+ S8227642: [TESTBUG] Make docker tests podman compatible
+ S8228368: avoid incompatible pointer to integer conversion
initializing gint in gtk2_interface
+ S8228434: jdk/net/Sockets/Test.java fails after JDK-8227642
+ S8228465: HOST locale provider holds wrong era name for
GregorianCalendar in US locale
+ S8228625: [TESTBUG] sun/tools/jhsdb/JShellHeapDumpTest.java
fails with RuntimeException 'JShellToolProvider' missing from
stdout/stderr
+ S8228645: Don't run sun/security/pkcs11/Cipher/
/TestKATForGCM.java on buggy NSS solaris versions
+ S8228687: [TESTBUG] exclude Container tests from hotspot_misc
group
+ S8228772: C2 compilation fails due to unschedulable graph if
DominatorSearchLimit is reached
+ S8228834: Regression caused by JDK-8214542 not installing
complete checkpoint data to candidates
+ S8228835: Memory leak in PKCS11 provider when using AES GCM
+ S8228888: C2 compilation fails with assert "m has strange
control"
+ S8228902: add os::dll_load to the unified logging os category
+ S8229016: C2 scalarization crashes with assert(node->Opcode()
== Op_CastP2X) failed: ConvP2XNode required
+ S8229020: Failure on CPUs allowing loads reordering:
assert(_tasks[t] == 1) failed: What else?
+ S8229022: BufferedReader performance can be improved by using
StringBuilder
+ S8229156: ProblemList gc/stress/gclocker/
/TestExcessGCLockerCollections.java
+ S8229169: False failure of GenericTaskQueue::pop_local on
architectures with weak memory model
+ S8229182: runtime/containers/docker/TestMemoryAwareness.java
test fails on SLES12
+ S8229243: SunPKCS11-Solaris provider tests failing on
Solaris 11.4
+ S8229284: jdk/internal/platform/cgroup/TestCgroupMetrics.java
fails for - memory:getMemoryUsage
+ S8229408: Bump update version for OpenJDK: jdk-11.0.6
+ S8229420: [Redo] jstat reports incorrect values for OU for
CMS GC
+ S8229437: assert(is_aligned(ref, HeapWordSize)) failed:
invariant
+ S8229450: C2 compilation fails with assert(found_sfpt) failed
+ S8229483: Sinking load out of loop may trigger:
assert(found_sfpt) failed: no node in loop that's not input to
safepoint
+ S8229496: SIGFPE (division by zero) in C2 OSR compiled method
+ S8229515: [macos] access to window property of NSView on wrong
thread
+ S8229701: aarch64: C2 OSR compilation fails with "shouldn't
process one node several times" in final graph reshaping
+ S8229800: WindowsServerCore 1809 does not provide d2d1.dll
library required by awt.dll
+ S8229810: [macos] NullPointerException getting bounds of
GraphicsConfiguration
+ S8229872: (fs) Increase buffer size used with getmntent
+ S8229899: Make java.io.File.isInvalid() less racy
+ S8230061: # assert(mode == ControlAroundStripMined
&& use == sfpt) failed: missed a node
+ S8230062: assert(i == p->size()-1) failed: must be last
element of the pack
+ S8230110: TestLinkageErrorInGenerateOopMap times out
+ S8230115: Problemlist JFR TestNetworkUtilization test
+ S8230238: Add another regression test for JDK-8134739
+ S8230303: JDB hangs when running monitor command
+ S8230363:C2: Let ConnectionGraph::not_global_escape(Node* n)
return false if n is not in the CG
+ S8230376: [TESTBUG] runtime/StackTrace/HiddenFrameTest.java
fails with release VM
+ S8230388: Problemlist additional compiler/rtm tests
+ S8230466: check malloc/calloc results in jdk.hotspot.agent
+ S8230646: Epsilon does not extend TLABs to max size
+ S8230669: [s390] C1: assert(is_bound() || is_unused()) failed:
Label was never bound to a location, but it was used as a jmp
target
+ S8230671: x86_32 build failures after JDK-8229496
+ S8230711: ConnectionGraph::unique_java_object(Node* N) return
NULL if n is not in the CG
+ S8230728: Thin stroked shapes are not rendered if affine
transform has flip bit
+ S8230769: BufImg_SetupICM add ReleasePrimitiveArrayCritical
call in early return
+ S8230782: Robot.createScreenCapture() fails if "awt.robot.gtk"
is set to false
+ S8230813: Add JDK-8010500 to compiler/loopopts/superword/
/TestFuzzPreLoop.java bug list
+ S8230856: Java_java_net_NetworkInterface_getByName0 on unix
misses ReleaseStringUTFChars in early return
+ S8230861: missing ReleaseStringUTFChars in
Java_sun_security_pkcs11_wrapper_PKCS11_connect
+ S8230873: [AIX] GUI app does not work with UTF-8 locale on
minimum software requirements
+ S8230881: serviceability/sa/TestJmapCore tests fail with
java.lang.RuntimeException: Could not find dump file
+ S8230900: missing ReleaseStringUTFChars in java.desktop native
code
+ S8230901: missing ReleaseStringUTFChars in serviceability
native code
+ S8230923: SunJSSE is not properly initialized in FIPS mode
from a configuration file
+ S8230943: False deadlock detection with
- XX:+CIPrintCompileQueue after JDK-8163511
+ S8231055: C2: arraycopy with same non escaping src and dest
but different positions causes wrong execution
+ S8231084: Large performance regression in SwingMark TextArea
in 14-b13
+ S8231085: C2/GC: Better GC-interface for expanding clone
+ S8231098: (tz) Upgrade time-zone data to tzdata2019c
+ S8231124: Missing closedir call with JDK-8223490
+ S8231201: hs_err should print coalesced safepoint operations
in Events section
+ S8231222: fix pkcs11 P11_DEBUG guarded native traces
+ S8231223: C2's conditional move optimization fails with
assert(bol->Opcode() == Op_Bool) failed
+ S8231247: (zipfs) Test failure in jdk/nio/zipfs/
/InvalidZipHeaderTests.java after backport of JDK-8222807
+ S8231254: (fs) Add test for macOS Catalina changes to protect
system software
+ S8231294: ZGC: vmTestbase/nsk/jvmti/ResourceExhausted/
/resexhausted002 fails
+ S8231296: ZGC: vmTestbase/nsk/jvmti/Allocate/alloc001/ fails
+ S8231318: Several compiler/aot tests fail for JDK11 on Windows
when only MSVC 2017 is installed
+ S8231336: Corrupted option dialog in JTHarness with JDK14b13
+ S8231403: [ppc]: Align ReservedCodeCacheSize default value
with other platforms
+ S8231457: Asserts on AIX because os::elapsed_counter() is not
monotonic
+ S8231503: [TESTBUG] compiler/{jvmci,aot} tests should not run
with GCs that do not support JVMCI/AOT
+ S8231620: assert(bol->is_Bool()) crash during split if due to
FastLockNode
+ S8231665: 8231055 broke escapeAnalysis/TestSelfArrayCopy.java
+ S8231693: Backout "8230728: Thin stroked shapes are not
rendered if affine transform has flip bit" from jdk11u
+ S8231751: on aix handle Power 9 in os::get_summary_cpu_info
+ S8231770: Test java/util/zip/FlaterTest.java fails with
- Xcheck:jni
+ S8231885: Fix/remove malformed assert in os_windows.cpp
+ S8231887: ComodoCA.java fails because certificate was revoked
+ S8231930: Windows build fails after JDK-8191521
+ S8231949: [PPC64, s390]: Make async profiling more reliable
+ S8231988: Unexpected test result caused by C2
IdealLoopTree::do_remove_empty_loop
+ S8231991: Mouse wheel change focus on awt/swing windows
+ S8232005: [s390, PPC64] More exception checks missing in
interpreter
+ S8232019: Add LuxTrust certificate updates to the existing
root program
+ S8232051: Epsilon should warn about Xms/Xmx/AlwaysPreTouch
configuration
+ S8232052: use string literal for format string when handling
PauseAtStartupFile
+ S8232178: MacVolumesTest failed after upgrade to MacOS
Catalina
+ S8232381: add result NULL-checking to freetypeScaler.c
+ S8232539: SIGSEGV in C2 Node::unique_ctrl_out
+ S8232592: <Unknown compiled code> is shown in jstack mixed
mode
+ S8232874: Add missing test for 8230062
+ S8232879: Writing out data with the Zip File System leads to
a CRC failure
+ S8232984: Upgrading Joni License version to 2.1.16
+ S8233075: JFR - nmetods - misspelled in several places
+ S8233081: C1: PatchingStub for field access copies too much
+ S8233097: Fontmetrics for large Fonts has zero width
+ S8233202: exclude javax/swing/plaf/basic/BasicGraphicsUtils/
/8132119/bug8132119.java
+ S8233203: fix non-product build on AIX when compiling with
xlc16/legacy-xlc
+ S8233223: Add Amazon Root CA certificates
+ S8233404: System property to set the number of PBE iterations
in JCEKS keystores
+ S8233820: Test crashed with assert(phi->operand_count() != 1
|| phi->subst() != phi) failed: missed trivial simplification
+ S8233839: aarch64: missing memory barrier in
NewObjectArrayStub and NewTypeArrayStub
+ S8233886: TEST_BUG jdk/java/net/CookieHandler/B6791927.java
hit hardcoded expiration date
+ S8233944: Make KerberosPrincipal.KRB_NT_ENTERPRISE field
package private
+ S8233954: UnsatisfiedLinkError or NoSuchAlgorithmException
after removing sunec.dll
+ S8234080: jdk/nio/zipfs/CRCWriteTest.java fails
+ S8234107: Several AWT modal dialog tests failing on Linux
after JDK-8231991
+ S8234245: sun/security/lib/cacerts/VerifyCACerts.java fails
due to wrong checksum
+ S8234321: Call cache flush after generating trampoline.
+ S8234591: [11u] Build with old C compiler broken by 8223490
+ S8234625: hs test serviceability/sa/ClhsdbCDSCore.java fails
on macOS 10.15
+ S8234645: ARM32: C1: PatchingStub for field access: not enough
bytes
+ S8234906: [TESTBUG] TestDivZeroCheckControl fails for client
VMs due to Unrecognized VM option LoopUnrollLimit
+ S8235142: JDK-8193255 backport broke bootstrap with JDK 10
+ S8235403: Further cleanup to test
serviceability/sa/ClhsdbCDSCore.java
+ S8235585: Enable macOS codesigning for all libraries and
executables
+ S8235687: Contents/MacOS/libjli.dylib cannot be a symlink

==== kexec-tools ====
Version update (2.0.19 -> 2.0.20)

- Fix compiling errors of multiboot2_x86_* functions for i586
* kexec-tools-build-multiboot2-for-i386.patch
- Bump to version 2.0.20
Changelog:
https://git.kernel.org/pub/scm/utils/kernel/kexec/kexec-tools.git/log/?id=refs/tags/v2.0.19..v2.0.20
- Backport a upstream patch series: [jsc#SLE-9943]
Subject: [PATCH v2 0/3] arm64: handle "reserved" entries in /proc/iomem
* kexec-tools-add-variant-helper-functions.patch
*
kexec-tools-arm64-kexec-allocate-memory-space-avoiding-reserved-regions.patch
* kexec-tools-arm64-kdump-deal-with-resource-entries-in-proc-iomem.patch

==== libatasmart ====
Subpackages: libatasmart-utils libatasmart4

- Modernize spec file
- Use pkgconfig(libudev) instead of libudev-devel, allows shortcut
via systemd-mini package.

==== libostree ====
Version update (2019.1 -> 2019.6)
Subpackages: libostree-1-1

- Update to version 2019.6:
* Nothing major in this release, but there is some bigger stuff
outstanding and ready to merge, so this version was released
so that work will have time to stabilize.
* A few build/CI fixes. A new progress API which will be used by
flatpak (and can be used by others). Finally, we also avoid
reordering kernel arguments.
- Update to version 2019.5:
* We discovered that CLang has a static analyzer scan-build;
it found some small memory leaks so far, otherwise mostly
noise, but we haven't dug through all the errors yet.
* Gained a new zipl (s390x bootloader) backend
* Install the .hmac files needed for FIPS mode in /boot too
* This is also the first release where we switched to using
the OpenShift Prow as a merge bot, though a lot more CI work
is pending.
- Update to version 2019.4:
* This is mostly a bugfix release. Notably, the 2019.3 release caused
some issues related to the gpg-agent code spewing messages on the
terminal. Additionally, Fedora 31 users have hit upon issues with
ostree-finalize-staged.service running too late to be able to write
back its logs to the journal. This then confused rpm-ostree after
reboot, because it looks at the previous boot's journal for this
message.
* The biggest feature-ish change is support for a partial commit
"reason" so that after ostree fsck --delete was used, subsequent
ostree fsck will continue to report an error. This should be used
by higher level tools that want to do "fsck and repair". It's
likely at some point that "fsck and repair" logic will move down
into the libostree core as well.
* There are ongoing efforts to port Fedora CoreOS to s390x: one fix
landed here to add the deployment prefix to BLS entries since it's
what the zipl bootloader expected.
- Update to version 2019.3:
* A lot of changes since the last release. On the feature side,
probably the biggest is we've made public the internal API
for kernel arguments, which rpm-ostree now uses.
* Other things include a new --modern switch for init-fs,
better support in pull for downgrade protection, better
use of mmap, support for committing archives (tarballs)
from stdin, etc.
* Finally, libostree now supports being built without GPG,
which is an important preparatory piece for introducing
an alternative signature system.
- Update to version 2019.2:
+ It's been some time since the last release, so this is a slightly
larger one! There's lots of new features, and a few bug fixes.
+ New features:
* A new sysroot.bootloader key was added to be more explicit about
which bootloader OSTree should use. Notably a none value is
supported, in which OSTree is solely responsible for writing the
BLS entries. This can then be used by bootloaders like GRUB2,
which now supports BLS natively.
* ostree config now supports the unset command to unset a key from
the OSTree repo config
* ostree remote add now supports the --force flag to replace a
remote of the same name if it exists
* ostree-prepare-root now logs a structured journal message after
finding the deployment to which to pivot. This can be used by
higher-level apps like RPM-OSTree to build a history of the
deployments the machine was booted into.
* The staging API now supports a lockfile which prevents
finalization at shutdown. This is intended to be used in systems
that need more fine-tuned control between staging a deployment,
and setting it as the default deployment on reboot.
* ostree static-delta show now prints the From and To commits for
which the delta was generated
+ Bug fixes:
* Make looking up collection-refs similar to how regular refs are
looked up, i.e. first in the transaction, then in the current
repo, and then in the parent repo
* Don't include the OSTree commit version number twice in the boot
menu title. This affected at least Fedora-based systems composed
with RPM-OSTree's mutate-os-release.
* Activate ostree-finalize-staged earlier; this should hopefully
make deployment finalization more reliable by running it later in
the shutdown sequence, when less services are running
* Run grub2-mkconfig on the filesystem tree of the pending
deployment, rather than the previously deployed tree. This was a
corner case where the deployment failed if a previous deployment
did not exist, on systems where grub.cfg is used.

==== libsecret ====
Version update (0.19.1 -> 0.20.0)
Subpackages: libsecret-1-0 libsecret-lang typelib-1_0-Secret-1

- Update to version 0.20.0:
+ secret-backend:
- New interface to represent password storage backend.
- Add local-storage backend.
+ item: Port to GTask.
+ Build fixes.
+ Updated translations.
- Update to version 0.19.1:
+ service: Fix secret_service_ensure_session_finish error
propagation.
- Changes from version 0.19.0:
+ secret-password: Add necessary functions to migrate from D-Bus
based API.
+ egg: Request that secure memory not be dumped to disk.
+ Add version macros.
+ Add missing GType to flags in .gir.
+ paths: Port from GSimpleAsyncResult to GTask.
+ build: Bump meson_version to 0.50.
+ Build and test fixes.
- Update to version 0.18.8:
+ Add support for g_autoptr() to our types.
+ Remove deprecated g_type_class_add_private().
+ Bump GLib dependency (2.44+).
+ Add meson build support.
+ Fix vapi generation.
+ Build fixes.
+ Updated translations.
- Update to version 0.18.7:
+ Migrate from intltool to gettext.
+ Fix uninitialized memory returned by
secret_item_get_schema_name().
+ secret-session: Avoid double-free in
service_encode_plain_secret().
+ Port tap script to Python 3.
+ Build and test fixes.
+ Updated translations.
- Drop intltool BuildRequires: No longer needed following upstreams
port to gettext.
- Update to version 0.18.6:
+ Fix shared key derivation between libsecret and gnome-keyring
(bgo#778357).
+ Avoid run-time error when gnome-keyring is not responding
(bgo#787391).
+ Enable cross compilation (bgo#748111).
+ GI annotation fixes (bgo#785034).
+ Fix textual typos (bgo#782206).
+ Updated translations.
- Drop libsecret-secret-size.patch: fixed upstream.
- SRPM group fix. Update summaries.
- Remove duplicate commands. Limit fdupes to /usr.
- Modernize spec-file by calling spec-cleaner
- Add libsecret-secret-size.patch: Ensure that generated secret
occupies the same number of bytes as prime. Eliminates random
errors while libsecret tries to talk to gnome-keyring
(bgo#778357, bsc#1043861).
- Update to version 0.18.5:
+ Build fixes.
+ Port tests to Python 3 (bgo#761834).
+ Fix textual typos (bgo#763143).
+ Updated translations.
- Update to version 0.18.4:
+ Multithreading fixes (bgo#756766).
+ Fix memory leaks (bgo#756766).
+ Updated translations.
- Add libsecret-bsc932232-use-libgcrypt-allocators.patch
(bsc#932232).
- Update to version 0.18.3:
+ Documentation fixes.
+ Updated translations.
- Update to version 0.18.2:
+ Testing fixes.
+ Documentation typo (bgo#747654).
+ Build fixes (bgo#743444).
+ Accomodate libgcrypt 1.6+.
+ Updated translations.
- Changes from version 0.18.1:
+ Testing fix (bgo#726909).
- Update to version 0.18:
+ Mark most of unstable API as stable.
+ Bump Glib dependency (2.38+).
+ Add secret_service_encode_dbus_secret() and decode functions.
+ Use TAP for testing, parallel tests, and non-recursive make.
+ Updated FSF's address.
+ Remove unstable vapi (bgo#721429).
+ Build fixes: bgo#720087, bgo#720244, bgo#707452.
+ Updated translations.
- Drop typelib-1_0-SecretUnstable-0 subpackage: no more unstable
APIs (incl. dependency to this package from the -devel package).
- Update to version 0.16:
+ Clarify documentation for secret_service_clear_xxx()
(bgo#705629).
+ Pass return_type to prompt async begin functions, rather than
finish.
+ Simpler way to use custom service/collection/item types.
+ service: Rename secret_service_new() and friends to xxx_open().
+ Add secret_value_get_text() function to return NULL terminated
secret.
+ Fix return types in secret_service_search_finish() on error
paths (bgo#698040).
+ Testing fixes (bgo#705202).
+ Build fixes (bgo#704233).
+ Updated translations.
- Update to version 0.15:
+ Tweak predefined schemas (bgo#695791).
+ Updated translations.
- Update to version 0.14:
+ Add a 'search' command to the tool for looking up items
(bgo#693881).
+ Try to unlock locked collection when storing an item
(bgo#693723).
+ Improve validation of the attributes table (bgo#694107).
+ Allow empty SecretValue contents (bgo#694787).
+ Introspection fixes (bgo#694448).
+ Updated translations.
- Update to version 0.13:
+ Build fixes.
+ Updated translations.
- Update to version 0.12:
+ When storing a secret, create default keyring if necessary.
+ Share the memory pool with the gcr or libgnome-keyring library.
+ Testing and other fixes.
+ Build fixes.
- Update to version 0.11:
+ Better critical preconditions for invalid attributes.
- Update to version 0.10:
+ Updated translations.
- Change vala BuildRequires to a versioned BuildRequires: no reason
to waste build power if vala is not recent enough.
- Update to version 0.9:
+ Add a manual page for secret-tool.
+ Fix up libsecret licensing.
+ Build and testing fixes.
- Add docbook-xsl-stylesheets and xsltproc BuildRequires in order
to be able to build the man pages.
- Update to version 0.8:
+ Fix up libsecret licensing (bgo#681255).
+ Initialize gettext correctly.
+ Fix crash in secret-tool.
+ Build and testing fixes.
- Update to version 0.7:
+ Match schema names for notes and network passwords
+ Add flags argument to secret_collection_for_alias()
+ Correct flags behavior for SecretCollection
+ Build fixes
- Changes from version 0.6:
+ Rename secret_password_remove() to secret_password_clear()
and similar names for related functions.
+ The secret_attribute_build() functions are stable
+ The predefined secret schemas are stable
+ Build fixes
- Changes from version 0.5:
+ secret_service_remove() removes all unlocked matching items
+ Make sure that we have some attributes when searching
+ Add flags for item and collection creation
+ Add way to get schema name from a SecretItem
+ Rename secret_service_read_alias() to
secret_collection_for_alias()
+ Split the stable and unstable APIs into separate
pkg-config files, girs and vapis
+ Bump the library major version number to 1
+ Document how to migrate from libgnome-keyring
+ Document how to use libsecret from C, js, python, vala
+ Documentation fixes
- Changes from version 0.4:
+ Implement per collection search
+ Register secret service errors as GDBus errors
+ Cache default SecretService object, and provide a way to
'disconnect' it. Also 'disconnect' if service goes away.
+ Better use of aliases when storing passwords
+ Rename functions that operate on a dbus object path
+ Accept NULL as a SecretService parameter for many methods
+ Make loading items for a collection optional
+ More consistent use of schemas
+ Able to unlock and load secrets while searching for items
+ Cache the secret value on SecretItem
+ Add vala bindings and tests
+ Remove most varargs other than the simple password functions
+ Add SECRET_SCHEMA_NOTE schema
+ Lots of bug fixes
+ Documentation fixes
+ Testing fixes
+ Build fixes
- Add vala BuildRequires: required to build the new bindings.
- Update to version 0.3:
+ Add methods to get services from collections, items
+ Add methods to read and set aliases
+ Add methods which handle prompts for a DBus object path
+ Header path fix
+ Documentation fixes
- Update to version 0.2:
+ Fix header copyright issues
+ Add missing 'authtype' attribute to the 'network' schema
+ Add secret-schemas.h to the 'stable' API
+ Build fixes
- New package with 0.1 as initial version.

==== libtirpc ====
Version update (1.1.4 -> 1.2.5)
Subpackages: libtirpc-netconfig libtirpc3 libtirpc3-32bit

- Update to libtirpc 1.2.5
- A number resource leaks and other issues were fix which were identified
by a Coverity Scan.
- The AUTH_DES authentication has been deprecated. If any of those routines
are called, they will fail immediately.
- numerous bug fixes
- Package changes:
- Build without AUTH_DES authentication
- Add patch from next release 0001-Add-authdes_seccreate-stub.patch
(a86b4ff Add authdes_seccreate() stub)
- Drop rc patches (libtirpc-1-1-5-rc1.patch, libtirpc-1-1-5-rc2.patch)
- Drop patches all patches backported from this release
(0001-Makefile.am-Use-LIBADD-instead-of-LDFLAGS-to-link-ag.patch,
0002-man-rpc_secure.3t-Fix-typo-in-manpage.patch,
0003-xdr-add-a-defensive-mask-in-xdr_int64_t-and-xdr_u_in.patch)

==== lvm2 ====
Subpackages: liblvm2cmd2_03

- Update lvm.conf file (bsc#1159238)
- enable issue_discards by default

==== lvm2-device-mapper ====
Subpackages: device-mapper libdevmapper-event1_03 libdevmapper1_03
libdevmapper1_03-32bit

- Update lvm.conf file (bsc#1159238)
- enable issue_discards by default

==== man ====

- Don't mark /etc/alternatives files as %config as that would lead
to stale symlinks on uninstall

==== mc ====
Subpackages: mc-lang

- mc-no-common.patch: fix compilation on Tumbleweed (bsc#1160401)

==== mutter ====
Version update (3.34.1+27 -> 3.34.3+0)
Subpackages: libmutter-5-0 mutter-data mutter-lang

- Update to version 3.34.3+0:
* Bump version to 3.34.3
- Update to version 3.34.2+2:
* clutter/stage: Fix picking of rectangles with negative
positions.
- Update to version 3.34.2+1:
* screen-cast: Fix window recording on HiDPI
- Update to version 3.34.2+0:
* Update British English translation
* backends/native: Fix double free of error
* kms-impl/simple: Fix meta_set_fallback_feedback_idle
* kms: Process impl idle callbacks before pre dispatch flush
- Add explicit pkgconfig(fribidi) and pkgconfig(glib-2.0)
BuildRequires: meson checks for it.
- Add mutter-disable-cvt-s390x.patch: do not search cvt on s390x,
it doesn't exist there (bsc#1158128).
- Update to version 3.34.1+66:
* stack: Allow promoting transient windows to their parent's layer
* shaped-texture: Do not invalidate content on set_cogl_texture()
* cursor-tracker: Add API to keep the wayland pointer focus while hidden
* device-manager-x11: Ignore events if no source device is set
* clutter/cally-root: Use g_clear_signal_handler and fix a signal leak
* wayland: Move "ownership" of the DnD selection source to the data device
* wayland: Do not cancel data source on offer destruction
* wayland: Avoid redundant cancel() call
* wayland: Drop unused wl_signal structs
- Update to version 3.34.1+57:
* cursor-renderer/native: Fix cursor drawing in combination with
panel_orientation_transform
* output-kms: Fix "panel orientation" kms-prop being ignored on native outputs
* compositor: Plug cairo_region_t leak
* backends: Plug MetaKmsPageFlipData leak
* input-settings/x11: Add missing clutter_x11_trap_x_errors around
XIGetProperty
* plugin-manager: Kill window effects on destroy
* plugins/default: Handle skipped animations
* wayland/surface: Don't double scale when getting absolute coordinates
* window-props: Don't set override redirect windows as top-level parent
* window-props: Don't look for parent multiple times
* window: Assert we only set a NULL workspace when unmanaging
* window: Warn if O-R window workspace state is used
* wayland/actor-surface: Always store away frame callbacks on commit
* ci: Fix checking out gnome-shell on stable branches
* x11-display: Don't unset the X11 focused window after setting one
* tests/monitor-unit-tests: Add another tiling window hot plug test
* window: Reset tile monitor number when untiling
* tests/monitor-unit-tests: Add window tiling hot plug test
* tests/runner: Move window shown synchronization to helper
* tests/monitor-unit-tests: Move test client sanity check into helper
* window: Always update tile monitor number on hot plug
* plugins/default: Clean up tile preview when closing display
* plugin/default: Init quark before using
* display: Add 'closing' signal
* renderer-native: Separate offscreen and shadowfb
* clutter/stage-view: Separate offscreen and shadowfb
- Update to version 3.34.1+31:
* wayland: Check stylus serials on meta_wayland_seat_can_popup()
* x11: Limit touch replay pointer events to when replaying
* display: Move finishing of touch sequence to the backend
* x11: Update X11 focus before updating MetaDisplay focus

==== python-argparse-manpage ====
Version update (1.2.2 -> 1.3)

- update to 1.3
* drop additional .br tag from paragraphs so the multiline text is nicer
* provide argparse-manpage via entry_point

==== python-mailman ====

- be able to run test on 15

==== python-publicsuffix ====

- fix build in SLE-15: set en_US.UTF-8 encoding

==== salt ====
Subpackages: python3-salt salt-master salt-minion

- Support for Btrfs and XFS in parted and mkfs added
- Added:
* support-for-btrfs-and-xfs-in-parted-and-mkfs.patch
- Adds list_downloaded for apt Module to enable pre-downloading support
- Adds virt.(pool|network)_get_xml functions
- Various libvirt updates
* Add virt.pool_capabilities function
* virt.pool_running improvements
* Add virt.pool_deleted state
* virt.network_define allow adding IP configuration
- Added:
* virt.network_define-allow-adding-ip-configuration.patch
* list_downloaded-for-apt-module.patch
* add-virt.network_get_xml-function.patch
- virt: adding kernel boot parameters to libvirt xml
- Added:
* virt-adding-kernel-boot-parameters-to-libvirt-xml-55.patch
- Fix virt states to not fail on VMs already stopped
- Added:
* fix-virt-states-to-not-fail-on-vms-already-stopped.-.patch

==== spice ====

- Enable video codec support (VPX and MJPEG)

==== sssd ====
Subpackages: libsss_certmap0 libsss_idmap0 libsss_nss_idmap0 sssd-32bit
sssd-krb5-common sssd-ldap

- SSSD GPO host entries are ignored if computer cn does not
match its samaccountname, add
0001-Resolve-computer-lookup-failure-when-sam-cn.patch;
(jsc#SLE-9298); (bsc#1160688)

==== suse-module-tools ====
Version update (15.2.7 -> 15.2.9)

- Update to version 15.2.9:
* 00-system.conf: move br_netfilter softdep to separate file
(boo#1158817)
- Update to version 15.2.8:
* Add modprobe.conf.s390x (bsc#1132798)

==== tigervnc ====
Subpackages: libXvnc1 xorg-x11-Xvnc xorg-x11-Xvnc-module

- u_xorg-server-1.20.7-ddxInputThreadInit.patch
* buildfix for xorg-server 1.20.7, which moved ddxInputThread
call from os layer into ddx layer

==== vim ====
Version update (8.2.0063 -> 8.2.0119)
Subpackages: gvim vim-data vim-data-common

- Updated to version 8.2.0119, fixes the following problems
* Printf formats are not exactly right.
* Hgignore is out of sync from gitignore.
* When sign text is changed a manual redraw is needed. (Pontus Lietzler)
* Corrupted text properties when expanding spaces.
* prop_find() is not implemented.
* VAR_SPECIAL is also used for booleans.
* Illegal memory access when using 'cindent'.
* "make cmdidxs" fails.
* Info about sourced scripts is scattered.
* Byte2line() does not work correctly with text properties. (Billie Cleek)
* BufEnter autocmd not triggered on ":tab drop". (Andy Stewart)
* Crash when using gettabwinvar() with invalid arguments. (Yilin Yang)
* Crash when cycling to buffers involving popup window .
* Message test fails on some platforms. (Elimar Riesebieter)
* Wrong size argument to vim_snprintf(). (Dominique Pelle)
* Diffmode completion doesn't use per-window setting.
* Some corners of vim_snprintf() are not tested.
* ERROR_UNKNOWN clashes on some systems.
* Crash when using Python 3 with "utf32" encoding. (Dominique Pelle)
* ETYPE_ is used for two different enums.
* Crash when using Python 3 with "debug" encoding. (Dominique Pelle)
* Initializing globals with COMMA is clumsy.
* Python 3 unicode test sometimes fails.
* Python 3 unicode test still sometimes fails.
* settagstack() cannot truncate at current index.
* Expanding <sfile> works differently the second time.
* Python 3 unicode test still fails on MS-Windows.
* Globals using INIT4() are not in the tags file.
* When reusing a buffer listeners are not cleared. (Axel Forsman)
* Text properties wrong when tabs and spaces are exchanged.
* Complete item "user_data" can only be a string.
* Dead code in builtin functions.
* Build error for small version. (Tony Mechelynck)
* Crash in command line expansion when out of memory.
* Insufficient tests for tags; bug in using extra tag field when using an
ex command to position the cursor.
* Crash when running out of memory in :setfiletype completion.
* Generated files show up in git status.
* Compiler warnings for size_t / int types.
* Tags functionality insufficiently tested.
* win_splitmove() can make Vim hang.
* Cannot specify exit code for :cquit.
* Cannot create tiny popup window in last column. (Daniel Steinberg)
* Crash with autocommand and spellfile. (Tim Pope)
* Exe stack length can be wrong without being detected.
* Use of NULL pointer when out of memory.
* Macros for Ruby are too complicated.
* Crash when passing null object to ":echomsg".
* Messages test fails in small version.
* Using null object with execute() has strange effects.
* Using channel or job with ":execute" has strange effects.
* Vim license not easy to find on github.

==== whois ====
Version update (5.5.3 -> 5.5.4)

- whois 5.5.4:
* Updated the .vu TLD server
* Updated the list of new gTLDs
* Added the charset for whois.ripe.net
* Added support for the referrals in answers from whois.registry.in
* Implemented support for passing raw $salts$
* Fixed and updated many hiding string
* Cleaned up the text and typesetting of the man pages

==== xorg-x11-server ====
Version update (1.20.6+0 -> 1.20.7+0)
Subpackages: xorg-x11-server-Xvfb xorg-x11-server-extra xorg-x11-server-sdk
xorg-x11-server-wayland

- Update to version 1.20.7+0:
* xserver 1.20.7
* ospoll: Fix Solaris ports implementation to build on Solaris 11.4
* os-support/solaris: Set IOPL for input thread too
* Add xf86OSInputThreadInit call from common layer into os-support layer
* Add ddxInputThread call from os layer into ddx layer
* os-support/solaris: Drop ExtendedEnabled global variable
* glamor: Only use dual blending with GLSL >= 1.30
* modesetting: Check whether RandR was initialized before calling rrGetScrPriv
* Xi: return AlreadyGrabbed for key grabs > 255
* xwayland: Do flush GPU work in xwl_present_flush
* modesetting: Clear new screen pixmap storage on RandR resize
* xfree86/modes: Call xf86RotateRedisplay from xf86CrtcRotate
* modesetting: Call glamor_finish from drmmode_crtc_set_mode
* modesetting: Use EGL_MESA_query_driver to select DRI driver if possible
* glamor: Add a function to get the driver name via EGL_MESA_query_driver


--
To unsubscribe, e-mail: opensuse-factory+unsubscribe@xxxxxxxxxxxx
To contact the owner, e-mail: opensuse-factory+owner@xxxxxxxxxxxx

< Previous Next >
Follow Ups