Mailinglist Archive: opensuse-factory (633 mails)

< Previous Next >
[opensuse-factory] New Tumbleweed snapshot 20190121 released!

Please note that this mail was generated by a script.
The described changes are computed based on the x86_64 DVD.
The full online repo contains too many changes to be listed here.

Please check the known defects of this snapshot before upgrading:
https://openqa.opensuse.org/tests/overview?distri=opensuse&groupid=1&version=Tumbleweed&build=20190121

Please do not reply to this email to report issues, rather file a bug
on bugzilla.opensuse.org. For more information on filing bugs please
see https://en.opensuse.org/openSUSE:Submitting_bug_reports

Packages changed:
akonadi-calendar (18.12.0 -> 18.12.1)
akonadi-calendar-tools (18.12.0 -> 18.12.1)
akonadi-contact (18.12.0 -> 18.12.1)
akonadi-import-wizard (18.12.0 -> 18.12.1)
akonadi-mime (18.12.0 -> 18.12.1)
akonadi-notes (18.12.0 -> 18.12.1)
akonadi-search (18.12.0 -> 18.12.1)
akonadi-server (18.12.0 -> 18.12.1)
akregator (18.12.0 -> 18.12.1)
ark (18.12.0 -> 18.12.1)
attica-qt5 (5.53.0 -> 5.54.0)
baloo5 (5.53.0 -> 5.54.0)
baloo5-widgets (18.12.0 -> 18.12.1)
bluez-qt (5.53.0 -> 5.54.0)
breeze5-icons (5.53.0 -> 5.54.0)
calendarsupport (18.12.0 -> 18.12.1)
cyrus-imapd
discover
dolphin (18.12.0 -> 18.12.1)
dragonplayer (18.12.0 -> 18.12.1)
eventviews (18.12.0 -> 18.12.1)
frameworkintegration (5.53.0 -> 5.54.0)
freeipmi
gcc8 (8.2.1+r265901 -> 8.2.1+r267546)
geany (1.33 -> 1.34.1)
geany-plugins (1.33 -> 1.34)
git
grantleetheme (18.12.0 -> 18.12.1)
gthumb
gwenview5 (18.12.0 -> 18.12.1)
icecream
incidenceeditor (18.12.0 -> 18.12.1)
intel-gpu-tools
java-12-openjdk (12.0.0.0~16 -> 12.0.0.0~26)
kaccounts-integration (18.12.0 -> 18.12.1)
kaccounts-providers (18.12.0 -> 18.12.1)
kactivities-stats (5.53.0 -> 5.54.0)
kactivities5 (5.53.0 -> 5.54.0)
kaddressbook (18.12.0 -> 18.12.1)
kalarmcal (18.12.0 -> 18.12.1)
kamera (18.12.0 -> 18.12.1)
karchive (5.53.0 -> 5.54.0)
kate (18.12.0 -> 18.12.1)
kauth (5.53.0 -> 5.54.0)
kbookmarks (5.53.0 -> 5.54.0)
kcalc (18.12.0 -> 18.12.1)
kcalcore (18.12.0 -> 18.12.1)
kcalutils (18.12.0 -> 18.12.1)
kcharselect (18.12.0 -> 18.12.1)
kcmutils (5.53.0 -> 5.54.0)
kcodecs (5.53.0 -> 5.54.0)
kcolorchooser (18.12.0 -> 18.12.1)
kcompletion (5.53.0 -> 5.54.0)
kconfig (5.53.0 -> 5.54.0)
kconfigwidgets (5.53.0 -> 5.54.0)
kcontacts (18.12.0 -> 18.12.1)
kcoreaddons (5.53.1 -> 5.54.0)
kcrash (5.53.0 -> 5.54.0)
kdav (18.12.0 -> 18.12.1)
kdbusaddons (5.53.0 -> 5.54.0)
kdeclarative (5.53.0 -> 5.54.0)
kded (5.53.0 -> 5.54.0)
kdelibs4support (5.53.0 -> 5.54.0)
kdenetwork4-filesharing (18.12.0 -> 18.12.1)
kdepim-addons (18.12.0 -> 18.12.1)
kdepim-apps-libs (18.12.0 -> 18.12.1)
kdepim-runtime (18.12.0 -> 18.12.1)
kdesu (5.53.0 -> 5.54.0)
kdialog (18.12.0 -> 18.12.1)
kdnssd-framework (5.53.0 -> 5.54.0)
kdoctools (5.53.0 -> 5.54.0)
kemoticons (5.53.0 -> 5.54.0)
kernel-firmware
kfilemetadata5 (5.53.0 -> 5.54.0)
kglobalaccel (5.53.0 -> 5.54.0)
kguiaddons (5.53.0 -> 5.54.0)
khelpcenter5 (18.12.0 -> 18.12.1)
kholidays (5.53.0 -> 5.54.0)
khtml (5.53.0 -> 5.54.0)
ki18n (5.53.0 -> 5.54.0)
kiconthemes (5.53.0 -> 5.54.0)
kidentitymanagement (18.12.0 -> 18.12.1)
kidletime (5.53.0 -> 5.54.0)
kimageformats (5.53.0 -> 5.54.0)
kimap (18.12.0 -> 18.12.1)
kinit (5.53.0 -> 5.54.0)
kio (5.53.0 -> 5.54.0)
kio-extras5 (18.12.0 -> 18.12.1)
kio_audiocd (18.12.0 -> 18.12.1)
kirigami2 (5.53.0 -> 5.54.0)
kitemmodels (5.53.0 -> 5.54.0)
kitemviews (5.53.0 -> 5.54.0)
kitinerary (18.12.0 -> 18.12.1)
kjobwidgets (5.53.0 -> 5.54.0)
kjs (5.53.0 -> 5.54.0)
kjsembed (5.53.0 -> 5.54.0)
kldap (18.12.0 -> 18.12.1)
kleopatra (18.12.0 -> 18.12.1)
kmag (18.12.0 -> 18.12.1)
kmail (18.12.0 -> 18.12.1)
kmail-account-wizard (18.12.0 -> 18.12.1)
kmailtransport (18.12.0 -> 18.12.1)
kmbox (18.12.0 -> 18.12.1)
kmime (18.12.0 -> 18.12.1)
kmousetool (18.12.0 -> 18.12.1)
knewstuff (5.53.0 -> 5.54.0)
knotes (18.12.0 -> 18.12.1)
knotifications (5.53.0 -> 5.54.0)
knotifyconfig (5.53.0 -> 5.54.0)
kompare (18.12.0 -> 18.12.1)
konsole (18.12.0 -> 18.12.1)
kontact (18.12.0 -> 18.12.1)
kontactinterface (18.12.0 -> 18.12.1)
kopete (18.12.0 -> 18.12.1)
korganizer (18.12.0 -> 18.12.1)
kpackage (5.53.0 -> 5.54.0)
kparts (5.53.0 -> 5.54.0)
kpeople5 (5.53.0 -> 5.54.0)
kpimtextedit (18.12.0 -> 18.12.1)
kpkpass (18.12.0 -> 18.12.1)
kplotting (5.53.0 -> 5.54.0)
kpty (5.53.0 -> 5.54.0)
kross (5.53.0 -> 5.54.0)
kruler (18.12.0 -> 18.12.1)
krunner (5.53.0 -> 5.54.0)
kservice (5.53.0 -> 5.54.0)
ksmtp (18.12.0 -> 18.12.1)
ktexteditor (5.53.0 -> 5.54.0)
ktextwidgets (5.53.0 -> 5.54.0)
ktnef (18.12.0 -> 18.12.1)
kunitconversion (5.53.0 -> 5.54.0)
kwallet (5.53.0 -> 5.54.0)
kwalletmanager5 (18.12.0 -> 18.12.1)
kwayland (5.53.0 -> 5.54.0)
kwidgetsaddons (5.53.0 -> 5.54.0)
kwin5
kwindowsystem (5.53.0 -> 5.54.0)
kxmlgui (5.53.0 -> 5.54.0)
kxmlrpcclient5 (5.53.0 -> 5.54.0)
libKF5ModemManagerQt (5.53.0 -> 5.54.0)
libKF5NetworkManagerQt (5.53.0 -> 5.54.0)
libgravatar (18.12.0 -> 18.12.1)
libkcddb (18.12.0 -> 18.12.1)
libkcompactdisc (18.12.0 -> 18.12.1)
libkdcraw (18.12.0 -> 18.12.1)
libkdepim (18.12.0 -> 18.12.1)
libkexiv2 (18.12.0 -> 18.12.1)
libkgapi (18.12.0 -> 18.12.1)
libkipi (18.12.0 -> 18.12.1)
libkleo (18.12.0 -> 18.12.1)
libkomparediff2 (18.12.0 -> 18.12.1)
libksane (18.12.0 -> 18.12.1)
libksieve (18.12.0 -> 18.12.1)
libqt4
libqt5-qtscript
libqt5-qtwebengine
libyui-qt (2.49.13 -> 2.49.14)
libzypp (17.10.3 -> 17.11.0)
links (2.17 -> 2.18)
lzip (1.21~rc1 -> 1.21)
mailcommon (18.12.0 -> 18.12.1)
mailimporter (18.12.0 -> 18.12.1)
mariadb (10.2.19 -> 10.2.21)
meld (3.19.0 -> 3.20.0)
messagelib (18.12.0 -> 18.12.1)
mobipocket (18.12.0 -> 18.12.1)
mutt (1.11.1 -> 1.11.2)
ocfs2-tools
okular (18.12.0 -> 18.12.1)
openssh
osc (0.163.0 -> 0.164.1)
oxygen5-icon-theme (5.53.0 -> 5.54.0)
pam_ssh (2.1 -> 2.3)
perl-URI (1.74 -> 1.76)
phonon (4.10.1 -> 4.10.2)
phonon4qt5 (4.10.1 -> 4.10.2)
pimcommon (18.12.0 -> 18.12.1)
plasma-browser-integration (5.14.4 -> 5.14.5)
plasma-framework (5.53.0 -> 5.54.0)
prison-qt5 (5.53.0 -> 5.54.0)
purple-facebook (0.9.5 -> 0.9.6)
purpose (5.53.0 -> 5.54.0)
rubygem-autoprefixer-rails (9.3.1 -> 9.4.5)
rubygem-commander (4.4.6 -> 4.4.7)
rubygem-diffy (3.2.1 -> 3.3.0)
rubygem-faraday (0.15.2 -> 0.15.4)
rubygem-ffi (1.9.25 -> 1.10.0)
rubygem-hashdiff (0.3.7 -> 0.3.8)
rubygem-i18n (1.1.1 -> 1.5.2)
rubygem-liquid (4.0.0 -> 4.0.1)
rubygem-mimemagic (0.3.2 -> 0.3.3)
rubygem-mini_portile2 (2.3.0 -> 2.4.0)
rubygem-mixlib-shellout (2.4.0 -> 2.4.2)
rubygem-msgpack (1.2.4 -> 1.2.6)
rubygem-mustache (1.0.5 -> 1.1.0)
rubygem-nokogiri (1.8.5 -> 1.10.1)
rubygem-passenger (6.0.0 -> 6.0.1)
rubygem-rake (12.3.1 -> 12.3.2)
rubygem-ruby_parser (3.11.0 -> 3.12.0)
rubygem-sass (3.7.2 -> 3.7.3)
rubygem-stomp (1.4.6 -> 1.4.8)
rubygem-tilt (2.0.8 -> 2.0.9)
rubygem-tins (1.16.3 -> 1.20.2)
rubygem-tomlrb (1.2.7 -> 1.2.8)
rubygem-tzinfo (1.2.5 -> 2.0.0)
rubygem-tzinfo-data (1.2018.7 -> 1.2018.9)
rubygem-vagrant_cloud (2.0.1 -> 2.0.2)
rubygem-winrm-fs (1.3.1 -> 1.3.2)
samba (4.9.3+git.121.c328d5e9101 -> 4.9.4+git.126.aa8e79e6e87)
solid (5.53.0 -> 5.54.0)
sonnet (5.53.0 -> 5.54.0)
spectacle (18.12.0 -> 18.12.1)
subversion (1.11.0 -> 1.11.1)
syntax-highlighting (5.53.0 -> 5.54.0)
threadweaver (5.53.0 -> 5.54.0)
valgrind
virtualbox
vlc (3.0.4 -> 3.0.6)
xdg-desktop-portal-kde (5.14.4 -> 5.14.5)
xfce4-panel-plugin-battery (1.1.1 -> 1.1.2)

=== Details ===

==== akonadi-calendar ====
Version update (18.12.0 -> 18.12.1)
Subpackages: akonadi-calendar-lang akonadi-plugin-calendar
libKF5AkonadiCalendar5

- Update to 18.12.1
* New bugfix release
* For more details please see:
* https://www.kde.org/announcements/announce-applications-18.12.1.php
- Changes since 18.12.0:
* No code changes since 18.12.0

==== akonadi-calendar-tools ====
Version update (18.12.0 -> 18.12.1)
Subpackages: akonadi-calendar-tools-lang

- Update to 18.12.1
* New bugfix release
* For more details please see:
* https://www.kde.org/announcements/announce-applications-18.12.1.php
- Changes since 18.12.0:
* No code changes since 18.12.0

==== akonadi-contact ====
Version update (18.12.0 -> 18.12.1)
Subpackages: akonadi-contact-lang akonadi-plugin-contacts libKF5AkonadiContact5
libKF5ContactEditor5

- Update to 18.12.1
* New bugfix release
* For more details please see:
* https://www.kde.org/announcements/announce-applications-18.12.1.php
- Changes since 18.12.0:
* No code changes since 18.12.0

==== akonadi-import-wizard ====
Version update (18.12.0 -> 18.12.1)
Subpackages: akonadi-import-wizard-lang libKPimImportWizard5

- Update to 18.12.1
* New bugfix release
* For more details please see:
* https://www.kde.org/announcements/announce-applications-18.12.1.php
- Changes since 18.12.0:
* No code changes since 18.12.0

==== akonadi-mime ====
Version update (18.12.0 -> 18.12.1)
Subpackages: akonadi-mime-lang akonadi-plugin-mime libKF5AkonadiMime5

- Update to 18.12.1
* New bugfix release
* For more details please see:
* https://www.kde.org/announcements/announce-applications-18.12.1.php
- Changes since 18.12.0:
* No code changes since 18.12.0

==== akonadi-notes ====
Version update (18.12.0 -> 18.12.1)
Subpackages: akonadi-notes-lang libKF5AkonadiNotes5

- Update to 18.12.1
* New bugfix release
* For more details please see:
* https://www.kde.org/announcements/announce-applications-18.12.1.php
- Changes since 18.12.0:
* No code changes since 18.12.0

==== akonadi-search ====
Version update (18.12.0 -> 18.12.1)
Subpackages: akonadi-search-lang libKF5AkonadiSearch

- Update to 18.12.1
* New bugfix release
* For more details please see:
* https://www.kde.org/announcements/announce-applications-18.12.1.php
- Changes since 18.12.0:
* No code changes since 18.12.0

==== akonadi-server ====
Version update (18.12.0 -> 18.12.1)
Subpackages: akonadi-server-lang akonadi-server-sqlite libKF5AkonadiAgentBase5
libKF5AkonadiCore5 libKF5AkonadiPrivate5 libKF5AkonadiWidgets5 libKF5AkonadiXml5

- Update to 18.12.1
* New bugfix release
* For more details please see:
* https://www.kde.org/announcements/announce-applications-18.12.1.php
- Changes since 18.12.0:
* Ensure StandardDirs::saveDir returns existing dir
* Fix SQL syntax error in findOrphanedItems()
* Handle query prepare errors in QueryBuilder::exec
* not necessary to check twice
* Remove not necessary lines
* Allow to sort list of folder.
* Fix mem leak

==== akregator ====
Version update (18.12.0 -> 18.12.1)
Subpackages: akregator-lang

- Update to 18.12.1
* New bugfix release
* For more details please see:
* https://www.kde.org/announcements/announce-applications-18.12.1.php
- Changes since 18.12.0:
* Make sure to copy imported file from tmp to localdata directory
* Fix Bug 402132 - Make it more obvious that the search didn't find anything
(kde#402132)
* Fix Bug 402639 - akregator doesn't know how to deal with
"/tmp/mozilla_user0/0ZFsmr25.atom" (kde#402639)
* Don't crash with Qt 5.11+ (kde#371511)
- Removed patches, now upstream:
* Dont-crash-with-Qt-5.11.patch

==== ark ====
Version update (18.12.0 -> 18.12.1)
Subpackages: ark-lang libkerfuffle18

- Update to 18.12.1
* New bugfix release
* For more details please see:
* https://www.kde.org/announcements/announce-applications-18.12.1.php
- Changes since 18.12.0:
* Use more https in links
- Refreshed patches:
* lower-libarchive-minimum-version.patch

==== attica-qt5 ====
Version update (5.53.0 -> 5.54.0)
Subpackages: libKF5Attica5

- Update to 5.54.0
* New feature release
* For more details please see:
* https://www.kde.org/announcements/kde-frameworks-5.54.0.php
- Changes since 5.53.0:
* Fix providertest. exec() only once, with the right settings upfront.
* Notify if a default provider failed to download

==== baloo5 ====
Version update (5.53.0 -> 5.54.0)
Subpackages: baloo5-file baloo5-file-lang baloo5-imports baloo5-imports-lang
baloo5-kioslaves baloo5-kioslaves-lang baloo5-tools baloo5-tools-lang
libKF5Baloo5 libKF5BalooEngine5 libKF5BalooEngine5-lang

- Update to 5.54.0
* New feature release
* For more details please see:
* https://www.kde.org/announcements/kde-frameworks-5.54.0.php
- Changes since 5.53.0:
* Extend PositionCodec unit tests, better code coverage
* Move typesForMimeType helper from BasicIndexingJob to anonymous namespace
* Fix mistakes introduced in a632a72a
* Don't check if file is directory based on mime-type
* Fixed link to the coding style wiki page
* add documentation to result class
* Move internal helper from BasicIndexingJob to anonymous namespace
* Add "image/svg" as Type::Image to the BasicIndexingJob
* Minor optimization and cleanup for PositionCodec
* Avoid potential nullptr access for Document, use reference instead
* RFC: Add unit test for splitting of numbers in TermGenerator
* Use Compact json formatting for storing document metadata
* Remove unused map() getter from Result
* remove unused docId from result
* Use escaped UTF-8 sequence instead of Latin1 characters, minor cleanups
* Treat uints the same as ints
* Add unittest to check if commiting the same change twice works
* Add unit test for position DB

==== baloo5-widgets ====
Version update (18.12.0 -> 18.12.1)
Subpackages: baloo5-widgets-lang

- Update to 18.12.1
* New bugfix release
* For more details please see:
* https://www.kde.org/announcements/announce-applications-18.12.1.php
- Changes since 18.12.0:
* No code changes since 18.12.0

==== bluez-qt ====
Version update (5.53.0 -> 5.54.0)
Subpackages: bluez-qt-imports bluez-qt-udev libKF5BluezQt6

- Update to 5.54.0
* New feature release
* For more details please see:
* https://www.kde.org/announcements/kde-frameworks-5.54.0.php
- Changes since 5.53.0:
* No code changes since 5.53.0

==== breeze5-icons ====
Version update (5.53.0 -> 5.54.0)

- Update to 5.54.0
* New feature release
* For more details please see:
* https://www.kde.org/announcements/kde-frameworks-5.54.0.php
- Changes since 5.53.0:
* Change preferences-system-network to symlink
* Use a Kolf icon with nice background and shadows
* Copy some changed icons from Breeze to Breeze Dark
* Better plasma-media-center icon
* Fix gradient positions (Breeze Dark)
* Fix shadow gradients
* Better desktop icon colors
* Better multimedia related icons
* Add YaST and new preference icons
* Add a proper python-bytecode icon, use consistent color in python icons
(kde#381051)
* Delete python bytecode symlinks in preparation for them becoming their own
icons
* Make the python mimetype icon the base, and the python bytecode icon a link
to it
* Add device icons for RJ11 and RJ45 ports
* Add missing directory separator (kde#401836)
* Use correct icon for Python 3 scripts BUG: 402367 FIXED-IN: 5.54
(kde#402367)
* Change network/web color icons to consistent style
* Add new name for sqlite files, so the icons actually show up BUG: 402095
FIXED-IN: 5.54 (kde#402095)
* Add drive-* icons for YaST Partitioner
* Add view-private icon (kde#401646)
* Add flashlight action icons
* Improve symbolism for off and muted status icon (kde#398975)

==== calendarsupport ====
Version update (18.12.0 -> 18.12.1)
Subpackages: calendarsupport-lang libKF5CalendarSupport5

- Update to 18.12.1
* New bugfix release
* For more details please see:
* https://www.kde.org/announcements/announce-applications-18.12.1.php
- Changes since 18.12.0:
* No code changes since 18.12.0

==== cyrus-imapd ====
Subpackages: cyradm perl-Cyrus-IMAP perl-Cyrus-SIEVE-managesieve

- bsc#1119629 cyrus-imapd.service contains bogus User and Groupi
specification
- bsc#1115999 Please convert SysV init scripts by cyrus-imapd
into native systemd services
- Removed User and Group from the service file
- Avoid repeated emission of the %service_* boilerplate.

==== discover ====
Subpackages: discover-backend-flatpak discover-backend-packagekit discover-lang

- Don't recommend the fwupd backend for now

==== dolphin ====
Version update (18.12.0 -> 18.12.1)
Subpackages: dolphin-part dolphin-part-lang libdolphinvcs5

- Update to 18.12.1
* New bugfix release
* For more details please see:
* https://www.kde.org/announcements/announce-applications-18.12.1.php
- Changes since 18.12.0:
* fix display of image orientation
* Fix title update when changing active split view (kde#402641)
* Use https over http for homepage url
* Add failing test case for bug #402641
* Use correct icon for the "New Window" menu item

==== dragonplayer ====
Version update (18.12.0 -> 18.12.1)
Subpackages: dragonplayer-lang

- Update to 18.12.1
* New bugfix release
* For more details please see:
* https://www.kde.org/announcements/announce-applications-18.12.1.php
- Changes since 18.12.0:
* [loadview] Do not allow changing volume on scroll

==== eventviews ====
Version update (18.12.0 -> 18.12.1)
Subpackages: eventviews-lang libKF5EventViews5

- Update to 18.12.1
* New bugfix release
* For more details please see:
* https://www.kde.org/announcements/announce-applications-18.12.1.php
- Changes since 18.12.0:
* No code changes since 18.12.0

==== frameworkintegration ====
Version update (5.53.0 -> 5.54.0)
Subpackages: frameworkintegration-plugin libKF5Style5

- Update to 5.54.0
* New feature release
* For more details please see:
* https://www.kde.org/announcements/kde-frameworks-5.54.0.php
- Changes since 5.53.0:
* No code changes since 5.53.0

==== freeipmi ====
Subpackages: libfreeipmi17 libipmiconsole2 libipmidetect0 libipmimonitoring6

- Add provides:freeipmi:/usr/sbin/ipmiseld to the
freeipmi-ipmiseld split package for backward compatibility
for now

==== gcc8 ====
Version update (8.2.1+r265901 -> 8.2.1+r267546)
Subpackages: cpp8 gcc8-c++ gcc8-fortran gcc8-info gcc8-locale gcc8-objc
libasan5 libatomic1 libgcc_s1 libgcc_s1-32bit libgfortran5 libgomp1 libitm1
liblsan0 libmpx2 libmpxwrappers2 libobjc4 libquadmath0 libstdc++6
libstdc++6-32bit libstdc++6-devel-gcc8 libtsan0 libubsan1

- Update gcc44-rename-info-files.patch to adjust gnat manual
entries in the info directory. [bnc#1114592]
- Update to gcc-8-branch head (r267546).
* Includes backport of asm inline.

==== geany ====
Version update (1.33 -> 1.34.1)
Subpackages: geany-lang libgeany0

- Update to version 1.34.1:
+ Fix line breaking on existing lines.
+ Fix displaying filenames containing XML control chars inside
infobars.
+ Updated translations.
- Update to version 1.34:
+ GTK version to build against is now automatically detected.
+ Show part of the file path to show unique items in the go to
symbol popup.
+ Fix high CPU usage with the Scope plugin.
+ Update Scintilla to version 3.10.0.
+ Fix display issues on Windows with HiDPI displays.
+ Fix line breaking with multi-byte characters.
+ Update Python 3.7 keywords and PHP 7.2 tags.
+ Updated translations.

==== geany-plugins ====
Version update (1.33 -> 1.34)
Subpackages: geany-plugins-lang

- Update to version 1.34:
+ General:
- New plugin: vimode: A Vim Mode for Geany (PR #735)
- Improve Travis testsuite to run also "make distcheck"
+ Geanyctags:
- Use base path as relative to the project file path (#698, PR #755)
- Add apostrophes around generated tags file (PR #739)
+ GeanyLua:
- Update Scintilla symbols for Geany 1.34 (PR #776)
- Update glspi_keycmd.h from geany-master (PR #759)
+ Markdown:
- Port plugin to Webkit2GTK (PR #746)
+ PoHelper:
- Consider dash a separator when rewrapping messages (PR #696)
- Do not leave spaces at the start of a line when rewrapping (PR #696)
- Make sure to only replace header fields in the actual header (PR #696)
- Update X-Generator header if present (PR #696)
- Use Geany-Plugins version for the plugin (PR #696)
- Fix: for locating line breaks (PR #696)
- Fix: Properly break all multiline strings on multiple lines (PR #696)
- Fix: regular expression replacement when no matches are found
+ Scope:
- Add GTK3 support (#PR #750)
+ Updatechecker:
- On Windows, the common ca-certificates bundle is included in
- the installer for proper SSL certificate verification (PR #768)
+ Workbench:
- Add option "Expand on hover" (PR #727)
- Import base path on "Add project..."
- Allow to remove files or directories
- Support live update (PR #695, #659)
+ Internationalization:
- Updated translations: de, es, pt

==== git ====
Subpackages: git-core git-cvs git-daemon git-email git-gui git-svn git-web gitk

- Do not BuildRequire apache2:
+ it is only in the build chain for the directory ownership.
Let's just own the directories ourselves.
+ This actually also fixes the issue that installing, then
uninstalling git-web, without apache2 being present on the
machine, leaves those directories stale on the disk.

==== grantleetheme ====
Version update (18.12.0 -> 18.12.1)
Subpackages: grantleetheme-lang libKF5GrantleeTheme5

- Update to 18.12.1
* New bugfix release
* For more details please see:
* https://www.kde.org/announcements/announce-applications-18.12.1.php
- Changes since 18.12.0:
* No code changes since 18.12.0

==== gthumb ====
Subpackages: gthumb-lang

- Drop fix_double_free_dlg-contact-sheet_c.patch.
- Add
0001-contact-sheet-error-if-the-theme-file-could-not-be-l.patch:
upstream fix for bsc#1113749 / CVE-2018-18718 /
glgo#GNOME/gthumb#18.

==== gwenview5 ====
Version update (18.12.0 -> 18.12.1)
Subpackages: gwenview5-lang

- Update to 18.12.1
* New bugfix release
* For more details please see:
* https://www.kde.org/announcements/announce-applications-18.12.1.php
- Changes since 18.12.0:
* No code changes since 18.12.0

==== icecream ====
Subpackages: icecream-clang-wrappers

- Use icecream user+group instead of nonexistent icecc
in scheduler (boo#1121250)

==== incidenceeditor ====
Version update (18.12.0 -> 18.12.1)
Subpackages: incidenceeditor-lang libKF5IncidenceEditor5

- Update to 18.12.1
* New bugfix release
* For more details please see:
* https://www.kde.org/announcements/announce-applications-18.12.1.php
- Changes since 18.12.0:
* No code changes since 18.12.0

==== intel-gpu-tools ====

- U_lib-fb-Fix-rgb24-to-nv12-conversion.patch
* official upstream patch
* supersedes gcc9-fix.patch
- u_lib-fb-Fix-rgb24-to-nv12-conversion-once-more.patch
* supposed to fix patch right above (fdo#109257)
- Add gcc9-fix.patch (boo#1121229).

==== java-12-openjdk ====
Version update (12.0.0.0~16 -> 12.0.0.0~26)

- Added patch:
* loadAssistiveTechnologies.patch
+ Do not crash the whole JVM if assistive technologies crash
- Do not resolve by default the added JavaEE modules (fixes
bsc#1120431)
- Upgrade to upstream tag jdk-12+26
* Fixes:
+ S8066619: Fix deprecation warnings in java.util.jar
+ S8198526: getAnnotatedOwnerType does not handle static nested
classes correctly
+ S8202286: Allocation of old generation of Java heap on
alternate memory devices
+ S8205505: Expire and remove remaining support for commercial
features
+ S8206107: [x86_32] jck tests for ldc2_w bytecode fail
+ S8208184: IllegalArgumentException while invoking code
completion on netbeans IDE
+ S8211343: nsk_jvmti_parseoptions should handle multiple
suboptions
+ S8211424: Allocation of old generation of java heap on
alternate memory devices - Parallel GC
+ S8211425: Allocation of old generation of java heap on
alternate memory devices - G1 GC
+ S8213481: [REDO] Fix incorrect copy constructors in hotspot
+ S8214096: sun.security.util.SignatureUtil passes null
parameter, so JCE validation fails
+ S8214097: Rework thread initialization and teardown logic
+ S8214180: Need better granularity for sleeping
+ S8214201: Make PtrQueueSet completed buffer list private
+ S8214532: Update RFC 2459 references in javadoc to RFC 5280
+ S8214567: Use {@systemProperty} for definitions of system
properties
+ S8214569: Use {@systemProperty} for definitions of system
properties
+ S8214570: Use {@systemProperty} for definitions of system
properties
+ S8214687: Optimize Collections.nCopies().hashCode() and
equals()
+ S8215100: AArch64: fix compareTo intrinsic with
four-character Latin/Unicode
+ S8215202: AArch64: jtreg test
test/jdk/sun/nio/cs/FindEncoderBugs.java fails
+ S8215291: Broken links when generating from project without
modules
+ S8215296: do not disable c99 on Solaris
+ S8215322: add @file support to jaotc
+ S8215364: JavaFX crashes on Ubuntu 18.04 with Wayland while
using Swing-FX interop
+ S8215425: vmTestbase/nsk/jvmti/PopFrame should provide more
detailed output
+ S8215445: Enable building for Windows in WSL
+ S8215487: ZGC: ZRuntimeWorkers incorrectly identify
themselves as ZWorkers
+ S8215491: ICStubInterface::finalize finds zombie nmethod with
ZGC concurrent class unloading
+ S8215492: Rename INTERNAL_EMPTY to something less "internal"
+ S8215500: ICRefillVerifierMark does not set the provided
verfier as current
+ S8215516: Move JavadocTester to a named package
+ S8215547: ZGC: Fix incorrect match rule for
loadBarrierWeakSlowRegNoVec
+ S8215548: G1PeriodicGCSystemLoadThreshold needs to be a double
+ S8215551: Missing case label in nmethod::reloc_string_for()
+ S8215555: TieredCompilation C2 threads can excessively block
handshakes
+ S8215571: jdb does not include jdk.* in the default class
filter
+ S8215635: Pandoc check in Docs.gmk does not work on Windows
+ S8215687: [Graal] unit test CheckGraalIntrinsics failed after
8212043
+ S8215707: [macosx] fix pthread_getschedparam and
pthread_setschedparam calls
+ S8215716: PopFrame() was unexpectedly done
+ S8215727: Restore JFR thread sampler loop to old / previous
behavior
+ S8215759: [test] java/math/BigInteger/ModPow.java can throw
an ArithmeticException
+ S8215769: Java cannot probe pkcs12 files exported by Firefox
+ S8215879: AArch64: ReservedStackAccess may leave stack guard
in inconsistent state
+ S8215897: Build broken on zero after JDK-8211424
+ S8215898: Build broken on 32-bit after JDK-8211425
+ S8215954: [testbug] Remove unnecessary casts in
test/hotspot/gtest/threadHelper.inline.hpp
+ S8215966: GeneratePropertyPassword.sh uses bash syntax
+ S8215977: hsdis installation documentation update
- Upgrade to upstream tag jdk-12+25
* Fixes:
+ S8051349: nsk/jvmti/scenarios/sampling/SP06/sp06t003 fails in
nightly
+ S8183912: java.math.BigDecimal.movePointLeft() should return
this if called with zero argument
+ S8201655: Add thread-enabled support for the Heap Sampling
+ S8207224: Javac compiles source code despite illegal use of
unchecked conversions
+ S8209333: Socket reset issue for TLS 1.3 socket close
+ S8209414: AArch64: method handle invocation does not respect
JVMTI interp_only mode
+ S8211698: Crash in C2 compiled code during execution of
double array heavy processing code
+ S8212043: Add floating-point Math.min/max intrinsics
+ S8213134: AArch64: vector shift failed with MaxVectorSize=8
+ S8213402: [Testbug] java/lang/System/LoggerFinder/internal/
/PlatformLoggerBridgeTest creates an invalid nest relationship
+ S8213782: NullPointerException in
sun.security.ssl.OutputRecord.changeWriteCiphers
+ S8214077: test java/io/File/SetLastModified.java fails on
ARM32
+ S8214329: SwingMark SubMenus 9% regression in 12-b19 on Linux
client
+ S8214339: SSLSocketImpl erroneously wraps SocketException
+ S8214352: C1: Unnecessary "compilation bailout: block join
failed" with JVMTI
+ S8214512: ARM32: Jtreg test compiler/c2/Test8062950.java
fails on ARM
+ S8214583: AccessController.getContext may return wrong value
after JDK-8212605
+ S8214946: G1: Initialize all class members on construction
+ S8215099: jshell tool: /help representation of ctrl/meta
characters inconsistent
+ S8215205: javaVFrame much slower than vframeStream
+ S8215228: Use a constant hash table size in order to enable
compiler optimization
+ S8215292: Back out changes for node- and link- local ipv6
multicast address
+ S8215319: jck lang/INTF/intf049/intf04901 fails in Graal as
JIT mode with -Xcomp and AOTed Graal
+ S8215329: Modify ZGC requirement for
HeapMonitorThreadTest.java
+ S8215353: x86_32 build failures after JDK-8214751 (X86:
Support for VNNI Instructions)
+ S8215366: Code quality improvements in
com.sun.tools.javac.code.TypeAnnotations
+ S8215368: Make Check.checkOverride call diagnosticPositionFor
lazily
+ S8215372: Incorrect nio/file/DirectoryStream/Basic.java tests
for validating the use of a glob
+ S8215374: 32-bit build failures after JDK-8181143 (Introduce
diagnostic flag to abort VM on too long VM operations)
+ S8215380: Backout accidental change to String::length
+ S8215395: Allow null oops in Dictionary and JNIHandle
verification
+ S8215397: jsig.c missing classpath exception
+ S8215410: Regression test for JDK-8214994
+ S8215411: some GetByteArrayElements calls miss corresponding
Release
+ S8215443: The use of TransportContext.fatal() leads to bad
coding style
+ S8215449: Several tests failing when jtreg run with
- vmoption:--illegal-access=deny
+ S8215451: JNI IsSameObject should not keep objects alive
+ S8215472: (zipfs) Cleanups in implementation classes of
jdk.zipfs and tests
+ S8215625: javax/sql/testng/util/xxxxx.java tests compilation
failed after JDK-8207224
- Upgrade to upstream tag jdk-12+24
* Fixes:
+ S6516099: InputStream.skipFully(int k) to skip exactly k bytes
+ S7092821: java.security.Provider.getService() is synchronized
and became scalability bottleneck
+ S8076190: Customizing the generation of a PKCS12 keystore
+ S8152724: Sum of eden before GC and current survivor capacity
may be larger than heap size
+ S8159440: Move marking of promoted objects during initial
mark into the concurrent phase
+ S8165675: Trace event for thread park has incorrect unit for
timeout
+ S8177552: Compact Number Formatting support
+ S8181143: Introduce diagnostic flag to abort VM on too long
VM operations
+ S8193312: Rename VM_CGC_Operation to VM_G1Concurrent
+ S8198398: Test javax/swing/JColorChooser/Test6199676.java
fails in mach5
+ S8199394: Object.hashCode should not mention anything about
memory addresses
+ S8200613: SA: jstack throws UnmappedAddressException with a
CDS core file
+ S8202884: SA: Attach/detach might fail on Linux if debugee
application create/destroy threads during attaching
+ S8204947: Port ShenandoahTaskTerminator to mainline and make
it default
+ S8205393: Add SourceVersion.RELEASE_13
+ S8205394: Add source 13 and target 13 to javac
+ S8205421: AARCH64: StubCodeMark should be placed after
alignment
+ S8205516: JFR tool
+ S8205626: Start of release updates for JDK 13
+ S8205645: Bump maximum recognized class file version to 57
for JDK 13
+ S8207258: Distrust TLS server certificates anchored by
Symantec Root CAs
+ S8207829: FlightRecorderMXBeanImpl is leaking the first
classloader which calls it
+ S8208277: Code cache heap (-XX:ReservedCodeCacheSize) doesn't
work with 1GB LargePages
+ S8208648: ECC Field Arithmetic Enhancements
+ S8208698: Improved ECC Implementation
+ S8209387: Follow ups to JDK-8195100 Use a low latency
hashtable for SymbolTable
+ S8210031: implementation for JVM Constants API
+ S8210106: sun/tools/jps/TestJps.java timed out
+ S8210107: vmTestbase/nsk/stress/network tests fail with
Cannot assign requested address (Bind failed)
+ S8211034: OnStackReplacePercentage option checking has bugs
+ S8211093: Default logging.properties sets log level for
com.xyz.foo
+ S8211844: [aix] ProcessBuilder: Piping between created
processes does not work.
+ S8211882: Broken links in serialized-form.html
+ S8212137: Remove JrtFileSystem finalize method
+ S8212232: Wrong metadata for the configuration of the cutoff
for old object sample events
+ S8212657: Implementation of JDK-8204089 Promptly Return
Unused Committed Memory from G1
+ S8212703: Remove sun.java2d.fontpath property from java
launcher code
+ S8212794: IBM-964 is required for AIX default charset
+ S8213009: Refactoring existing SunMSCAPI classes
+ S8213010: Supporting keys created with certmgr.exe
+ S8213049: Invalid HTML5 in javax.swing files
+ S8213127: Refactor test/java/util/ResourceBundle/Control/
/MissingResourceCauseTest.sh to plain java tests
+ S8213183: InputMethod cannot be used after its restarting
+ S8213224: Move code related to GC threads calculation out of
AdaptiveSizePolicy
+ S8213409: Refactor sun.text.IntHashtable:i18n shell tests to
plain java tests
+ S8213421: Line number information for execution samples
always 0
+ S8213617: JFR should record the PID of the recorded process
+ S8213754: PPC64: Add Intrinsics for
isDigit/isLowerCase/isUpperCase/isWhitespace
+ S8213890: Implementation of JEP 344: Abortable Mixed
Collections for G1
+ S8213952: Relax DNSName restriction as per RFC 1123
+ S8213966: The ZGC JFR events should be marked as experimental
+ S8213983: [macosx] Keyboard shortcut ?cmd +`? stops working
properly if popup window is displayed
+ S8214002: Cannot use italic font style if the font has
embedded bitmap
+ S8214023: Update Graal
+ S8214052: [testbug] vmTestbase/vm/compiler/
/CodeCacheInfoOnCompilation - wrong shell used
+ S8214074: Ghash optimization using AVX instructions
+ S8214098: sun.security.ssl.HandshakeHash.T12HandshakeHash
constructor check backwards.
+ S8214114: Switch expressions with try-catch statements
+ S8214128: ARM32: wrong stack alignment on
Deoptimization::unpack_frames
+ S8214129: SSL session resumption/SNI with TLS1.2 causes
StackOverflowError
+ S8214148: [TESTBUG] serviceability/tmtools/jstack/
/WaitNotifyThreadTest.java is not doing what is expected
+ S8214226: Incorrect BCI and Line Number with jstack if the
top frame is in the interpreter
+ S8214257: IC cache not clean after cleaning assertion failure
+ S8214259: Implementation: JEP 189: Shenandoah: A
Low-Pause-Time Garbage Collector (Experimental)
+ S8214275: CondyRepeatFailedResolution asserts "Dynamic
constant has no fixed basic type"
+ S8214310: SymbolTable: Use get and insert
+ S8214315: G1: fatal error: acquiring lock SATB_Q_FL_lock/1
out of order with lock tty_lock/0
+ S8214338: Move IC stub refilling out of IC cache transitions
+ S8214376: Don't use memset to initialize array of Bundle in
output.cpp
+ S8214380: AwtDragSource function LoadCache misses a
ReleaseLongArrayElements in special case
+ S8214401: [AOT] crash in ClassLoaderData::is_alive() with
AOTed jdk.base
+ S8214427: probable bug in logic of
ConcurrentHashMap.addCount()
+ S8214457: Miscellaneous changes imported from jsr166 CVS
2018-12
+ S8214459: NSS source should be removed
+ S8214468: jQuery UI upgrade from 1.11.4 to 1.12.1
+ S8214491: Upgrade to JLine 3.9.0
+ S8214498: java/util/Locale/bcp47u/SystemPropertyTests.java
wrong locale default
+ S8214514: javac @file option gives error caused by Chinese
encoding in the path
+ S8214520: [TEST_BUG] sun/security/mscapi/nonUniqueAliases/
/NonUniqueAliases.java failed with incorrect jtreg tags order
+ S8214531: HeapMonitorEventOnOffTest.java test fails with
"Statistics should be null to begin with"
+ S8214559: Use {@systemProperty} for definitions of system
properties
+ S8214568: Use {@systemProperty} for definitions of system
properties
+ S8214571: -Xdoclint of array serialField gives "error: array
type not allowed here"
+ S8214688: TLS 1.3 session resumption with hello retry request
failed with "illegal_parameter"
+ S8214696: Module class should be filtered by core reflection
+ S8214707: Prevent GCC 8 from reporting error in
ClassLoader::file_name_for_class_name()
+ S8214720: Add pandoc filter to improve html man page output
+ S8214741: docs/index.html has no title or copyright
+ S8214750: Unnecessary <p> tags in jfr classes
+ S8214751: X86: Support for VNNI Instructions
+ S8214773: Replace use of thread unsafe strtok
+ S8214780: Create pandoc package for Windows
+ S8214782: Add missing access barriers on CLD handle area
+ S8214784: Adjust Dictionary and JNIHandle verification
+ S8214785: Remove unused WeakHandleType::vm_string
+ S8214786: Remove unused ThreadLocalAllocBuffer::verify()
+ S8214791: Consistently name gc files containing VM operations
+ S8214795: Add safety check to dynalink inner class lookup
+ S8214805: Mark deprecated
netscape.javascript.JSObject::getWindow API forRemoval=true
+ S8214807: Improve handling of very old class files
+ S8214817: Bad links in ImageInputStream.java &
ImageOutputStream.java
+ S8214825: Update preview language features for start of JDK 13
+ S8214840: runtime/NMT/MallocStressTest.java timed out
+ S8214850: Rename vm_operations.?pp files to vmOperations.?pp
files
+ S8214856: Errors with JSZip in web console after upgrade to
3.1.5
+ S8214857: "bad trailing membar" assert failure at
memnode.cpp:3220
+ S8214858: Improve module graph archiving
+ S8214876: Add "intermittent" key for
imageio/stream/StreamCloserLeak/run_test.sh
+ S8214892: Delayed starting of debugging via jcmd
+ S8214896: JFR Tool left files behind
+ S8214897: ZGC: Concurrent Class Unloading
+ S8214902: Pretty-printing marker annotations add unnecessary
parenthesis
+ S8214906: [TESTBUG] jfr/event/sampling/TestNative.java fails
with UnsatisfiedLinkError
+ S8214908: add ctw tests for jdk.jfr and jdk.management.jfr
modules
+ S8214910: If pandoc is present, markdown spec files should be
processed
+ S8214912: LogCompilation: Show the comp level
+ S8214915: CtwRunner misses export for jdk.internal.access
+ S8214917: CTW testlibrary shouldn't ignore errors raised by
the library itself
+ S8214925: JFR tool fails to execute
+ S8214936: assert(_needs_refill == 0) failed: Forgot to handle
a failed IC transition requiring IC stubs
+ S8214937: sun/security/tools/jarsigner/warnings/
/NoTimestampTest.java failed due to unexpected expiration date
+ S8214943: PIT: javax/swing/JFrame/NSTexturedJFrame/
/NSTexturedJFrame.java errors out in mac
+ S8214944: replace strerror by os::strerror
+ S8214961: AARCH64: wrong encoding for exclusive and atomic
load/stores
+ S8214971: Replace use of string.equals("") with isEmpty()
+ S8214972: Uses of klass_holder() except GC need to apply GC
barriers
+ S8215000: tools/launcher/JliLaunchTest.java fails on Windows
+ S8215005: Missing include of runtime/os.hpp in zError.cpp
after JDK-8214925 breaks build without precompiled headers
+ S8215008: Clear confusion between URL/URI paths and file
system paths
+ S8215015: [TESTBUG] remove unneeded -Xfuture option from tests
+ S8215026: Incorrect amount of memory unmapped with
ImageFileReader::close()
+ S8215030: Disable shenandoah in Oracle builds
+ S8215034: Remove old HOTSWAP conditionals
+ S8215043: Remove declaration of parallel_worker_threads
+ S8215048: Some classloader typos
+ S8215050: [TESTBUG] serviceability/tmtools/jstack/
/WaitNotifyThreadTest.java fails when run with flag -Xcomp
+ S8215097: Do not create NonJavaThreads before BarrierSet
+ S8215117: [JVMCI] TestResolvedJavaType.java failing after
JDK-8210031
+ S8215120: 32-bit build failures after JDK-8212657 (Promptly
Return Unused Committed Memory from G1)
+ S8215129: Update build documentation with Xrandr
+ S8215131: Pandoc 2.3/build documentation fixes
+ S8215133: AARCH64: disable Math.log intrinsic publishing
+ S8215140: Port missing crypto JMH micros from
jmh-jdk-microbenchmarks
+ S8215144: PPC64: Wrong assertion "illegal object size"
+ S8215149: TestOptionsWithRangesDynamic.java fails after
JDK-8215120
+ S8215159: Improve initial setup of system Properties
+ S8215160: Normalize spaces for remaining vmTestbase tests
+ S8215161: Normalize spaces for vmTestbase/[a-j]
+ S8215165: Improve -Xlog:class+preview message text
+ S8215175: Inconsistencies in JFR event metadata
+ S8215194: Initial size of UnicodeBlock map is incorrect
+ S8215206: VtableStubs::find_stub is not appropriately
protected by VtableStubs_lock
+ S8215217: OpenJDK source has too many swear words
+ S8215220: Simplify Shenandoah task termination in aborted
paths
+ S8215224: Update Graal
+ S8215237: jdk.jfr.Recording javadoc does not compile
+ S8215238: (jdeps) update jdk8_internals.txt per the removal
of javafx, corba, EE modules
+ S8215239: Make deletes images/jdk/bin/java if something goes
wrong
+ S8215243: JShell tests failing intermitently with \"Problem
cleaning up the following threads:\"
+ S8215262: PPC64: FMA Vectorization on PPC64
+ S8215281: Use String.isEmpty() when applicable in java.base
+ S8215284: Reduce noise induced by periodic task getFileSize()
+ S8215300: additional changes to constants API
+ S8215301: Module-summary page is unreadably wide
+ S8215304: Make target "docs-jdk-index" has unnecessary
dependencies
+ S8215309: Convert package.html files to package-info.java
files
+ S8215314: [Graal] Enable
org.graalvm.compiler.core.test.CountedLoopTest
+ S8215317: [GRAAL] unit test CheckGraalIntrinsics failed
after 8213754
+ S8215326: Test java/util/concurrent/ConcurrentHashMap/
/ToArray.java hangs after j.u.c updates
+ S8215342: [Zero] Build fails after JDK-8200613
+ S8215354: x86_32 build failures after JDK-8214074 (Ghash
optimization using AVX instructions)
+ S8215356: Disable x86_32 Shenandoah build to avoid
hotspot/tier1 failures
+ S8215362: JFR GTest JfrTestNetworkUtilization fails
+ S8215369: Jcstress pollute /var/tmp with temporary files.
+ S8215534: [testbug] some jfr test don't check @requires
vm.hasJFR
- Upgrade to upstream tag jdk-12+23
* Fixes:
+ S4947890: Minimize JNI upcalls in system-properties
initialization
+ S6849922: java/awt/Choice/ChoiceKeyEventReaction/
/ChoiceKeyEventReaction.html fails
+ S7124298: [macosx] Nothing heard from VoiceOver when tabbing
between a nestedtab group and a parent tab group.
+ S7124301: [macosx] When in a tab group if you arrow between
tabs there are noVoiceOver announcements.
+ S8130264: change the mechanism by which JDK loads the
platform-specific PrinterJob implementation
+ S8139178: Wrong fontMetrics when printing in Landscape
(OpenJDK)
+ S8146090: java/lang/ref/ReachabilityFenceTest.java fails with
- XX:+DeoptimizeALot
+ S8171426: java/lang/ProcessBuilder/Basic.java failed Stream
closed
+ S8176556: java/awt/dnd/ImageTransferTest/ImageTransferTest.java
fails for JFIF
+ S8176828: jtools do not list VM process launched with the
debugger option suspend=y
+ S8186549: move ExtendedRobot closer to tests
+ S8187364: Unable to enter zero width non-joiner (ZWNJ) symbol
in Swing text component
+ S8193577: nsk/jvmti/IterateThroughHeap/filter-tagged fails
with Graal in Xcomp mode
+ S8198339: Test javax/swing/border/Test6981576.java is unstable
+ S8206325: AssertionError in
TypeSymbol.getAnnotationTypeMetadata
+ S8206962: jlink --release-info=del throws NPE if no keys are
specified
+ S8209123: [Macosx] Maximized frame (frame state set to
MAXIMIZED_BOTH using setExtendedState) is resizable on Mac
but not on Windows and Ubuntu
+ S8210102: CDS tests timed out
+ S8210454: jar tool does not allow setting the module version
without also setting the main class
+ S8210476: sun/security/mscapi/PrngSlow.java fails with Still
too slow
+ S8210943: Hiding of inner classes not resolved properly
+ S8210985: Update the default SSL session cache size to 20480
+ S8211147: Incorrect comparator
com.sun.beans.introspect.MethodInfo.MethodOrder
+ S8211283: Miscellaneous changes imported from jsr166 CVS
2018-11
+ S8211301: [macos] support full window content options
+ S8211422: Reading PNG with corrupt CRC for IEND chunk throws
IIOException
+ S8211735: Wrong heap mapper can be selected with
UseLargePages on G1
+ S8211795: ArrayIndexOutOfBoundsException in PNGImageReader
after JDK-6788458
+ S8211833: Javadoc cleanup of java.applet package
+ S8211842: IPv6_supported wrongly returns false when unix
domain socket is bound to fd 0
+ S8211877: Broken links in java.util.concurrent.atomic
+ S8212116: IIOException "tEXt chunk length is not proper" on
opening png file
+ S8212680: (JDK12b14/Solaris-sparc)
SplashScreen::getSplashScreen call fails with ULE:
"libsplashscreen.so: ld.so.1: java: fatal: libz.so.1: open
failed: No such file or directory"
+ S8212870: Broken links for www.usno.navy.mil
+ S8212875: ftp: links for tiff/TTN2.draft.txt do not respond
+ S8212878: host in ftp: link not found
+ S8212882: links to tutorial should be updated to use https:
+ S8212899: java/util/concurrent/tck/JSR166TestCase.java -
testMissedSignal_8187947(SubmissionPublisherTest): timed out
waiting for CountDownLatch for 40 sec
+ S8213048: Invalid use of HTML5 in java.awt files
+ S8213051: Invalid use of HTML5 in javax.print files
+ S8213121: javax/swing/GraphicsConfigNotifier/StalePreferredSize.java
fails on mac10.13
+ S8213168: Enable different look and feel tests in SwingSet3
demo test FileChooserDemoTest
+ S8213187: Handle libwindowsaccessbridge need to access MSVCRT
functions
+ S8213209: [REDO] Allow Klass::_subklass and _next_sibling to
have unloaded classes
+ S8213292: Input freezes after MacOS key-selector (press&hold)
usage on macOS Mojave
+ S8213294: Upgrade IANA LSR data
+ S8213300: jaxp/unittest/transform/CR6551600Test.java fails
due to exception in jdk/jdk CI
+ S8213323: sa/TestJmapCoreMetaspace.java and
sa/TestJmapCore.java fail with ZGC
+ S8213325: (props) Properties.loadFromXML does not fully
comply with the spec
+ S8213362: [macOS] Could not find libjava.dylib error when
initializing JVM via JNI_CreateJavaVM
+ S8213406: (fs) More than one instance of built-in FileSystem
observed in heap
+ S8213532: add missing LocalFree calls after using
FormatMessage(A) [windows]
+ S8213565: Crash in DependencyContext::remove_dependent_nmethod
+ S8213583: Error while opening the JFileChooser when desktop
contains shortcuts pointing to deleted files
+ S8213614: DnD operation change feature does not work with
64bit big endian CPU
+ S8213618: IBM970 charset has missing entry and remove
unexpected entries
+ S8213703: LambdaConversionException: Invalid receiver type
not a subtype of implementation type interface
+ S8213725: JShell NullPointerException due to class file with
unexpected package
+ S8213734: SAXParser.parse(File, ..) does not close resources
when Exception occurs.
+ S8213817: @return has already been specified (4 occurrences,
in AWT and Swing)
+ S8213843: Changing L&F from Nimbus to Window L&F causes NPE
in SwingSet2
+ S8213844: Typo in ProblemList updation under JDK-8213536
+ S8214014: Remove vestiges of gopher: protocol proxy support
+ S8214026: Canonicalized archive paths appearing in diagnostics
+ S8214031: Assertion error in value break statement with
conditional operator in switch expression
+ S8214061: Buffer written into itself
+ S8214063: OpenJDK will not build on AIX while using the xlc
13.1 compiler
+ S8214170: ResourceBundle.Control.newBundle should throw
IllegalAccessException when constructor of the resource
bundle is not public.
+ S8214179: Add groupname info into keytool -list and
- genkeypair output
+ S8214195: Align stdout messages in
test/jdk/java/math/BigInteger/PrimitiveConversionTests.java
+ S8214229: Enable ShowRegistersOnAssert by default
+ S8214230: Classes generated by SystemModulesPlugin.java are
not reproducable
+ S8214231: Allow concurrent cleaning of TypeStackSlotEntries
and ReturnTypeEntry
+ S8214278: Cleanup process_completed_threshold and related
state
+ S8214300: .attach_pid files may remain in the process cwd
+ S8214302: Allow safely calling is_unloading() on zombie
nmethods
+ S8214309: Enhance makefiles to allow generating JCov
instrumented build
+ S8214311: dtrace gensrc has missing dependencies
+ S8214332: Add a flag for overriding default JNI library
search path
+ S8214344: C2: assert(con.basic_type() != T_ILLEGAL) failed:
elembt=byte; loadbt=void; unsigned=0
+ S8214356: Verification of class metadata unloading takes a
long time
+ S8214377: ZGC: Don't use memset to initialize array of
ZForwardingTableEntry
+ S8214388: CDS dumping fails with java heap fragmentation
+ S8214400: Update hotspot application/jcstress jtreg tests
wrappers to use jcstress 0.5
+ S8214408: Migrate EventsOnOff to using the same
allocateAndCheck method
+ S8214417: Add space after/before {} in
vmTestbase/nsk/jvmti/[A-I] tests
+ S8214431: tests failed because can't find jdk.testlibrary.*
in test directory or libraries
+ S8214434: Disabling ZOptimizeLoadBarriers hits assert
+ S8214443: Remove TLS v1 and v1.1 from SSLContext required
algorithms
+ S8214444: Wrong strncat limits in dfa.cpp
+ S8214445: [test] java/net/URL/HandlerLoop has illegal
reflective access
+ S8214451: PPC64/s390: Clean up unused CRC32 prototype and
function
+ S8214460: MacosX build is broken because of JDK-8214014
+ S8214462: Add serviceability/sa/ClhsdbInspect.java to
ProblemList.txt
+ S8214465: Upgrade arm-sflt minimum architecture to ARMv5TE
for assembler
+ S8214466: Append assembler flags on ARM targets
+ S8214470: PIT: javax/swing/JPopupMenu/7154841/bug7154841.java
errors out on mac10.13
+ S8214476: ZGC: Build ZGC by default
+ S8214484: ZGC: Exclude SA tests ClhsdbJhisto and
TestHeapDumpFor*
+ S8214499: SA should follow 8150689
+ S8214502: Add space after/before {} in remaining vmTestbase
tests
+ S8214513: A PKCS12 keystore from Java 8 using custom PBE
parameters cannot be read in Java 11
+ S8214522: Last runtime locking issues for concurrent class
unloading
+ S8214523: Fix nmethod asserts for concurrent nmethod unloading
+ S8214525: Bit rot in Nashorn Ant script
+ S8214526: Change CodeHeap State Analytics control from UL to
Print*
+ S8214529: Exception while using Anonymous class in switch
expression
+ S8214534: Setting of THIS_FILE in the build is broken
+ S8214541: ZGC: Refactoring from JDK-8214172 may leave
PhaseIterGVN::_delay_transform set
+ S8214552: Resolve clash between 4947890 and 8130264
+ S8214556: Crash in
DependencyContext::remove_dependent_nmethod still happens
+ S8214557: Filter out VM flags which don't affect AOT code
generation
+ S8214558: bad @run tag in CheckPrinterJobSystemProperty.java
+ S8214572: [Graal] nsk/jvmti/unit/ForceEarlyReturn/earlyretbase
should not suspend the thread when the top frame executes
JVMCI code
+ S8214710: Fix hg log in update_copyright_year.sh
+ S8214718: Update missing copyright year in build system
+ S8214726: Typo in
HeapShared::check_closed_archive_heap_region_object
+ S8214728: Unnecessary InstanceKlass::cast at few places
+ S8214744: Unnecessary <p> tags in java.util.zip.Deflater
+ S8214745: Bad link in coll-reference.html
+ S8214770: java/time/test/java/time/format/
/TestNonIsoFormatter.java failed in non-english locales.
+ S8214787: Zero builds fail with "undefined
JavaThread::thread_state()"
+ S8214794: java.specification.version should be only the major
version number
- Upgrade to upstream tag jdk-12+22
* Fixes:
+ S8046500: GetIpAddrTable function failed on Pure Ipv6
environment
+ S8150689: Thread dump report "waiting to re-lock in wait()"
shows incorrectly
+ S8168869: jdeps: localized messages don't use proper line
breaks
+ S8177286: AttributeSet: attempt to compare Qname and String
+ S8178317: Create man pages using pandoc from markdown sources
+ S8190312: javadoc -link doesn't work with http: -> https: URL
redirects
+ S8200432: javadoc fails with ClassCastException on {@link
byte[]}
+ S8202415: Incorrect time logged for monitor deflation
+ S8202621: bad test with broken links needs to be updated
+ S8203264: JNI exception pending in
PlainDatagramSocketImpl.c:740
+ S8203277: preflow visitor used during lambda attribution
shouldn't visit class definitions inside the lambda body
+ S8203442: String::transform
+ S8203672: JNI exception pending in PlainSocketImpl.c
+ S8203673: JNI exception pending in
DualStackPlainDatagramSocketImpl.c:398
+ S8204525: [TESTBUG] runtime/NMT/MallocStressTest.java ran out
of java heap
+ S8211051: jdeps usage of --dot-output doesn't provide valid
output for modular jar
+ S8211211: vmTestbase/metaspace/stressDictionary/
/StressDictionary.java timeout
+ S8211266: [TESTBUG] ZipFSTester.java failed intermittently in
ZipFSTester.checkRead(): bound must be positive
+ S8211975: move testlibrary/jdk/testlibrary/
/OptimalCapacity.java to top-level library
+ S8212108: SafepointSynchronizer never ending counter (big
enough)
+ S8212207: runtime/InternalApi/ThreadCpuTimesDeadlock.java
crashes with SEGV in pthread_getcpuclockid+0x0
+ S8212748: ZGC: Add reentrant locking functionality
+ S8213015: Inconsistent settings between JFR.configure and
- XX:FlightRecorderOptions
+ S8213117: adoptNode corrupts attribute values
+ S8213259: [AOT] AOTing java.base fails with
"java.lang.AssertionError: no fingerprint for
Ljdk/internal/event/Event"
+ S8213275: ReplaceCriticalClasses.java fails with
jdk.internal.vm.PostVMInitHook not found
+ S8213486: SIGSEGV in
CompiledMethod::cleanup_inline_caches_impl with AOT
+ S8213698: Improve devkit creation and add support for
linux/ppc64/ppc64le/s390x
+ S8213716: javadoc search not working with Japanese and
Chinese locales
+ S8213755: Let nmethods be is_unloading() outside of safepoints
+ S8213791: StringTable: Use get and insert
+ S8213819: doclint should warn against {@index} inside <a> tag
+ S8213834: JVMTI ResourceExhausted should not be posted in
CompilerThread
+ S8213845: ARM32: Interpreter doesn't call result handler
after native calls
+ S8213907: [JVMCI] avoid Class.getDeclared* methods when
converting JVMCI objects to reflection objects
+ S8213909: jdeps --print-module-deps should report missing
dependences
+ S8213911: Use example.com in java.net and other examples
+ S8213914: [TESTBUG] Several JFR VM events are not covered by
tests
+ S8213921: Use {@systemProperty} tag for properties listed in
"Networking Properties"
+ S8213927: G1 ignores AlwaysPreTouch when
UseTransparentHugePages is enabled
+ S8213944: Fix AIX build after the removal of Xrandr.h and add
a configure check for it
+ S8213956: javadoc crash using {@index} in doc-files file
+ S8213996: Remove one of the SparsePRT entry tables
+ S8213997: Remove G1HRRSUseSparseTable flag
+ S8214029: Remove dead code BasicHashtable::bulk_free_entries
+ S8214055: GC/C2 abstraction for phaseX
+ S8214056: Allow the GC to attach context information to
CompiledMethod
+ S8214057: GC/C2 abstraction for
Node::has_special_unique_user()
+ S8214059: Undefined behaviour in ADLC
+ S8214068: ZGC crashes with vmTestbase/nsk/jdi/ReferenceType/
/instances/instances004/TestDescription.java
+ S8214086: [TESTBUG] Fix subgraph test cases in
ReplaceCriticalClasses.java
+ S8214100: use of keystore probing results in unnecessary
exception thrown
+ S8214105: [TESTBUG] Bit test is always false in
serviceability/jvmti/StartPhase/AllowedFunctions
+ S8214108: [TESTBUG] Incorrect Function parameter lists in
vmTestbase/nsk/jvmti/scenarios/extension/EX03/ex03t001
+ S8214113: Switch expressions may have constant type and may
be skipped during write
+ S8214118: HeapRegions marked as archive even if CDS mapping
fails
+ S8214139: Remove wrapper methods from {Base,Html}Configuration
+ S8214151: [TESTBUG] CleanProtectionDomain.java fails due to
RuntimeException: 'protection domain unlinked' missing
+ S8214161: java.lang.IllegalAccessError: class
jdk.internal.event.X509CertificateEvent (in module java.base)
cannot access class jdk.jfr.internal.handlers.EventHandler
(in module jdk.jfr) because module java.base does not read
module jdk.jfr
+ S8214172: GC interface entry points for loop opts
+ S8214181: safepoint header cleanup
+ S8214189: test/hotspot/jtreg/compiler/intrinsics/mathexact/
/MulExactLConstantTest.java fails on Windows x64 when run
with -XX:-TieredCompilation
+ S8214202: DirtyCardQueueSet::get_completed_buffer should not
clear _process_completed
+ S8214205: PPC64: Add instructions for counting trailing zeros
+ S8214206: Fix for JDK-8213419 is broken on 32-bit
+ S8214208: Nestmate package validation logging/exception
should include classloader information
+ S8214217: [TESTBUG] runtime/appcds/LotsOfClasses.java failed
with fragmented heap
+ S8214223: tools/jdeps/listdeps/ListModuleDeps.java failed due
to missing Lib2 file
+ S8214241: Problem list com/sun/jndi/ldap/LdapTimeoutTest.java
for all platforms
+ S8214242: compiler/arguments/TestScavengeRootsInCode.java
fails because of missing UnlockDiagnosticVMOptions
+ S8214262: SunEC native code does not compile with debug on
+ S8214272: Don't use memset to initialize arrays of
MemoryUsage in memoryManager.cpp
+ S8214276: Problemlist
compiler/intrinsics/mathexact/MulExactLConstantTest.java
+ S8214287: SpecJbb2005StressModule got uncaught exception
+ S8214295: Populate handlers while holding streamHandlerLock
+ S8214297: testbug : missing fclose in jvmti_aod.cpp
+ S8214321: Misleading code in SSLCipher
+ S8214343: Handle the absence of Xrandr more generically
+ S8214362: C2: gc interface entry point for split if
+ S8214373: adjust usage of ReleaseLongArrayElements in
MacosxDebuggerLocal
- Upgrade to upstream tag jdk-12+21
* Fixes:
+ S8061281: Microbenchmark suite build support, directory
layout and sample benchmarks
+ S8061282: Migrate jmh-jdk-microbenchmarks into the JDK
+ S8129310: java/net/Socket/asyncClose/AsyncClose.java fails
intermittently
+ S8148188: Enhance the security libraries to record events of
interest
+ S8184205: Captions on tabbed tables are squashed together
+ S8191339: [JVMCI] BigInteger compiler intrinsics on Graal
+ S8201375: Add the AllowArchivingWithJavaAgent diagnostic vm
option to allow the use of the -javaagent option during CDS
dumping
+ S8203174: [Graal] JDI tests fail with Unexpected exception:
com.sun.jdi.ObjectCollectedException
+ S8206475: Repeated word in error message
+ S8209923: Unicode 11.0.0.
+ S8210024: JFR calls virtual is_Java_thread from ~Thread()
+ S8210408: Refactor java.util.ResourceBundle:i18n shell tests
to plain java tests
+ S8210722: JAXP Tests: CatalogSupport2 and CatalogSupport3
generate incorrect messages upon failure
+ S8210742: compound var declaration type is not uniform for
all variables
+ S8210777: Update Graal
+ S8210838: Override javax.crypto.Cipher.toString()
+ S8211106: [windows] Update OS detection code to recognize
Windows Server 2019
+ S8211326: add OS user related information to hs_err file
+ S8211451: ~2.5% regression on compression benchmark starting
with 12-b11
+ S8211787: javax/net/ssl/TLSCommon/TLSTest.java throws
java.net.SocketTimeoutException: Read timed out
+ S8212003: Deprecating the default keytool -keyalg option
+ S8212070: Introduce diagnostic flag to abort VM on failed JIT
compilation
+ S8212682: Avoid holding Compile_lock when blocking for GC in
ObjArrayKlass::allocate_objArray_klass()
+ S8212779: ADL Parser does not check allocation return values
in all cases
+ S8212931: HeapMonitorStatIntervalTest.java fails due average
calculation
+ S8212982: Rule cases in switch expression accepted even if
complete normally
+ S8212992: Change mirror accessor in Klass::verify_on() to use
AS_NO_KEEPALIVE
+ S8213033: Archive remaining primitive box caches
+ S8213092: Add more runtime locks for concurrent class
unloading
+ S8213202: Possible race condition in TLS 1.3 session
resumption
+ S8213235: java/nio/channels/SocketChannel/
/AsyncCloseChannel.java fails with threads that didn't exit
+ S8213352: Separate BufferNode allocation from PtrQueueSet
+ S8213363: X25519 private key PKCS#8 encoding/decoding is
incorrect
+ S8213373: Bulk MarkBitMap clearing methods
+ S8213410: UseCompressedOops requirement check fails fails on
32-bit system
+ S8213419: C2 may hang in MulLNode::Ideal()/MulINode::Ideal()
with gcc 8.2.1
+ S8213538: VM crashes when MaxVectorSize is set to 0, 1 or 2
+ S8213560: gtests might hang
+ S8213587: Speed up CDS dump time by using resizable hashtables
+ S8213615: GC/C2 abstraction for escape analysis
+ S8213616: URLPermission with query or fragment behaves
incorrectly
+ S8213623: ZGC: Let heap iteration walk all roots
+ S8213713: Minor issues during
MetaspaceShared::initialize_runtime_shared_and_meta_spaces
+ S8213721: [Graal] Tests vmTestbase/nsk/stress/except/except*
may be encountering SEGV during out-of-memory conditions
+ S8213723: More Monitor/mutex initialization management
+ S8213736: Build fails with LOG=debug on F28 after JDK-8210958
+ S8213746: GC/C2 abstraction for C2 matcher
+ S8213751: ClassLoaderDataGraph::cld_do() should sometimes
require CLDG_lock
+ S8213779: Loop opts anti dependent store detection should
ignore uncommon trap calls
+ S8213794: ARM32: disable TypeProfiling, CriticalJNINatives,
Serviceablity tests for ARM32
+ S8213829: Remove circular dependency between g1CollectedHeap
and g1ConcurrentMark
+ S8213893: StringTable_lock is unused
+ S8213898: CDS dumping of springboot asserts in
G1ArchiveAllocator::alloc_new_region
+ S8213902: com/sun/jdi/SetLocalWhileThreadInNative.java times
out
+ S8213906: Update arm devkits with libXrandr headers
+ S8213908: AssertionError in DeferredAttr at setOverloadKind
+ S8213910: Invalid HTML in java.net.http.HttpClient
+ S8213913: Redundant HTML in java.se/module-info.java
+ S8213916: no copyright in signature.html
+ S8213920: Use {@systemProperty} tag for properties listed in
System.getProperties
+ S8213922: fix ctw stand-alone build
+ S8213926: WB_EnqueueInitializerForCompilation requests
compilation for NULL
+ S8213942: URLStreamHandler initialization race
+ S8213947: ARM32: failed check_simd should set
UsePopCountInstruction to false
+ S8213948: Solaris-X64 build fails with compact hashtable
+ S8213959: add org.graalvm.compiler.replacements.test.
StringCompressInflateTest to graal problem list
+ S8213992: Rename and make DieOnSafepointTimeout the
diagnostic option
+ S8214003: Limit default test jobs based on memory size
+ S8214004: Missing space between compiler thread name and task
info in hs_err
+ S8214007: Fix sun.awt.nativedebug on X11 platforms
+ S8214025: assert(t->singleton()) failed: must be a constant
when ScavengeRootsInCode < 2
+ S8214027: Reinstate testB_mem_imm pattern in x86_64.ad
+ S8214045: Missing explicit dependencies of
build-microbenchmark cause intermittent build failure
+ S8214062: JDK-8167368 Leftover: get_source.sh in build
documentation
+ S8214071: Broken msg.bug diagnostics when using the compiler
API
+ S8214075: [BACKOUT] 8214007: Fix sun.awt.nativedebug on X11
platforms
+ S8214078: (fs) SecureDirectoryStream not supported on arm32
+ S8214120: [REDO] Fix sun.awt.nativedebug on X11 platforms
+ S8214124: [TESTBUG] Bugs in runtime/NMT/MallocStressTest.java
+ S8214125: [test] Fix comparison between pointer and integer
in test_ptrQueueBufferAllocator.cpp
+ S8214144: Remove confusing locking_enqueue_completed_buffer
+ S8214149: Move out assignments when not using NSK*VERIFY
macros
+ S8214154: problem list HeapMonitorStatIntervalTest.java
- Upgrade to upstream tag jdk-12+20
* Fixes
+ S5076751: System properties documentation needed in javadocs
+ S7124293: [macosx] VoiceOver reads percentages rather than
the actual values for sliders.
+ S8080406: VM_GetOrSetLocal doesn't check local slot type
against requested type
+ S8160768: Add capability to custom resolve host/domain names
within the default JNDI LDAP provider
+ S8185496: Improve performance of system properties
initialization in initPhase1
+ S8192888: AllSwingComponentsBaselineTest fails with
NullPointerException for NimbusLookAndFeel
+ S8198000: java/awt/List/EmptyListEventTest/
/EmptyListEventTest.java debug assert on Windows
+ S8198001: java/awt/Menu/WrongParentAfterRemoveMenu/
/WrongParentAfterRemoveMenu.java debug assert on Windows
+ S8198002: java/awt/Mixing/Validating.java debug assert on
Windows
+ S8198321: javax/swing/JEditorPane/5076514/bug5076514.java
fails
+ S8198624: java/awt/KeyboardFocusmanager/TypeAhead/
/SubMenuShowTest/SubMenuShowTest.html fails on mac
+ S8199072: Test javax/swing/GroupLayout/6613904/bug6613904.java
is unstable
+ S8202285: (fs) Add a method to Files for comparing file
contents
+ S8202886: [macos] Test
java/awt/MenuBar/8007006/bug8007006.java fails on MacOS
+ S8204142: AWT hang occurs when sequenced events arrive out of
sequence in multiple AppContexts
+ S8204529: gc/TestAllocateHeapAtMultiple.java fail with Agent
7 timed out
+ S8205574: Loop predication "assert(f <= 1 && f >= 0) failed
Incorrect frequency"
+ S8207070: Webstart app popup on wrong screen in a one-screen
setup changing to multi-monitor
+ S8208543: [macos] Support for apple.awt.documentModalSheet
incomplete
+ S8208702: javax/swing/reliability/
/HangDuringStaticInitialization.java may hang on macos
+ S8209055: c.s.t.javac.code.DeferredCompletionFailureHandler
seems to use WeakHashMap incorrectly
+ S8209139: globalCounter bootstrap issue
+ S8209415: Fix JVMTI test failure HS202
+ S8210057: Enable different look and feels in SwingSet3 demo
test InternalFrameDemoTest
+ S8210197: javac can't tell during speculative attribution if
a diamond expression is creating an anonymous inner class or
not
+ S8210493: Bind to node- or linklocal ipv6 multicast address
fails
+ S8210776: Upgrade X Window System 6.8.2 to the latest XWD
1.0.7
+ S8210803: Compilation failure in codeBlob.cpp for Windows
32-bit
+ S8210863: Remove Xrandr include files from JDK sources
+ S8210886: Remove references in xwindows.md to non-existent
files.
+ S8211403: Rename SafepointMechanism::poll(...)
+ S8211435: Exception in thread "AWT-EventQueue-1"
java.lang.IllegalArgumentException: null source
+ S8211443: Enable different look and feels in SwingSet3 demo
test SplitPaneDemoTest
+ S8211450: UndetVar::dup is not copying the kind field to the
duplicated instance
+ S8211727: Adjust default concurrency settings for running
tests on Sparc
+ S8211781: re-building fails after changing Graal sources
+ S8211810: X11 Time stamp data should be unsigned
+ S8211822: Some tests fail after JDK-8210039
+ S8211845: A new switch to control verbosity of hs-err files
+ S8211926: Catastrophic size_t underflow in BitMap::*_large
methods
+ S8211951: Broken links in java.management files
+ S8211992: GraphicsConfiguration.getDevice().getDisplayMode()
causes JVM crash on Mac
+ S8212221: GraalUnitTestLauncher should generate
MX_SUBPROCESS_COMMAND_FILE
+ S8212261: Add SSLSession accessors to HttpsURLConnection and
SecureCacheResponse
+ S8212673: jtreg/applications/runthese/RunThese30M.java fails
in C2 with "assert(!had_error) failed: bad dominance"
+ S8212735: Compilation issue with javax.swing.InputVerifier
example in javadoc section
+ S8212790: Javadoc cleanup of java.awt.color package
+ S8212865: Broken external link to TIFF6.pdf in ImageIO
package-info.java
+ S8212885: TLS 1.3 resumed session does not retain peer
certificate chain
+ S8212903: [TestBug] Tests test/jdk/javax/swing/LookAndFeel/
/8145547/DemandGTK2.sh and DemandGTK3.sh fail on Ubuntu 18.04
LTS
+ S8212928: Assertion too strict in
compiledVFrame::update_deferred_value on SPARC
+ S8212939: Add space after if/while/for/switch and parenthesis
+ S8213113: Dead code related to UseAdaptiveSizePolicy in
ParNewGeneration
+ S8213116: javax/swing/JComboBox/WindowsComboBoxSize/
/WindowsComboBoxSizeTest.java fails in Windows
+ S8213130: Update ProblemList after verification of jtreg
tests in Win 7
+ S8213137: Remove static initialization of monitor/mutex
instances
+ S8213138: Update ProblemList.txt for mac
+ S8213154: Update copyright headers of files in src tree that
are missing Classpath exception
+ S8213181: Updation of ProblemList.txt for removal of passing
swing test
+ S8213189: Make restricted headers in HTTP Client configurable
and remove Date by default
+ S8213199: GC abstraction for
Assembler::needs_explicit_null_check()
+ S8213213: Remove src/java.desktop/unix/classes/sun/awt/X11/
/keysym2ucs.h
+ S8213250: CDS archive creation aborts due to metaspace object
allocation failure
+ S8213261: test javax/swing/plaf/nimbus/
/AllSwingComponentsBaselineTest.java fails
+ S8213307: G1 should clean up RMT with
ClassUnloadingWithConcurrentMark
+ S8213338: Reduce the number of generated make targets
+ S8213346: Re-implement shared dictionary using
CompactHashtable
+ S8213348: jdk.internal.vm.compiler.management service
providers missing in module descriptor
+ S8213383: Wrap up pthread_cond_wait into a loop to workaround
potential spurious wakeups
+ S8213400: Support choosing group name in keytool keypair
generation
+ S8213411: JDK-8209189 incorrect for Big Endian (JVM crashes)
+ S8213418: Socket/ServerSocket supportedOptions does not work
with custom SocketImpl
+ S8213424: VersionProps duplicate and skipped initialization
+ S8213428: Add a no precompiled header Linux build to
builds-tier1 and jdk-submit
+ S8213436: Obsolete UseMembar
+ S8213438: Remove ClearResponsibleAtSTW
+ S8213439: Run class initialization for boot loader classes
with registered subgraph archiving entry field during CDS
dump time.
+ S8213440: Lingering INCLUDE_ALL_GCS in
test_oopStorage_parperf.cpp
+ S8213473: Replace testB_mem_imm matcher with testUB_mem_imm
+ S8213478: Reduce rebinds when applying repeated filters and
conversions
+ S8213479: Missing x86_64.ad patterns for 8-bit logical
operators with destination in memory
+ S8213480: update internal ASM version to 7.0
+ S8213489: GC/C2 abstraction for
Compile::final_graph_reshaping()
+ S8213490: Networking area typos and inconsistencies cleanup
+ S8213515: Improve freetype detection on
linux/ppc64/ppc64le/s390x
+ S8213525: new unit test GetLocalVariable/LocalVars is not
stable
+ S8213527: [testbug] Fix PrintMetaspaceDcmd test using
UseCompressedOops for 32-bit.
+ S8213536: Update ProblemList for Linux
+ S8213563: appcds/sharedStrings/SharedStringsStress.java fails
with 'GC triggered before VM initialization completed' error
+ S8213568: Typo in
java/awt/GraphicsEnvironment/LoadLock/GE_init5.java
+ S8213569: Bump minimum boot jdk to JDK 11
+ S8213570: [TESTBUG] Update JFR sanity test set
+ S8213574: Deadlock in string table expansion when dumping
lots of CDS classes
+ S8213576: Make test AsyncCloseChannel.java run in othervm
+ S8213588: compiler/graalunit/HotspotTest.java fails after
8213348 / 8211781 were pushed
+ S8213591: running bin/idea.sh in Cygwin: generated project
cannot be imported
+ S8213592: Misaligned code in globals.hpp after 8211845
+ S8213596: test failure with Graal when security manager and
policy file are used
+ S8213604: Fix missing includes after JDK-8212673
+ S8213622: Windows VS2013 build failure - "'snprintf':
identifier not found"
+ S8213694: Test Timeout.java should run in othervm mode
+ S8213701: Add org.graalvm.compiler.debug.test.TimerKeyTest to
problem list
+ S8213704: increase default timeout for
vmTestbase/metaspace/stressDictionary/StressDictionary.java
+ S8213707: [TEST] vmTestbase/nsk/stress/except/except011.java
failed due to wrong class name
+ S8213708: Different #ifdef guards cause incorrect use of
Monitor::check_block_state()
+ S8213709: jdk/javadoc/doclet/testValueTag/
/TestValueTagInModule.java missing modules declaration
+ S8213711: Zero build broken after JDK-8213199 (GC abstraction
for Assembler::needs_explicit_null_check())
+ S8213718: [TEST] Wrong classname in
vmTestbase/nsk/stress/except/except002 and except003
+ S8213741: Consolidate Object and String Stringifiers
+ S8213745: Don't use memset to initialize array of RegMask in
matcher.cpp
+ S8213760: os::obsolete_option is obsolete and should be
removed
+ S8213767: Remove the -Xconcurrentio flag and associated code
+ S8213795: Force explicit null check on patching placeholder
offset
+ S8213814: build error in jtreg test jvmti/GetLocalVariable
+ S8213818: @return has already been specified
+ S8213820: unknown tag: @returns
+ S8213826: Disable ARMv6 memory barriers on ARMv5 processors
- Upgrade to upstream tag jdk-12+19
* Fixes:
+ S6304578: (reflect) toGenericString fails to print bounds of
type variables on generic methods
+ S6735527: Bitmap - speed up searches
+ S8152988: [AOT] Update test batch definitions to include
aot-ed java.base module mode into hs-comp testing
+ S8177708: Convert TestReserveMemorySpecial_test to Gtest
+ S8177711: Convert TestVirtualSpaceNode_test to GTest
+ S8198294: AARCH64 - Set flags' optimal defaults for Cavium
Thunder X2 CPU
+ S8204521:
compiler/jsr292/RedefineMethodUsedByMultipleMethodHandles.java
fails trying to delete temp file
+ S8206330: Revisit com/sun/jdi/RedefineCrossEvent.java
+ S8207059: Update test certificates in QuoVadisCA.java test
+ S8208519: Remove rehashable hashtable
+ S8209189: Make CompiledMethod::do_unloading more concurrent
+ S8209495: NMethodSweeper::sweep_code_cache cause severe delays
+ S8209564: runtime/appcds/CDSandJFR.java timeout on tier6 on
sparc
+ S8209835: Aarch64: elide barriers on all volatile operations
+ S8209960: -Xlog:jfr* doesn't work with the JFR
+ S8210405: Javadoc search doesn't always consider full input
upon Enter
+ S8210409: Refactor java.util.TimeZone:i18n shell tests to
plain java tests
+ S8210986: Add OopStorage cleanup to ServiceThread
+ S8211013: [TESTBUG] nsk/jdb/kill/kill002 wait for message and
prompt
+ S8211049: Second parameter of "initialize" method is not used
+ S8211122: Reduce the number of internal classes made
accessible to jdk.unsupported
+ S8211320: Aarch64: unsafe.compareAndSetByte() and
unsafe.compareAndSetShort() c2 intrinsics broken with negative
expected value
+ S8211336: [TESTBUG] appcds tests with incorrect usage of
- XX:+UseStringDeduplication
+ S8211339: NPE during SSL handshake caused by HostnameChecker
+ S8211382: ISO2022JP and GB18030 NIO converter issues
+ S8212184: Incorrect oop ref strength used for referents in
FinalReference
+ S8212217: JGSS: Don't dispose() of creds too eagerly
+ S8212243: More gc interface tweaks for arraycopy
+ S8212585: Clean up CompiledMethod::oops_reloc_begin()
+ S8212605: Pure-Java implementation of
AccessController.doPrivileged
+ S8212610: Fix handling of memory in
PhaseIdealLoop::clone_loop_predicates()
+ S8212669: Add note to Cipher javadoc about using full
transformation and not relying on defaults
+ S8212681: Refactor IC locking to use a fine grained
CompiledICLocker
+ S8212828: (process) Provide a way for Runtime.exec to use
posix_spawn on linux
+ S8212871: Broken links give 401-Unauthorized
+ S8212872: Broken link to Namespaces in XML Errata
+ S8212876: ftp: links for character-sets require a login
password
+ S8212883: Setting a double manageable flag with jcmd/jinfo
crashes the JVM
+ S8212921: ZGC: Move verification to after resurrection
unblocked
+ S8212934: [JVMCI] do not propagate resolution error in
HotSpotResolvedJavaFieldImpl.getType
+ S8212937: Parent class loader may not have a referred
ClassLoaderData instance when obtained in
Klass::class_in_module_of_loader
+ S8212989: Allow CompiledMethod ExceptionCache have unloaded
klasses
+ S8212995: Placing the Integer.IntegerCache and cached Integer
objects in the closed archive heap region.
+ S8212996: Use AS_NO_KEEPALIVE when accessing dead
java.lang.invoke.CallSites during nmethod unloading
+ S8213000: Obsolete the IgnoreUnverifiableClassesDuringDump vm
option
+ S8213014: Crash in CompileBroker::make_thread due to OOM
+ S8213046: Define Japanese new Era character
+ S8213052: HTML errors in JPDA spec
+ S8213058: remove ExecuteInternalVMTests and
VerboseInternalVMTests flags
+ S8213085: (tz) Upgrade time-zone data to tzdata2018g
+ S8213103: RoundEnvironment.getElementsAnnotatedWith(Class)
crashes with -source 8
+ S8213196: [ppc] [s390]: prepare code for gcc7.3.1 warning
(int-in-bool-context)
+ S8213203: [JVMCI] adopt formatting changes from jvmci 8
+ S8213210: Change ServerSocket(SocketImpl impl) constructor to
protected access
+ S8213227: Update jib src excludes to filter webrev and Jreg
directories
+ S8213236: A partial removed/deleted JavaThread cannot
transition
+ S8213237: Remove test-compile-commands from jib-profiles.js
+ S8213245: Restoring nsk/jvmti/scenarios/hotswap tests from
ProblemList.txt
+ S8213246: Fix typo in vmTestbase failuire to failure
+ S8213256: Clarify runtime vs compile time annotations for
RoundEnvironment.getElementsAnnotatedWith(Class)
+ S8213263: fix legal headers in test/langtools
+ S8213265: fix missing newlines at end of files
+ S8213296: Fix legal headers in test/jdk/java/net
+ S8213301: Fix legal headers in jdk logging tests
+ S8213305: Fix legal headers in test/java/math
+ S8213306: Fix legal headers in test/java/nio
+ S8213308: ProblemList runtime/appcds/jigsaw/classpathtests/
/EmptyClassInBootClassPath.java
+ S8213321: Fix legal headers in test/jaxp
+ S8213328: Update test copyrights in test/java/util/zip and
test/jdk/tools
+ S8213330: Fix legal headers in i18n tests
+ S8213337: windows-x64-slowdebug build is broken by 8177708
+ S8213339: Update precompiled.hpp with headers based on
current frequency
+ S8213347: [JVMCI] remove use of reflection in JVMCI
+ S8213366: (fs) avoid handle leak in
Java_sun_nio_fs_WindowsNativeDispatcher_FindFirstFile0
+ S8213371: GC/C2 abstraction and cleanup to handle custom
offset for GC memory accesses
+ S8213381: Hook to allow GC to inject Node::Ideal() calls
+ S8213384: Move G1/C2 barrier verification into G1BarrierSetC2
+ S8213414: Fix incorrect copy constructors in hotspot
+ S8213444: Missing emphasis for term being defined
+ S8213464: Fix missing include after JDK-8212243
+ S8213469: Remove/fix leftovers from JDK-8213384: Move G1/C2
barrier verification into G1BarrierSetC2
+ S8213487: [BACKOUT] 8213414 Fix incorrect copy constructors
in hotspot
- Upgrade to upstream tag jdk-12+18
* Fixes:
+ S6490394: G1: Allow heap shrinking / memory unmapping after
reclaiming regions during Remark
+ S8017061: os_bsd.cpp contains code for UseSHM and UseHugeTLBFS
+ S8021335: Missing synchronization when reading counters for
live threads and peak thread count
+ S8024368: private methods are allocated vtable slots
+ S8071913: Filter out entries to free/uncommitted regions
during iteration
+ S8157728: Convert GCTimer_test to GTest
+ S8164546: Convert DirectivesParser_test to GTest
+ S8177710: Convert TestMetaspaceUtils_test to GTest
+ S8177899: Tests fail due to code cache exhaustion on machines
with many cores
+ S8192864: defmeth tests can hide failures
+ S8195627: [Graal] nsk/jdi/VirtualMachine/redefineClasses/
/redefineclasses026 hangs with Graal in Xcomp mode
+ S8198945: Invalid RuntimeVisibleTypeAnnotations for
annotation on anonymous class type parameter
+ S8203629: Produce events in the JDK without a dependency on
jdk.jfr
+ S8203953: Rename SystemDictionary::load_shared_class(Symbol*,
Handle, TRAPS) to load_shared_boot_class().
+ S8205327: Clean up #if INCLUDE_CDS in classLoaderExt.cpp and
classLoaderExt.hpp
+ S8205476: KeyAgreement#generateSecret is not reset for ECDH
based algorithm
+ S8209093: JEP 340: One AArch64 Port, Not Two
+ S8209566: [TESTBUG] runtime/appcds/jigsaw/modulepath/
/JvmtiAddPath.java timeout on tier6 on sparc
+ S8209598: Clean up how messages are printed when CDS aborts
start-up
+ S8209768: Refactor java/util/prefs/CheckUserPrefsStorage.sh
to plain java test
+ S8210242: vmTestbase/nsk/stress/jni/jnistress001.java crashes
with EXCEPTION_ACCESS_VIOLATION on windows-x86
+ S8210244: {@value} should be permitted in module documentation
+ S8210808: jshell tool: only considers the first snippet of
the external editor
+ S8210837: Add libXrandr-devel to the Linux devkits
+ S8210853: JIT: C2 doesn't skip post barrier for new allocated
objects
+ S8210908: Refactor java/util/prefs/PrefsSpi.sh to plain java
test
+ S8210958: Rename "make run-test" to "make test"
+ S8211388: Make OtherRegionsTable independent of the region it
is for
+ S8211694: JShell: Redeclared variable should be reset
+ S8211743: [AOT] crash in ScopeDesc::decode_body() when JVMTI
walks AOT frames
+ S8211883: Disable anon and NULL cipher suites
+ S8212081: AnnotatedType.toString implementation don't print
annotations on embedded types
+ S8212129: Remove finalize methods from
java.util.zip.ZipFIle/Inflator/Deflator
+ S8212151: jdi/ExclusiveBind.java times out due to "bind
failed: Address already in use" on Solaris-X64
+ S8212154: [TESTBUG] CheckArchivedModuleApp fails with NPE
when JVMCI is absent
+ S8212173: Thread._stack_base/_stack_size initialized too late
for new threads
+ S8212200: assert when shared java.lang.Object is redefined by
JVMTI agent
+ S8212205: VM asserts after CDS archive has been unmapped
+ S8212481: PPC64: Enable POWER9 CPU detection
+ S8212624: remove outdated entries from langtools problem list
+ S8212694: Using Raw String Literals with align() and
Integer.MIN_VALUE causes out of memory error
+ S8212738: Incorrectly named signature scheme
ecdsa_secp512r1_sha512
+ S8212766: TestPromotionEventWithG1.java failed due to
"RuntimeException: PLAB size is smaller than object size."
+ S8212770: Remove spaces before/after () for
vmTestbase/jvmti/[s-u]
+ S8212795: ThreadInfoCompositeData.toCompositeData fails to
map ThreadInfo to CompositeData
+ S8212827: GlobalCounter should support nested critical
sections
+ S8212866: Broken link to schematron.com
+ S8212867: Link to DRBG test vectors is redirected to a broken
link
+ S8212877: Restore JTREG_VERBOSE value for mach5 testing
+ S8212880: Cannot access ftp: site for fdlibm.tar
+ S8212884: Remove the assignments in ifs for vmTestbase/[a-s]
+ S8212897: Some improvements in the EditorPaneDemotest
+ S8212911: Unify and micro-optimize handling of
non-in-collection set references in oop closures
+ S8212926: HttpClient does not retrieve files with large sizes
over HTTP/1.1
+ S8212933: Thread-SMR: requesting a VM operation whilst
holding a ThreadsListHandle can cause deadlocks
+ S8212941: Loosen the range of JapaneseEra
+ S8212948: Remove unused jdk.internal.misc.VMNotification
interface
+ S8212956: [JVCMI] SpeculationReason should maintain identity
+ S8212958: Allow Klass::_subklass and _next_sibling to have
unloaded classes
+ S8212974: Update RS Skipped cards uses wrong enum to register
to phase
+ S8212978: Add RedefineMethodUsedByMultipleMethodHandles.java
to problem list
+ S8212994: Links to Oracle websites should use "https:"
+ S8212997: [TESTBUG] Remove defmeth tests for class file
versions 50 and 51
+ S8213005: Missing symbols in hs_err files on Windows after
JDK-8212028
+ S8213007: Update the link in
test/jdk/sun/security/provider/SecureRandom/DrbgCavp.java
+ S8213017: jspawnhelper: need to handle pipe write failure
when sending return code
+ S8213035: Pack MethodHandleInlineStrategy coder and length
into a long
+ S8213043: Add internal Unsafe xxxObject methods as jsr166 is
broken
+ S8213056: Nested anchor tags in java.lang.module
+ S8213086: Compiler thread creation should be bounded by
available space in memory and Code Cache
+ S8213100: fix test OptionSmokeTest before removing it from
the problem list
+ S8213102: Oracle Unilinks are [301 Moved Permanently] to
https://docs.oracle.com
+ S8213107: Make ClassLoaderDataGraph iterator skip unloaded
CLDs
+ S8213142: Use RAII to set the scanning source in
G1ScanEvacuatedObjClosure
+ S8213148: JDK build fails because of missing #includes
+ S8213151: [AIX] Some class library files are missing the
Classpath exception
+ S8213172: CDS and JFR tests fail with
assert(JdkJfrEvent::is(klass)) failed: invariant
+ S8213182: Minimal VM build failure after JDK-8212200 (assert
when shared java.lang.Object is redefined by JVMTI agent)
+ S8213184: Revert change in jib-profiles.js from
run-test-prebuilt to test-prebuilt
+ S8213204: ReservedStackTest and ReservedStackTestCompiler
tests fail on windows
+ S8213211: [BACKOUT] Allow Klass::_subklass and _next_sibling
to have unloaded classes
- Upgrade to upstream tag jdk-12+17
* Fixes:
+ S6821316: comment in source code of SynthStyleFactory.java
has a self-reference
+ S6828982: UIDefaults.getUI swallows original exception
+ S6994403: Grammatical error in documentation of
javax.swing.GroupLayout.ParallelGroup
+ S8014503: AWT Choice implementation should be made consistent
across platforms.
+ S8061359: [macosx] Checkbox toggles on Space press but does
not spoken by Voice Over
+ S8133713: [macosx] Accessible JTables always reported as empty
+ S8150552: Remove -XX:+AggressiveOpts
+ S8171097: Convert TestReservedSpace_test to Gtest
+ S8177709: Convert TestVirtualSpace_test to GTest
+ S8182041: File Chooser Shortcut Panel folders under on JDK 9
8062648: FileSystemView.getDefaultDirectory() should check
read access on Unix systems
+ S8195793: Remove GTE CyberTrust Global Root
+ S8199567: [Nestmates] Cleanup instanceKlass.cpp
+ S8200151: Add 8 JNDI tests to com/sun/jndi/dns/ConfigTests/
+ S8201355: Avoid native memory allocation in
sun.security.mscapi.PRNG.generateSeed
+ S8203281: [Windows] JComboBox change in ui when
editor.setBorder() is called
+ S8207146: Rename jdk.internal.misc.Unsafe::xxxObject to
xxxReference
+ S8208542: Add 4 JNDI tests to com/sun/jndi/dns/ListTests/
+ S8208595: [parfait] Better X11 font support
+ S8208638: Instead of circle rendered in appl window, but
ellipse is produced JEditor Pane
+ S8209087: Clean up runtime code that compares 'this' to NULL
+ S8210306: Missing closing bracket in GridBagLayout gridwidth,
gridheight description
+ S8210339: Add 10 JNDI tests to com/sun/jndi/dns/FedTests/
+ S8210353: Move java/util/Arrays/TimSortStackSize2.java back
to tier1
+ S8210406: Refactor java.util.PluggableLocale:i18n shell tests
to plain java tests
+ S8210407: Refactor java.util.Calendar:i18n shell tests to
plain java tests
+ S8210448: Copy Java XML Digital Signature API Specification
into java.xml.crypto javadocs
+ S8210632: Add key exchange algorithm to
javax/net/ssl/TLSCommon/CipherSuite.java
+ S8210739: Calling JSpinner's setFont with null throws
NullPointerException
+ S8210910: Create test for FileChooserDemo
+ S8210923: JShell: support for switch expressions
+ S8210959: JShell fails and exits when statement throws an
exception whose message contains a '%'.
+ S8210990: [TESTBUG] Some CDS tests don't respect JVM variant
being tested
+ S8211031: Remove un-needed qualified export to java.desktop
from java.base on macos
+ S8211055: Provide print to a file (PDF) feature even when
printer was not connected
+ S8211218: remove double semicolon in
src/java.desktop/macosx/classes/sun/font/CFont.java
+ S8211300: Convert C-style array declarations in JDK client
code
+ S8211317: avoid memory leak in
Java_sun_awt_UNIXToolkit_load_1stock_1icon
+ S8211393: Memory leak issue on awt_InputMethod.c
+ S8211437: java.net.http.HttpClient hangs on 204 reply without
Content-length 0
+ S8211693: Convert C-style array declarations in client demos
and jdk.accessibility
+ S8211736: jdb doesn't print prompt when breakpoint is hit and
suspend policy is STOP_EVENT_THREAD
+ S8211806: TLS 1.3 handshake server name indication is missing
on a session resume
+ S8211853: Avoid additional duplicate work when a reference in
the task queue has already been evacuated
+ S8211876: Broken links in java.base files
(ClassLoader.html#name)
+ S8211879: Broken links in API overview
+ S8211886: Bad/broken link in synthFileFormat.html
+ S8211899: Remove the NSK_CPP_STUB macros from vmTestbase for
jvmti/scenarios/[E-M]
+ S8211987: Menu bar gets input focus even if Alt-released
event is consumed
+ S8212040: Compilation error due to wrong usage of
NSPrintJobDispositionValue in mac10.12
+ S8212071: Need to set the FreeType LCD Filter to reduce
fringing.
+ S8212098: Cleanup of ProblemList.txt for fixed swing tests
+ S8212114: Reconsider the affect on closed streams resulting
from 8189366
+ S8212148: Remove remaining NSK_CPP_STUBs
+ S8212186: JVMTI lacks a few GC barriers/hooks
+ S8212213: All tests for splashscreen stopped worked in
jdk12b13
+ S8212216: JGSS: Fix leak in exception cases in getJavaOID()
+ S8212220: add code to verify results to
metaspace/stressDictionary/StressDictionary.java
+ S8212535: Remove spaces before/after () for vmTestbase/[a-j]*
+ S8212553: [TESTBUG] TestTrichotomyExpressions.java times out
with Graal as JIT
+ S8212587: equals in MakeBase does not handle empty strings
correctly
+ S8212595: Remove unused size_helper() in oop_oop_iterate* in
instanceKlass.inline.hpp
+ S8212603: Need to step over GC barriers in Node::eqv_uncast()
+ S8212611: Small collection of simple changes from shenandoah
+ S8212612: Add documentation about Arguments::_exit_hook
+ S8212616: x86_32 build failures after JDK-8210498 (nmethod
entry barriers)
+ S8212617: ARM32 build failures after JDK-7041262 (VM_Version
should be called instead of Abstract_VM_Version so that
overriding works)
+ S8212629: [TEST] wrong breakpoint in
test/jdk/com/sun/jdi/DeferredStepTest
+ S8212642: Remove SystemDictionary::InitOption enum
+ S8212662: Fix javadoc typo in java.lang.ref.Cleaner
+ S8212663: Remove conservative at_safepoint assert when JFR
writes type sets during class unloading
+ S8212665: com/sun/jdi/DeferredStepTest.java: jj1 (line 57) -
unexpected. lastLine=52, minLine=52, maxLine=55
+ S8212695: Add explicit timeout to several HTTP Client tests
+ S8212698: Minor g1 #include changes and memoryService.hpp
copyright date update
+ S8212706: nmethod jvmci_installed_code_name need to be XML
escaped
+ S8212707: GlobalCounter padding is too optimistic
+ S8212718: Refactor some annotation processor tests to better
use collections
+ S8212726: Replace some use of drop- and foldArguments with
filtering argument combinator in StringConcatFactory
+ S8212752: Typo in SSL log message related to
inactive/disabled signature scheme
+ S8212753: Improve oopDesc::forward_to_atomic
+ S8212754: Build failure: undefined
JvmtiSampledObjectAllocEventCollector::object_alloc_is_safe_to_sample
+ S8212771: Remove remaining spaces before/after () for
vmTestbase
+ S8212774: Remove dead code touching Klass::_lower_dimension
+ S8212817: [JVMCI] ResolvedJavaMethod.isInVirtualMethodTable
throws InternalError
+ S8212896: AIX build breaks after 8212611
+ S8212913: (Nested)ThreadsListHandleInErrorHandlingTest need
to disable ShowRegistersOnAssert
- Removed patches:
* fix-arm32-build.patch
* fix-i586-build.patch
+ Fixed upstream

==== kaccounts-integration ====
Version update (18.12.0 -> 18.12.1)
Subpackages: kaccounts-integration-lang libkaccounts1

- Update to 18.12.1
* New bugfix release
* For more details please see:
* https://www.kde.org/announcements/announce-applications-18.12.1.php
- Changes since 18.12.0:
* No code changes since 18.12.0

==== kaccounts-providers ====
Version update (18.12.0 -> 18.12.1)
Subpackages: kaccounts-providers-lang

- Update to 18.12.1
* New bugfix release
* For more details please see:
* https://www.kde.org/announcements/announce-applications-18.12.1.php
- Changes since 18.12.0:
* No code changes since 18.12.0

==== kactivities-stats ====
Version update (5.53.0 -> 5.54.0)

- Update to 5.54.0
* New feature release
* For more details please see:
* https://www.kde.org/announcements/kde-frameworks-5.54.0.php
- Changes since 5.53.0:
* No code changes since 5.53.0

==== kactivities5 ====
Version update (5.53.0 -> 5.54.0)
Subpackages: kactivities5-imports libKF5Activities5

- Update to 5.54.0
* New feature release
* For more details please see:
* https://www.kde.org/announcements/kde-frameworks-5.54.0.php
- Changes since 5.53.0:
* Fix the version in the pkgconfig file.

==== kaddressbook ====
Version update (18.12.0 -> 18.12.1)
Subpackages: kaddressbook-lang

- Update to 18.12.1
* New bugfix release
* For more details please see:
* https://www.kde.org/announcements/announce-applications-18.12.1.php
- Changes since 18.12.0:
* No code changes since 18.12.0

==== kalarmcal ====
Version update (18.12.0 -> 18.12.1)
Subpackages: akonadi-plugin-kalarmcal kalarmcal-lang libKF5AlarmCalendar5

- Update to 18.12.1
* New bugfix release
* For more details please see:
* https://www.kde.org/announcements/announce-applications-18.12.1.php
- Changes since 18.12.0:
* No code changes since 18.12.0

==== kamera ====
Version update (18.12.0 -> 18.12.1)
Subpackages: kamera-lang kio_kamera

- Update to 18.12.1
* New bugfix release
* For more details please see:
* https://www.kde.org/announcements/announce-applications-18.12.1.php
- Changes since 18.12.0:
* No code changes since 18.12.0

==== karchive ====
Version update (5.53.0 -> 5.54.0)

- Update to 5.54.0
* New feature release
* For more details please see:
* https://www.kde.org/announcements/kde-frameworks-5.54.0.php
- Changes since 5.53.0:
* No code changes since 5.53.0

==== kate ====
Version update (18.12.0 -> 18.12.1)
Subpackages: kate-lang kate-plugins

- Update to 18.12.1
* New bugfix release
* For more details please see:
* https://www.kde.org/announcements/announce-applications-18.12.1.php
- Changes since 18.12.0:
* [projectplugin] Correct code index widget show
* [kateproject tool] Fine tune cppcheck
* [kateproject] Gracefully exit when analyzer is not finished
* ViewManager: Fix I18n_ARGUMENT_MISSING hint in message box when open a very
large file

==== kauth ====
Version update (5.53.0 -> 5.54.0)
Subpackages: libKF5Auth5 libKF5Auth5-lang

- Update to 5.54.0
* New feature release
* For more details please see:
* https://www.kde.org/announcements/kde-frameworks-5.54.0.php
- Changes since 5.53.0:
* No code changes since 5.53.0

==== kbookmarks ====
Version update (5.53.0 -> 5.54.0)
Subpackages: libKF5Bookmarks5 libKF5Bookmarks5-lang

- Update to 5.54.0
* New feature release
* For more details please see:
* https://www.kde.org/announcements/kde-frameworks-5.54.0.php
- Changes since 5.53.0:
* No code changes since 5.53.0

==== kcalc ====
Version update (18.12.0 -> 18.12.1)
Subpackages: kcalc-lang

- Update to 18.12.1
* New bugfix release
* For more details please see:
* https://www.kde.org/announcements/announce-applications-18.12.1.php
- Changes since 18.12.0:
* Use more https in links
* Fix running the test after requiring ECM 5.46.0

==== kcalcore ====
Version update (18.12.0 -> 18.12.1)

- Update to 18.12.1
* New bugfix release
* For more details please see:
* https://www.kde.org/announcements/announce-applications-18.12.1.php
- Changes since 18.12.0:
* No code changes since 18.12.0

==== kcalutils ====
Version update (18.12.0 -> 18.12.1)
Subpackages: kcalutils-lang libKF5CalendarUtils5

- Update to 18.12.1
* New bugfix release
* For more details please see:
* https://www.kde.org/announcements/announce-applications-18.12.1.php
- Changes since 18.12.0:
* No code changes since 18.12.0

==== kcharselect ====
Version update (18.12.0 -> 18.12.1)
Subpackages: kcharselect-lang

- Update to 18.12.1
* New bugfix release
* For more details please see:
* https://www.kde.org/announcements/announce-applications-18.12.1.php
- Changes since 18.12.0:
* No code changes since 18.12.0

==== kcmutils ====
Version update (5.53.0 -> 5.54.0)
Subpackages: libKF5KCMUtils5 libKF5KCMUtils5-lang

- Update to 5.54.0
* New feature release
* For more details please see:
* https://www.kde.org/announcements/kde-frameworks-5.54.0.php
- Changes since 5.53.0:
* initialize variable + minor optimization
* make use of the new currentIndex api of QML kcms

==== kcodecs ====
Version update (5.53.0 -> 5.54.0)
Subpackages: libKF5Codecs5 libKF5Codecs5-lang

- Update to 5.54.0
* New feature release
* For more details please see:
* https://www.kde.org/announcements/kde-frameworks-5.54.0.php
- Changes since 5.53.0:
* No code changes since 5.53.0

==== kcolorchooser ====
Version update (18.12.0 -> 18.12.1)
Subpackages: kcolorchooser-lang

- Update to 18.12.1
* New bugfix release
* For more details please see:
* https://www.kde.org/announcements/announce-applications-18.12.1.php
- Changes since 18.12.0:
* No code changes since 18.12.0

==== kcompletion ====
Version update (5.53.0 -> 5.54.0)
Subpackages: libKF5Completion5 libKF5Completion5-lang

- Update to 5.54.0
* New feature release
* For more details please see:
* https://www.kde.org/announcements/kde-frameworks-5.54.0.php
- Changes since 5.53.0:
* No code changes since 5.53.0

==== kconfig ====
Version update (5.53.0 -> 5.54.0)
Subpackages: kconf_update5 libKF5ConfigCore5 libKF5ConfigCore5-lang
libKF5ConfigGui5

- Update to 5.54.0
* New feature release
* For more details please see:
* https://www.kde.org/announcements/kde-frameworks-5.54.0.php
- Changes since 5.53.0:
* Fix doxygen markup in KConfigWatcher
* Fix a regression introduced in 6a1852
* Fix build without D-Bus
* Deduplicate reference value
* Remove unneeded qWarning
* Escape bytes that are larger than or equal to 127 in config files
* Fix documentation, QValueList isn't a thing anymore

==== kconfigwidgets ====
Version update (5.53.0 -> 5.54.0)
Subpackages: libKF5ConfigWidgets5 libKF5ConfigWidgets5-lang

- Update to 5.54.0
* New feature release
* For more details please see:
* https://www.kde.org/announcements/kde-frameworks-5.54.0.php
- Changes since 5.53.0:
* Fix minor typos

==== kcontacts ====
Version update (18.12.0 -> 18.12.1)
Subpackages: kcontacts-lang libKF5Contacts5

- Update to 18.12.1
* New bugfix release
* For more details please see:
* https://www.kde.org/announcements/announce-applications-18.12.1.php
- Changes since 18.12.0:
* No code changes since 18.12.0

==== kcoreaddons ====
Version update (5.53.1 -> 5.54.0)
Subpackages: kcoreaddons-lang libKF5CoreAddons5

- Update to 5.54.0
* New feature release
* For more details please see:
* https://www.kde.org/announcements/kde-frameworks-5.54.0.php
- Changes since 5.53.0:
* Use for(...:...) + initialize variables
* cmake macros: Port away from deprecated ECM var in kcoreaddons_add_plugin
(kde#401888)
* make units and prefixes of formatValue translatable
* make it build

==== kcrash ====
Version update (5.53.0 -> 5.54.0)

- Update to 5.54.0
* New feature release
* For more details please see:
* https://www.kde.org/announcements/kde-frameworks-5.54.0.php
- Changes since 5.53.0:
* No code changes since 5.53.0

==== kdav ====
Version update (18.12.0 -> 18.12.1)
Subpackages: kdav-lang libKPimKDAV5

- Update to 18.12.1
* New bugfix release
* For more details please see:
* https://www.kde.org/announcements/announce-applications-18.12.1.php
- Changes since 18.12.0:
* No code changes since 18.12.0

==== kdbusaddons ====
Version update (5.53.0 -> 5.54.0)
Subpackages: kdbusaddons-tools libKF5DBusAddons5 libKF5DBusAddons5-lang

- Update to 5.54.0
* New feature release
* For more details please see:
* https://www.kde.org/announcements/kde-frameworks-5.54.0.php
- Changes since 5.53.0:
* No code changes since 5.53.0

==== kdeclarative ====
Version update (5.53.0 -> 5.54.0)
Subpackages: kdeclarative-components libKF5CalendarEvents5 libKF5Declarative5
libKF5Declarative5-lang libKF5QuickAddons5

- Update to 5.54.0
* New feature release
* For more details please see:
* https://www.kde.org/announcements/kde-frameworks-5.54.0.php
- Changes since 5.53.0:
* don't show separators on mobile
* root.contentItem instead of just contentItem
* Add the missing api for multilevel KCMs to control the columns

==== kded ====
Version update (5.53.0 -> 5.54.0)
Subpackages: kded-lang

- Update to 5.54.0
* New feature release
* For more details please see:
* https://www.kde.org/announcements/kde-frameworks-5.54.0.php
- Changes since 5.53.0:
* No code changes since 5.53.0

==== kdelibs4support ====
Version update (5.53.0 -> 5.54.0)
Subpackages: kdelibs4support-lang libKF5KDELibs4Support5

- Update to 5.54.0
* New feature release
* For more details please see:
* https://www.kde.org/announcements/kde-frameworks-5.54.0.php
- Changes since 5.53.0:
* No code changes since 5.53.0

==== kdenetwork4-filesharing ====
Version update (18.12.0 -> 18.12.1)
Subpackages: kdenetwork4-filesharing-lang

- Update to 18.12.1
* New bugfix release
* For more details please see:
* https://www.kde.org/announcements/announce-applications-18.12.1.php
- Changes since 18.12.0:
* No code changes since 18.12.0

==== kdepim-addons ====
Version update (18.12.0 -> 18.12.1)
Subpackages: kdepim-addons-lang

- Update to 18.12.1
* New bugfix release
* For more details please see:
* https://www.kde.org/announcements/announce-applications-18.12.1.php
- Changes since 18.12.0:
* Fix send to KDE Connect for older KDE Connect version
* Allow to show address on map for EventReservation too
* Disable subscription
* Debug-- Use ExtendedSelection
* Fix enable/disable buttons
* Backport all fix for adblock
* Don't build example in official release

==== kdepim-apps-libs ====
Version update (18.12.0 -> 18.12.1)
Subpackages: kdepim-apps-libs-lang

- Update to 18.12.1
* New bugfix release
* For more details please see:
* https://www.kde.org/announcements/announce-applications-18.12.1.php
- Changes since 18.12.0:
* No code changes since 18.12.0

==== kdepim-runtime ====
Version update (18.12.0 -> 18.12.1)
Subpackages: kdepim-runtime-lang

- Update to 18.12.1
* New bugfix release
* For more details please see:
* https://www.kde.org/announcements/announce-applications-18.12.1.php
- Changes since 18.12.0:
* Fix sort element
* Make sure to delete it when action was done

==== kdesu ====
Version update (5.53.0 -> 5.54.0)
Subpackages: libKF5Su5 libKF5Su5-lang

- Update to 5.54.0
* New feature release
* For more details please see:
* https://www.kde.org/announcements/kde-frameworks-5.54.0.php
- Changes since 5.53.0:
* No code changes since 5.53.0

==== kdialog ====
Version update (18.12.0 -> 18.12.1)
Subpackages: kdialog-lang

- Update to 18.12.1
* New bugfix release
* For more details please see:
* https://www.kde.org/announcements/announce-applications-18.12.1.php
- Changes since 18.12.0:
* No code changes since 18.12.0

==== kdnssd-framework ====
Version update (5.53.0 -> 5.54.0)
Subpackages: libKF5DNSSD5 libKF5DNSSD5-lang

- Update to 5.54.0
* New feature release
* For more details please see:
* https://www.kde.org/announcements/kde-frameworks-5.54.0.php
- Changes since 5.53.0:
* No code changes since 5.53.0

==== kdoctools ====
Version update (5.53.0 -> 5.54.0)
Subpackages: kdoctools-lang libKF5DocTools5

- Update to 5.54.0
* New feature release
* For more details please see:
* https://www.kde.org/announcements/kde-frameworks-5.54.0.php
- Changes since 5.53.0:
* No code changes since 5.53.0
- Use noun phrase in summaries.

==== kemoticons ====
Version update (5.53.0 -> 5.54.0)

- Update to 5.54.0
* New feature release
* For more details please see:
* https://www.kde.org/announcements/kde-frameworks-5.54.0.php
- Changes since 5.53.0:
* Port to for(...:...)
* Add support for debug categories
* Add debug categories
* Minor optimization
* Use lambda here
- Use noun phrase in summary.

==== kernel-firmware ====
Subpackages: ucode-amd

- Fix firmware for bcm43430 and bcm43455 (fate#326215)
* rename brcmfmac43450 and brcfmac43455 to the compatible name
used by brcmf_of_probe
* delete brcmfmac43455-sdio.clm_blob as it was not accepted upstream
- Add firmware for bcm43430 and bcm43455 (fate#326215)
* brcmfmac43430-sdio.raspberrypi-rpi.txt
* brcmfmac43455-sdio.clm_blob
* brcmfmac43455-sdio.raspberrypi-rpi.txt

==== kfilemetadata5 ====
Version update (5.53.0 -> 5.54.0)
Subpackages: kfilemetadata5-lang

- Update to 5.54.0
* New feature release
* For more details please see:
* https://www.kde.org/announcements/kde-frameworks-5.54.0.php
- Changes since 5.53.0:
* Fix some warnings
* fail writing test if mime type is not supported by the extractor
* fix ape disc number extraction
* implement cover extraction for asf files
* extend list of supported mimetypes for embedded image extractor
* Refactor embedded image extractor for greater extensibility
* add missing wav mimetype
* Extract more tags from exif metadata (kde#341162)
* fix extraction of GPS altitude for exif data
- Use noun phrase in summaries.

==== kglobalaccel ====
Version update (5.53.0 -> 5.54.0)
Subpackages: kglobalaccel5 libKF5GlobalAccel5 libKF5GlobalAccel5-lang
libKF5GlobalAccelPrivate5

- Update to 5.54.0
* New feature release
* For more details please see:
* https://www.kde.org/announcements/kde-frameworks-5.54.0.php
- Changes since 5.53.0:
* Fix KGlobalAccel build with Qt 5.13 prerelease.

==== kguiaddons ====
Version update (5.53.0 -> 5.54.0)

- Update to 5.54.0
* New feature release
* For more details please see:
* https://www.kde.org/announcements/kde-frameworks-5.54.0.php
- Changes since 5.53.0:
* No code changes since 5.53.0

==== khelpcenter5 ====
Version update (18.12.0 -> 18.12.1)
Subpackages: khelpcenter5-lang

- Update to 18.12.1
* New bugfix release
* For more details please see:
* https://www.kde.org/announcements/announce-applications-18.12.1.php
- Changes since 18.12.0:
* No code changes since 18.12.0

==== kholidays ====
Version update (5.53.0 -> 5.54.0)
Subpackages: libKF5Holidays5 libKF5Holidays5-lang

- Update to 5.54.0
* New feature release
* For more details please see:
* https://www.kde.org/announcements/kde-frameworks-5.54.0.php
- Changes since 5.53.0:
* README.md - add basic instructions for testing holiday files
* various calendars - fix syntax errors

==== khtml ====
Version update (5.53.0 -> 5.54.0)
Subpackages: libKF5KHtml5 libKF5KHtml5-lang

- Update to 5.54.0
* New feature release
* For more details please see:
* https://www.kde.org/announcements/kde-frameworks-5.54.0.php
- Changes since 5.53.0:
* Fix mem leak

==== ki18n ====
Version update (5.53.0 -> 5.54.0)
Subpackages: libKF5I18n5 libKF5I18n5-lang

- Update to 5.54.0
* New feature release
* For more details please see:
* https://www.kde.org/announcements/kde-frameworks-5.54.0.php
- Changes since 5.53.0:
* No code changes since 5.53.0

==== kiconthemes ====
Version update (5.53.0 -> 5.54.0)
Subpackages: libKF5IconThemes5 libKF5IconThemes5-lang

- Update to 5.54.0
* New feature release
* For more details please see:
* https://www.kde.org/announcements/kde-frameworks-5.54.0.php
- Changes since 5.53.0:
* Use for(...:...)
* Don't check twice if the icon exists from ::availableSizes
* ksvg2icns : use QStringLiteral()
* ksvg2icns : use Qt 5.9+ QTemporaryDir API

==== kidentitymanagement ====
Version update (18.12.0 -> 18.12.1)
Subpackages: kidentitymanagement-lang libKF5IdentityManagement5

- Update to 18.12.1
* New bugfix release
* For more details please see:
* https://www.kde.org/announcements/announce-applications-18.12.1.php
- Changes since 18.12.0:
* No code changes since 18.12.0

==== kidletime ====
Version update (5.53.0 -> 5.54.0)

- Update to 5.54.0
* New feature release
* For more details please see:
* https://www.kde.org/announcements/kde-frameworks-5.54.0.php
- Changes since 5.53.0:
* [xscreensaverpoller] Flush after reset screensaver
- Use noun phrase in summaries.

==== kimageformats ====
Version update (5.53.0 -> 5.54.0)

- Update to 5.54.0
* New feature release
* For more details please see:
* https://www.kde.org/announcements/kde-frameworks-5.54.0.php
- Changes since 5.53.0:
* No code changes since 5.53.0

==== kimap ====
Version update (18.12.0 -> 18.12.1)
Subpackages: kimap-lang libKF5IMAP5

- Update to 18.12.1
* New bugfix release
* For more details please see:
* https://www.kde.org/announcements/announce-applications-18.12.1.php
- Changes since 18.12.0:
* No code changes since 18.12.0

==== kinit ====
Version update (5.53.0 -> 5.54.0)
Subpackages: kinit-lang

- Update to 5.54.0
* New feature release
* For more details please see:
* https://www.kde.org/announcements/kde-frameworks-5.54.0.php
- Changes since 5.53.0:
* use soft rlimit for number of open handles

==== kio ====
Version update (5.53.0 -> 5.54.0)
Subpackages: kio-core kio-lang

- Update to 5.54.0
* New feature release
* For more details please see:
* https://www.kde.org/announcements/kde-frameworks-5.54.0.php
- Changes since 5.53.0:
* Too many changes to list here
- Add upstream patch to prevent crashes in KIO (kde#402665)
* 0002-Revert-Refactor-SlaveInterface-calcSpeed.patch

==== kio-extras5 ====
Version update (18.12.0 -> 18.12.1)
Subpackages: kio-extras5-lang libkioarchive5

- Update to 18.12.1
* New bugfix release
* For more details please see:
* https://www.kde.org/announcements/announce-applications-18.12.1.php
- Changes since 18.12.0:
* Use more https with links

==== kio_audiocd ====
Version update (18.12.0 -> 18.12.1)
Subpackages: kio_audiocd-lang

- Update to 18.12.1
* New bugfix release
* For more details please see:
* https://www.kde.org/announcements/announce-applications-18.12.1.php
- Changes since 18.12.0:
* Fix KCM installation

==== kirigami2 ====
Version update (5.53.0 -> 5.54.0)
Subpackages: kirigami2-lang libKF5Kirigami2-5

- Update to 5.54.0
* New feature release
* For more details please see:
* https://www.kde.org/announcements/kde-frameworks-5.54.0.php
- Changes since 5.53.0:
* Too many changes to list here

==== kitemmodels ====
Version update (5.53.0 -> 5.54.0)

- Update to 5.54.0
* New feature release
* For more details please see:
* https://www.kde.org/announcements/kde-frameworks-5.54.0.php
- Changes since 5.53.0:
* Remove code for qt < 4.7.2 :)

==== kitemviews ====
Version update (5.53.0 -> 5.54.0)
Subpackages: libKF5ItemViews5 libKF5ItemViews5-lang

- Update to 5.54.0
* New feature release
* For more details please see:
* https://www.kde.org/announcements/kde-frameworks-5.54.0.php
- Changes since 5.53.0:
* No code changes since 5.53.0

==== kitinerary ====
Version update (18.12.0 -> 18.12.1)
Subpackages: libKPimItinerary5 libKPimItinerary5-lang

- Update to 18.12.1
* New bugfix release
* For more details please see:
* https://www.kde.org/announcements/announce-applications-18.12.1.php
- Changes since 18.12.0:
* No code changes since 18.12.0

==== kjobwidgets ====
Version update (5.53.0 -> 5.54.0)
Subpackages: libKF5JobWidgets5 libKF5JobWidgets5-lang

- Update to 5.54.0
* New feature release
* For more details please see:
* https://www.kde.org/announcements/kde-frameworks-5.54.0.php
- Changes since 5.53.0:
* No code changes since 5.53.0

==== kjs ====
Version update (5.53.0 -> 5.54.0)
Subpackages: libKF5JS5 libKF5JSApi5

- Update to 5.54.0
* New feature release
* For more details please see:
* https://www.kde.org/announcements/kde-frameworks-5.54.0.php
- Changes since 5.53.0:
* No code changes since 5.53.0

==== kjsembed ====
Version update (5.53.0 -> 5.54.0)
Subpackages: libKF5JsEmbed5 libKF5JsEmbed5-lang

- Update to 5.54.0
* New feature release
* For more details please see:
* https://www.kde.org/announcements/kde-frameworks-5.54.0.php
- Changes since 5.53.0:
* No code changes since 5.53.0
- Use noun phrase in summaries.

==== kldap ====
Version update (18.12.0 -> 18.12.1)
Subpackages: kldap-lang libKF5Ldap5

- Update to 18.12.1
* New bugfix release
* For more details please see:
* https://www.kde.org/announcements/announce-applications-18.12.1.php
- Changes since 18.12.0:
* No code changes since 18.12.0

==== kleopatra ====
Version update (18.12.0 -> 18.12.1)
Subpackages: kleopatra-lang

- Update to 18.12.1
* New bugfix release
* For more details please see:
* https://www.kde.org/announcements/announce-applications-18.12.1.php
- Changes since 18.12.0:
* No code changes since 18.12.0

==== kmag ====
Version update (18.12.0 -> 18.12.1)
Subpackages: kmag-lang

- Update to 18.12.1
* New bugfix release
* For more details please see:
* https://www.kde.org/announcements/announce-applications-18.12.1.php
- Changes since 18.12.0:
* No code changes since 18.12.0

==== kmail ====
Version update (18.12.0 -> 18.12.1)
Subpackages: kmail-application-icons kmail-lang ktnef

- Update to 18.12.1
* New bugfix release
* For more details please see:
* https://www.kde.org/announcements/announce-applications-18.12.1.php
- Changes since 18.12.0:
* unifiedmailboxagent: Stop using std::optional.
* Fix Bug 402378 - mailto staement , uncomplete url past to kmail composer
* Make sure that it doesn't crash here
* Fix Bug 401419 - Kmail crashes on trying to open any email (kde#401419)
* Fix add parentwidget
- Dropped patches, now upstream:
* 0001-Fix-Bug-401419-Kmail-crashes-on-trying-to-open-any-e.patch

==== kmail-account-wizard ====
Version update (18.12.0 -> 18.12.1)
Subpackages: kmail-account-wizard-lang

- Update to 18.12.1
* New bugfix release
* For more details please see:
* https://www.kde.org/announcements/announce-applications-18.12.1.php
- Changes since 18.12.0:
* No code changes since 18.12.0

==== kmailtransport ====
Version update (18.12.0 -> 18.12.1)
Subpackages: kmailtransport-lang libKF5MailTransport5
libKF5MailTransportAkonadi5

- Update to 18.12.1
* New bugfix release
* For more details please see:
* https://www.kde.org/announcements/announce-applications-18.12.1.php
- Changes since 18.12.0:
* No code changes since 18.12.0

==== kmbox ====
Version update (18.12.0 -> 18.12.1)

- Update to 18.12.1
* New bugfix release
* For more details please see:
* https://www.kde.org/announcements/announce-applications-18.12.1.php
- Changes since 18.12.0:
* No code changes since 18.12.0

==== kmime ====
Version update (18.12.0 -> 18.12.1)
Subpackages: kmime-lang libKF5Mime5

- Update to 18.12.1
* New bugfix release
* For more details please see:
* https://www.kde.org/announcements/announce-applications-18.12.1.php
- Changes since 18.12.0:
* No code changes since 18.12.0

==== kmousetool ====
Version update (18.12.0 -> 18.12.1)
Subpackages: kmousetool-lang

- Update to 18.12.1
* New bugfix release
* For more details please see:
* https://www.kde.org/announcements/announce-applications-18.12.1.php
- Changes since 18.12.0:
* No code changes since 18.12.0

==== knewstuff ====
Version update (5.53.0 -> 5.54.0)
Subpackages: libKF5NewStuff5 libKF5NewStuff5-lang libKF5NewStuffCore5

- Update to 5.54.0
* New feature release
* For more details please see:
* https://www.kde.org/announcements/kde-frameworks-5.54.0.php
- Changes since 5.53.0:
* Remove old kde4 feature
* Fix compile with strict compile flags
* Use QStringLiteral + port to for(...:...)
* Change default sort order in the download dialog to "Most downloads"
(kde#399163)
* Notify about the provider not being loaded
* Forgot to include file
* Export enum into qobject for easier debugging

==== knotes ====
Version update (18.12.0 -> 18.12.1)
Subpackages: knotes-lang

- Update to 18.12.1
* New bugfix release
* For more details please see:
* https://www.kde.org/announcements/announce-applications-18.12.1.php
- Changes since 18.12.0:
* Fix Bug 402453 - KNotes help menu is empty (kde#402453)

==== knotifications ====
Version update (5.53.0 -> 5.54.0)
Subpackages: libKF5Notifications5 libKF5Notifications5-lang

- Update to 5.54.0
* New feature release
* For more details please see:
* https://www.kde.org/announcements/kde-frameworks-5.54.0.php
- Changes since 5.53.0:
* [Android] Fail more gracefully when building with API < 23
* Add Android notification backend
* Initialize pointer
* Build without D-Bus on Android
* Clean up tests build system
* Don't force Phonon on Android
* Hide API documentation of internal classes
- BuildRequire libcanberra instead of Phonon for notification sounds

==== knotifyconfig ====
Version update (5.53.0 -> 5.54.0)
Subpackages: libKF5NotifyConfig5 libKF5NotifyConfig5-lang

- Update to 5.54.0
* New feature release
* For more details please see:
* https://www.kde.org/announcements/kde-frameworks-5.54.0.php
- Changes since 5.53.0:
* Fix build without Phonon

==== kompare ====
Version update (18.12.0 -> 18.12.1)
Subpackages: kompare-lang

- Update to 18.12.1
* New bugfix release
* For more details please see:
* https://www.kde.org/announcements/announce-applications-18.12.1.php
- Changes since 18.12.0:
* Use more https in links

==== konsole ====
Version update (18.12.0 -> 18.12.1)
Subpackages: konsole-part konsole-part-lang

- Update to 18.12.1
* New bugfix release
* For more details please see:
* https://www.kde.org/announcements/announce-applications-18.12.1.php
- Changes since 18.12.0:
* Fix crash in extendSelection (kde#402452)
* Fix regression on tab color not reverting back to 'no activity' color
(kde#402541)
* Don't change alternate scrolling state after calling reset() (kde#402461)
* Fix crash while trying to move tab with only one view (kde#402278)
* fix cursor when anti aliasing is enabled
* Fix crash when changing from blinking cursor to block cursor
* fix drawing box chars, avoid storing and saving state all the time
(kde#401463)
* Restore default tabbar style when custom stylesheet is disabled
* Fix condition to redraw search result line
- Dropped patches, now upstream:
* Fix-regression-on-tab-color-not-reverting-back-to-no-activity-color.patch
* fix-drawing-box-chars.patch
* fix-cursor-when-anti-aliasing-is-enabled.patch

==== kontact ====
Version update (18.12.0 -> 18.12.1)
Subpackages: kontact-lang

- Update to 18.12.1
* New bugfix release
* For more details please see:
* https://www.kde.org/announcements/announce-applications-18.12.1.php
- Changes since 18.12.0:
* No code changes since 18.12.0

==== kontactinterface ====
Version update (18.12.0 -> 18.12.1)
Subpackages: kontactinterface-lang libKF5KontactInterface5

- Update to 18.12.1
* New bugfix release
* For more details please see:
* https://www.kde.org/announcements/announce-applications-18.12.1.php
- Changes since 18.12.0:
* No code changes since 18.12.0

==== kopete ====
Version update (18.12.0 -> 18.12.1)
Subpackages: kopete-lang

- Update to 18.12.1
* New bugfix release
* For more details please see:
* https://www.kde.org/announcements/announce-applications-18.12.1.php
- Changes since 18.12.0:
* No code changes since 18.12.0

==== korganizer ====
Version update (18.12.0 -> 18.12.1)
Subpackages: korganizer-lang

- Update to 18.12.1
* New bugfix release
* For more details please see:
* https://www.kde.org/announcements/announce-applications-18.12.1.php
- Changes since 18.12.0:
* No code changes since 18.12.0

==== kpackage ====
Version update (5.53.0 -> 5.54.0)
Subpackages: kpackage-lang

- Update to 5.54.0
* New feature release
* For more details please see:
* https://www.kde.org/announcements/kde-frameworks-5.54.0.php
- Changes since 5.53.0:
* Fix typo in i18n message (cmdline option description)
- Use noun phrase in summaries.

==== kparts ====
Version update (5.53.0 -> 5.54.0)
Subpackages: libKF5Parts5 libKF5Parts5-lang

- Update to 5.54.0
* New feature release
* For more details please see:
* https://www.kde.org/announcements/kde-frameworks-5.54.0.php
- Changes since 5.53.0:
* No code changes since 5.53.0

==== kpeople5 ====
Version update (5.53.0 -> 5.54.0)
Subpackages: kpeople5-lang

- Update to 5.54.0
* New feature release
* For more details please see:
* https://www.kde.org/announcements/kde-frameworks-5.54.0.php
- Changes since 5.53.0:
* No code changes since 5.53.0
- Use noun phrase in summaries.

==== kpimtextedit ====
Version update (18.12.0 -> 18.12.1)
Subpackages: kpimtextedit-lang libKF5PimTextEdit5

- Update to 18.12.1
* New bugfix release
* For more details please see:
* https://www.kde.org/announcements/announce-applications-18.12.1.php
- Changes since 18.12.0:
* No code changes since 18.12.0

==== kpkpass ====
Version update (18.12.0 -> 18.12.1)
Subpackages: libKPimPkPass5

- Update to 18.12.1
* New bugfix release
* For more details please see:
* https://www.kde.org/announcements/announce-applications-18.12.1.php
- Changes since 18.12.0:
* No code changes since 18.12.0

==== kplotting ====
Version update (5.53.0 -> 5.54.0)

- Update to 5.54.0
* New feature release
* For more details please see:
* https://www.kde.org/announcements/kde-frameworks-5.54.0.php
- Changes since 5.53.0:
* Add override
- Use noun phrase in summaries.

==== kpty ====
Version update (5.53.0 -> 5.54.0)
Subpackages: libKF5Pty5 libKF5Pty5-lang

- Update to 5.54.0
* New feature release
* For more details please see:
* https://www.kde.org/announcements/kde-frameworks-5.54.0.php
- Changes since 5.53.0:
* No code changes since 5.53.0
- Use noun phrase in summary.

==== kross ====
Version update (5.53.0 -> 5.54.0)
Subpackages: kross-lang

- Update to 5.54.0
* New feature release
* For more details please see:
* https://www.kde.org/announcements/kde-frameworks-5.54.0.php
- Changes since 5.53.0:
* No code changes since 5.53.0
- Use noun phrase in summary.

==== kruler ====
Version update (18.12.0 -> 18.12.1)
Subpackages: kruler-lang

- Update to 18.12.1
* New bugfix release
* For more details please see:
* https://www.kde.org/announcements/announce-applications-18.12.1.php
- Changes since 18.12.0:
* No code changes since 18.12.0

==== krunner ====
Version update (5.53.0 -> 5.54.0)

- Update to 5.54.0
* New feature release
* For more details please see:
* https://www.kde.org/announcements/kde-frameworks-5.54.0.php
- Changes since 5.53.0:
* Fix warning + port to for(...:...)
* Fix compare float

==== kservice ====
Version update (5.53.0 -> 5.54.0)
Subpackages: kservice-lang

- Update to 5.54.0
* New feature release
* For more details please see:
* https://www.kde.org/announcements/kde-frameworks-5.54.0.php
- Changes since 5.53.0:
* applications.menu: remove unused category X-KDE-Edu-Teaching
* applications.menu: remove <KDELegacyDirs/>

==== ksmtp ====
Version update (18.12.0 -> 18.12.1)
Subpackages: ksmtp-lang libKPimSMTP5

- Update to 18.12.1
* New bugfix release
* For more details please see:
* https://www.kde.org/announcements/announce-applications-18.12.1.php
- Changes since 18.12.0:
* No code changes since 18.12.0

==== ktexteditor ====
Version update (5.53.0 -> 5.54.0)
Subpackages: ktexteditor-lang

- Update to 5.54.0
* New feature release
* For more details please see:
* https://www.kde.org/announcements/kde-frameworks-5.54.0.php
- Changes since 5.53.0:
* Fix unit test that arbitrarily fails
* fix scripting for Qt 5.12
* Fix emmet script by using HEX instead of OCT numbers in strings (kde#386151)
* Fix broken Emmet (kde#386151)
* ViewConfig: Add 'Dynamic Wrap At Static Marker' option
* fix folding region end, add ending token to the range
* avoid ugly overpainting with alpha
* Don't re-mark words added/ignored to the dictionary as misspelled
(kde#387729)
* KTextEditor: Add action for static word wrap (kde#141946)
* ViewPrivate: Don't hide 'Clear Dictionary Ranges' action
* KateStatusBar: Reformatted by astyle command to follow coding style
* Don't ask for confimation when reloading (kde#401376)
* class Message: Use inclass member initialization
* KTextEditor::Message: Review documentation
* use STL were no implicit sharing is required
* Expose KTextEditor::ViewPrivate:setInputMode(InputMode) to KTextEditor::View
* improve range handling, no allocations for common updates (kde#333517)
* KateViewInternal: Rename getMouse/Cursor() => mouse/cursorPosition() to fit
coding style
* tune editing actions for large number of small edits
* Only cal updateView() in visibleRange() when endPos() is invalid.
* KateViewInternal: S&R

==== ktextwidgets ====
Version update (5.53.0 -> 5.54.0)
Subpackages: libKF5TextWidgets5 libKF5TextWidgets5-lang

- Update to 5.54.0
* New feature release
* For more details please see:
* https://www.kde.org/announcements/kde-frameworks-5.54.0.php
- Changes since 5.53.0:
* Minor clean up

==== ktnef ====
Version update (18.12.0 -> 18.12.1)
Subpackages: ktnef-lang libKF5Tnef5

- Update to 18.12.1
* New bugfix release
* For more details please see:
* https://www.kde.org/announcements/announce-applications-18.12.1.php
- Changes since 18.12.0:
* No code changes since 18.12.0

==== kunitconversion ====
Version update (5.53.0 -> 5.54.0)
Subpackages: libKF5UnitConversion5 libKF5UnitConversion5-lang

- Update to 5.54.0
* New feature release
* For more details please see:
* https://www.kde.org/announcements/kde-frameworks-5.54.0.php
- Changes since 5.53.0:
* No code changes since 5.53.0

==== kwallet ====
Version update (5.53.0 -> 5.54.0)
Subpackages: kwallet-tools kwallet-tools-lang kwalletd5 kwalletd5-lang
libKF5Wallet5 libkwalletbackend5-5

- Update to 5.54.0
* New feature release
* For more details please see:
* https://www.kde.org/announcements/kde-frameworks-5.54.0.php
- Changes since 5.53.0:
* No code changes since 5.53.0

==== kwalletmanager5 ====
Version update (18.12.0 -> 18.12.1)
Subpackages: kwalletmanager5-lang

- Update to 18.12.1
* New bugfix release
* For more details please see:
* https://www.kde.org/announcements/announce-applications-18.12.1.php
- Changes since 18.12.0:
* No code changes since 18.12.0

==== kwayland ====
Version update (5.53.0 -> 5.54.0)

- Update to 5.54.0
* New feature release
* For more details please see:
* https://www.kde.org/announcements/kde-frameworks-5.54.0.php
- Changes since 5.53.0:
* Add clarifying about using both KDE's ServerDecoration and XdgDecoration
* Update @since information
* Xdg Decoration Support
* Fix XDGForeign Client header installs
* [server] Touch drag support
* [server] Allow multiple touch interfaces per client

==== kwidgetsaddons ====
Version update (5.53.0 -> 5.54.0)
Subpackages: libKF5WidgetsAddons5 libKF5WidgetsAddons5-lang

- Update to 5.54.0
* New feature release
* For more details please see:
* https://www.kde.org/announcements/kde-frameworks-5.54.0.php
- Changes since 5.53.0:
* Port to for(...:...) + use reserve
* [KMessageBox] Fix minimum dialog size when details are requested
(kde#401466)

==== kwin5 ====
Subpackages: kwin5-lang

- Add patch to force initialization of OpenGL to fix flickering
(boo#1120090, QTBUG-73122):
* 0001-Fix-flickering-with-Qt-5.12.patch

==== kwindowsystem ====
Version update (5.53.0 -> 5.54.0)
Subpackages: libKF5WindowSystem5 libKF5WindowSystem5-lang

- Update to 5.54.0
* New feature release
* For more details please see:
* https://www.kde.org/announcements/kde-frameworks-5.54.0.php
- Changes since 5.53.0:
* No code changes since 5.53.0

==== kxmlgui ====
Version update (5.53.0 -> 5.54.0)
Subpackages: libKF5XmlGui5 libKF5XmlGui5-lang

- Update to 5.54.0
* New feature release
* For more details please see:
* https://www.kde.org/announcements/kde-frameworks-5.54.0.php
- Changes since 5.53.0:
* No code changes since 5.53.0

==== kxmlrpcclient5 ====
Version update (5.53.0 -> 5.54.0)
Subpackages: libKF5XmlRpcClient5 libKF5XmlRpcClient5-lang

- Update to 5.54.0
* New feature release
* For more details please see:
* https://www.kde.org/announcements/kde-frameworks-5.54.0.php
- Changes since 5.53.0:
* No code changes since 5.53.0

==== libKF5ModemManagerQt ====
Version update (5.53.0 -> 5.54.0)

- Update to 5.54.0
* New feature release
* For more details please see:
* https://www.kde.org/announcements/kde-frameworks-5.54.0.php
- Changes since 5.53.0:
* No code changes since 5.53.0

==== libKF5NetworkManagerQt ====
Version update (5.53.0 -> 5.54.0)

- Refresh patches to fix build on Leap 42.3:
* 0001-Revert-Add-IpTunnel-setting.patch
* 0001-Revert-Add-missing-IPv6-options.patch
* 0001-Revert-Add-missing-ipv4-setting-options.patch
* 0001-Revert-Add-vxlan-setting.patch
- Update to 5.54.0
* New feature release
* For more details please see:
* https://www.kde.org/announcements/kde-frameworks-5.54.0.php
- Changes since 5.53.0:
* [proxysetting] Fix build with NM 1.4
* Added DCB settings
* A minor typo in ipv4 test
* A minor bug in ipv4 and ipv6 test
* macsec setting
* TeamPortSetting: fix argument
* team-port setting
* match and tc setting
* Add missing defines
* ovs-patch and ovs-port setting
- Dropped patches, now upstream:
* Add-missing-defines.patch
* fix-build-with-NM-1.4.patch

==== libgravatar ====
Version update (18.12.0 -> 18.12.1)
Subpackages: libKF5Gravatar5 libgravatar-lang

- Update to 18.12.1
* New bugfix release
* For more details please see:
* https://www.kde.org/announcements/announce-applications-18.12.1.php
- Changes since 18.12.0:
* No code changes since 18.12.0

==== libkcddb ====
Version update (18.12.0 -> 18.12.1)

- Update to 18.12.1
* New bugfix release
* For more details please see:
* https://www.kde.org/announcements/announce-applications-18.12.1.php
- Changes since 18.12.0:
* No code changes since 18.12.0

==== libkcompactdisc ====
Version update (18.12.0 -> 18.12.1)
Subpackages: libKF5CompactDisc5 libkcompactdisc-lang

- Update to 18.12.1
* New bugfix release
* For more details please see:
* https://www.kde.org/announcements/announce-applications-18.12.1.php
- Changes since 18.12.0:
* No code changes since 18.12.0

==== libkdcraw ====
Version update (18.12.0 -> 18.12.1)

- Update to 18.12.1
* New bugfix release
* For more details please see:
* https://www.kde.org/announcements/announce-applications-18.12.1.php
- Changes since 18.12.0:
* No code changes since 18.12.0

==== libkdepim ====
Version update (18.12.0 -> 18.12.1)
Subpackages: libKF5Libkdepim5 libKF5LibkdepimAkonadi5 libkdepim-lang

- Update to 18.12.1
* New bugfix release
* For more details please see:
* https://www.kde.org/announcements/announce-applications-18.12.1.php
- Changes since 18.12.0:
* No code changes since 18.12.0

==== libkexiv2 ====
Version update (18.12.0 -> 18.12.1)

- Update to 18.12.1
* New bugfix release
* For more details please see:
* https://www.kde.org/announcements/announce-applications-18.12.1.php
- Changes since 18.12.0:
* No code changes since 18.12.0

==== libkgapi ====
Version update (18.12.0 -> 18.12.1)
Subpackages: libKPimGAPICalendar5 libKPimGAPIContacts5 libKPimGAPICore5
libKPimGAPITasks5 libkgapi-lang sasl2-kdexoauth2

- Update to 18.12.1
* New bugfix release
* For more details please see:
* https://www.kde.org/announcements/announce-applications-18.12.1.php
- Changes since 18.12.0:
* No code changes since 18.12.0
- Generalize summaries.

==== libkipi ====
Version update (18.12.0 -> 18.12.1)
Subpackages: libKF5Kipi32_0_0 libkipi-data

- Update to 18.12.1
* New bugfix release
* For more details please see:
* https://www.kde.org/announcements/announce-applications-18.12.1.php
- Changes since 18.12.0:
* No code changes since 18.12.0

==== libkleo ====
Version update (18.12.0 -> 18.12.1)
Subpackages: libKF5Libkleo5 libkleo-lang

- Update to 18.12.1
* New bugfix release
* For more details please see:
* https://www.kde.org/announcements/announce-applications-18.12.1.php
- Changes since 18.12.0:
* No code changes since 18.12.0

==== libkomparediff2 ====
Version update (18.12.0 -> 18.12.1)
Subpackages: libkomparediff2-5 libkomparediff2-lang

- Update to 18.12.1
* New bugfix release
* For more details please see:
* https://www.kde.org/announcements/announce-applications-18.12.1.php
- Changes since 18.12.0:
* No code changes since 18.12.0

==== libksane ====
Version update (18.12.0 -> 18.12.1)
Subpackages: libKF5Sane5 libksane-lang

- Update to 18.12.1
* New bugfix release
* For more details please see:
* https://www.kde.org/announcements/announce-applications-18.12.1.php
- Changes since 18.12.0:
* No code changes since 18.12.0

==== libksieve ====
Version update (18.12.0 -> 18.12.1)
Subpackages: libksieve-lang

- Update to 18.12.1
* New bugfix release
* For more details please see:
* https://www.kde.org/announcements/announce-applications-18.12.1.php
- Changes since 18.12.0:
* No code changes since 18.12.0

==== libqt4 ====
Subpackages: libqt4-32bit libqt4-qt3support libqt4-qt3support-32bit libqt4-sql
libqt4-sql-32bit libqt4-sql-sqlite libqt4-sql-sqlite-32bit libqt4-x11
libqt4-x11-32bit

- Add libqt4-toplevel-asm.patch to adhere to stricter
toplevel asm parsing, dropping volatile qualification that has no
effect. (boo#1121214)

==== libqt5-qtscript ====

- Add libqt5-qtscript-toplevel-asm.patch to adhere to stricter
toplevel asm parsing, dropping volatile qualification that has no
effect.

==== libqt5-qtwebengine ====

- Backport patch to fix %arm builds:
* gn-fix_arm.patch

==== libyui-qt ====
Version update (2.49.13 -> 2.49.14)

- Fixed segfault in YQTableItem icon (bsc#1121083)
- 2.49.14

==== libzypp ====
Version update (17.10.3 -> 17.11.0)

- PoolItemBest: Optionally prefer not locked packages (for bsc#1113296)
- ui::Selectable: add `hasLocks` to indicate a partially locked
item (for bsc#1113296)
- version 17.11.0 (9)

==== links ====
Version update (2.17 -> 2.18)

- links 2.18
* Automatically enable tor mode when the socks port is 9050
* When in tor mode, invert colors on top line and bottom line
* Fix an incorrect shift in write_ev_queue
* Fix runtime error sanitizer warning
* Add a menu entry to save and load a clipboard
* Don't synch with Xserver on every pixmap load
* Fix "Network Options" bug that caused a timeout
* Fix a possible integer overflow in decoder_memory_expand
* Fix possible pointer arithmetics bug if os allocated few bytes
* Add a button to never accept invalid certs for a given server
* Fix incorrect strings -html-t-text-color
* Add ascii replacement of Romanian S and T with comma
* Fix a bug when IPv6 control connection to ftp server fails

==== lzip ====
Version update (1.21~rc1 -> 1.21)

- Update to new upstream release 1.21
* Errors are now also checked when closing the input file
* The descritions in the man pages are improved
* Config script now accepts appending CXXFLAGS options

==== mailcommon ====
Version update (18.12.0 -> 18.12.1)
Subpackages: libKF5MailCommon5 mailcommon-lang

- Update to 18.12.1
* New bugfix release
* For more details please see:
* https://www.kde.org/announcements/announce-applications-18.12.1.php
- Changes since 18.12.0:
* Optimization. Don't initialize brokencolor if not necessary

==== mailimporter ====
Version update (18.12.0 -> 18.12.1)
Subpackages: libKF5MailImporter5 libKF5MailImporterAkonadi5 mailimporter-lang

- Update to 18.12.1
* New bugfix release
* For more details please see:
* https://www.kde.org/announcements/announce-applications-18.12.1.php
- Changes since 18.12.0:
* Add missing include.

==== mariadb ====
Version update (10.2.19 -> 10.2.21)
Subpackages: libmysqld19 mariadb-client mariadb-errormessages

- update to 10.2.21 GA
* notable changes:
* MDEV-17589 - Stack-buffer-overflow with indexed varchar
(utf8) field
* MDEV-16987 - ALTER DATABASE possible in read-only mode
(forbid ALTER DATABASE in read_only)
* MDEV-17720 - slave_ddl_exec_mode=IDEMPOTENT does not handle
DROP DATABASE
* MDEV-6453 - Assertion `inited==NONE || (inited==RND && scan)'
failed in handler::ha_rnd_init(bool) with InnoDB, joins,
AND/OR conditions
* MDEV-18105 - Mariabackup fails to copy encrypted InnoDB
system tablespace if LSN>4G
* MDEV-18041 - Database corruption after renaming a
prefix-indexed column [bsc#1120041]
* MDEV-17470 - Orphan temporary files after interrupted ALTER
cause InnoDB: Operating system error number 17 and eventual
fatal error 71
* MDEV-17833: ALTER TABLE is not enforcing prefix index size
limit
* MDEV-17989: InnoDB: Failing assertion:
dict_tf2_is_valid(flags, flags2)
* MDEV-17765: Locking bug fix for SPATIAL INDEX
* MDEV-17923, MDEV-17904, MDEV-17938: Fixes for FULLTEXT INDEX
* Fixes for regressions introduced in MariaDB Server 10.2.19 by
the backup-safe TRUNCATE TABLE (MDEV-13564,
innodb_safe_truncate=ON) and innodb_undo_log_truncate:
* MDEV-17780, MDEV-17816, MDEV-17849, MDEV-17851, MDEV-17885
* Several improvements to MariaDB Server and backup for dealing
with encrypted or page_compressed pages:
* MDEV-12112: corruption in encrypted table may be overlooked
* MDEV-17958: On little-endian systems, remove bug-compatible
variant of innodb_checksum_algorithm=crc32
* MDEV-17957: Make innodb_checksum_algorithm stricter for
strict_* values
* MDEV-18025: Mariabackup fails to detect corrupted
page_compressed=1 tables
* fixes for the following security vulnerabilities: none
* release notes and changelog:
https://mariadb.com/kb/en/library/mariadb-10221-release-notes
https://mariadb.com/kb/en/library/mariadb-10221-changelog
https://mariadb.com/kb/en/library/mariadb-10220-release-notes
https://mariadb.com/kb/en/library/mariadb-10220-changelog
- update suse_skipped_tests.list

==== meld ====
Version update (3.19.0 -> 3.20.0)
Subpackages: meld-lang

- Update to version 3.20.0:
+ Add Enter as a Compare accelerator in folder comparisons.
+ Change entry and drag-n-drop file changes to confirm discarding
modified files instead of offering to save, for simplicity.
+ Fix menu sensitivity in folder comparisons.
+ Avoid dconf writes of no-op window size allocations.
+ Issues fixed: glgo#GNOME/meld#262, glgo#GNOME/meld#247.
+ Updated translations.
- Meld 3.19.1:
+ Support comparing remote files
+ Significantly improve folder comparison performance when
comparing large trees
+ Improve folder comparison IO and memory use
+ Add recursive collapse/expand actions to folder comparisons
+ Add OARS metadata for software management
+ Support file drag-and-drop directly on to textviews
+ Refresh the application icon and add a processing pipeline
+ various bug fixes and translation updates

==== messagelib ====
Version update (18.12.0 -> 18.12.1)
Subpackages: messagelib-lang

- Update to 18.12.1
* New bugfix release
* For more details please see:
* https://www.kde.org/announcements/announce-applications-18.12.1.php
- Changes since 18.12.0:
* api.longurl.org doesn't work now. Use lengthenurl.info
* inform when we can't expand url
* Don't generate string when it's not necessary
* Fix Bug 402378 - mailto staement , uncomplete url past to kmail composer
(kde#402378)

==== mobipocket ====
Version update (18.12.0 -> 18.12.1)

- Update to 18.12.1
* New bugfix release
* For more details please see:
* https://www.kde.org/announcements/announce-applications-18.12.1.php
- Changes since 18.12.0:
* No code changes since 18.12.0

==== mutt ====
Version update (1.11.1 -> 1.11.2)
Subpackages: mutt-doc mutt-lang

- Update to mutt 1.11.2
* This is a bug-fix release, fixing compilation with the latest
OpenSSL version and various other bug fixes.

==== ocfs2-tools ====

- Add libdlm Requires dependency for ocfs2-tools (bsc#1121382)

==== okular ====
Version update (18.12.0 -> 18.12.1)
Subpackages: okular-lang

- Update to 18.12.1
* New bugfix release
* For more details please see:
* https://www.kde.org/announcements/announce-applications-18.12.1.php
- Changes since 18.12.0:
* Do not crash in files without title-info
* Fix crash when writing to some forms

==== openssh ====
Subpackages: openssh-helpers

- Security fix:
* [bsc#1121816, CVE-2019-6109] scp client spoofing via object name
* [bsc#1121818, CVE-2019-6110] scp client spoofing via stderr
* [bsc#1121821, CVE-2019-6111] scp client missing received object
name validation
* Added patch openssh-7.9p1-scp-name-validator.patch
- Security fix: [bsc#1121571, CVE-2018-20685]
* The scp client allows remote SSH servers to bypass intended
access restrictions
* Added patch openssh-7.9p1-CVE-2018-20685.patch

==== osc ====
Version update (0.163.0 -> 0.164.1)

- 0.164.1
- rewrite cpio handling to support python3
- rewrite ar module to support python3
- enable fetch module to support python3
- rework progressbar hanlding (if module is not present)
- improve os_path_samefile in core.py
- 0.164.0
- add support for approved requests (requires OBS 2.10)
- fix various multibuild problems
- improved and fixed various help texts
- check constraints without local checkout
- check out deleted sources (osc co -D)
- replace urlgrabber module with own module
- use progressbar module instead of urlgrabber to draw
progress bars
- show buildinfo for alternative projects (--alternative-project)
- run release job immediately (osc release --no-delay)
- build results on project level can now be watched (osc prjresults --watch)
- removed python-urlgrabber requieres. (Not used with 0.164.0)
- added recommends for python[2]-progressbar

==== oxygen5-icon-theme ====
Version update (5.53.0 -> 5.54.0)
Subpackages: oxygen5-icon-theme-large

- Update to 5.54.0
* New feature release
* For more details please see:
* https://www.kde.org/announcements/kde-frameworks-5.54.0.php
- Changes since 5.53.0:
* No code changes since 5.53.0

==== pam_ssh ====
Version update (2.1 -> 2.3)
Subpackages: pam_ssh-32bit

- Update to 2.3
* cleanup some leftovers from dropping SSH1 support in code and
documentation
- Update to 2.2
* upstream OpenSSL 1.1 compatibility
(drop pam_ssh-openssl11.patch)
* upstream removed support for SSH1 and RSA1 protocols

==== perl-URI ====
Version update (1.74 -> 1.76)

- updated to 1.76
see /usr/share/doc/packages/perl-URI/Changes
1.76 2019-01-09 16:59:54Z
- Revert changes introduced in 1.75
- updated to 1.75
see /usr/share/doc/packages/perl-URI/Changes
1.75 2019-01-08 19:45:38Z
- $uri->canonical unconditionally returns a clone (GH#58) (Dorian Taylor)

==== phonon ====
Version update (4.10.1 -> 4.10.2)

- Update to 4.10.2:
* PulseAudio support is no longer incorrectly disabled with Qt
5.12
- Run spec-cleaner
- Add %license

==== phonon4qt5 ====
Version update (4.10.1 -> 4.10.2)

- Update to 4.10.2:
* PulseAudio support is no longer incorrectly disabled with Qt
5.12
- Drop 0001-Fix-PulseAudio-support-with-Qt-5.12.patch, merged
upstream

==== pimcommon ====
Version update (18.12.0 -> 18.12.1)
Subpackages: libKF5PimCommon5 libKF5PimCommonAkonadi5 pimcommon-lang

- Update to 18.12.1
* New bugfix release
* For more details please see:
* https://www.kde.org/announcements/announce-applications-18.12.1.php
- Changes since 18.12.0:
* No code changes since 18.12.0

==== plasma-browser-integration ====
Version update (5.14.4 -> 5.14.5)
Subpackages: plasma-browser-integration-lang

- Update to 5.14.5
* New bugfix release
* For more details please see:
* https://www.kde.org/announcements/plasma-5.14.5.php
- Changes since 5.14.4:
* Only cancel job when an "error" is set and ignore "interrupted" (kde#385530)

==== plasma-framework ====
Version update (5.53.0 -> 5.54.0)
Subpackages: libKF5Plasma5 plasma-framework-components plasma-framework-lang

- Update to 5.54.0
* New feature release
* For more details please see:
* https://www.kde.org/announcements/kde-frameworks-5.54.0.php
- Changes since 5.53.0:
* [Calendar] Expose firstDayOfWeek in MonthView
* Add override
* Add preferences-system-bluetooth-battery to preferences.svgz
* Fix comparison between signed and unsigned integer warning
* Fix unused parameter warning

==== prison-qt5 ====
Version update (5.53.0 -> 5.54.0)
Subpackages: libKF5Prison5 prison-qt5-imports

- Update to 5.54.0
* New feature release
* For more details please see:
* https://www.kde.org/announcements/kde-frameworks-5.54.0.php
- Changes since 5.53.0:
* No code changes since 5.53.0

==== purple-facebook ====
Version update (0.9.5 -> 0.9.6)

- update to version 0.9.6
* This release fixes these two recent issues:
* "Failed to get sync_sequence_id" (#449) Facebook increased the
version number requirement for a significant fraction of users
(but not everyone, at least not yet)
* "Failed to read fixed header" (#410 for nss, #444 for gnutls)
NSS and GnuTLS, the two TLS/SSL libraries that libpurple supports,
enabled TLS 1.3 support in recent versions, and so did facebook.
There were some incompatibilities with libpurple 2.12.0 (fixed
in 2.13.0) and a subtle race condition on our side.

==== purpose ====
Version update (5.53.0 -> 5.54.0)
Subpackages: libKF5Purpose5 libKF5PurposeWidgets5 purpose-lang

- Update to 5.54.0
* New feature release
* For more details please see:
* https://www.kde.org/announcements/kde-frameworks-5.54.0.php
- Changes since 5.53.0:
* remove obsolete comment
* add missing properties
* Add plugin type for sharing URLs

==== rubygem-autoprefixer-rails ====
Version update (9.3.1 -> 9.4.5)

- updated to version 9.4.5
* Fix text-decoration-skip-ink support.
from version 9.4.4:
* Use direction value for -ms-writing-mode (by Denys Kniazevych).
* Fix warning text (by @zzzzBov).
- updated to version 9.4.3
see installed CHANGELOG.md
[#]# 9.4.3
* Add warning to force `flex-start` instead of `start` (by Antoine du Hamel).
- updated to version 9.4.2
see installed CHANGELOG.md
[#]# 9.4.2
* Fix Grid autoplacment warning.
[#]# 9.4.1
* Fix unnecessary Flexbox prefixes in Grid elements.
[#]# 9.4 ?Advance Australia?
* Add Grid autoplacment for `-ms-` (by Bogdan Dolin).
* Improve warnings (by Daniel Tonon).
* Remove some unnecessary warnings for Grid (by Andrey Alexandrov).

==== rubygem-commander ====
Version update (4.4.6 -> 4.4.7)

- updated to version 4.4.7
see installed History.rdoc
=== 4.4.7 / 2018-10-22
* Update HighLine dependency to 2.0.0. (@rohitpaulk)

==== rubygem-diffy ====
Version update (3.2.1 -> 3.3.0)

- updated to version 3.3.0
see installed CHANGELOG
== 3.3.0 ==
Fix diff lines that begin with -- or ++. Thanks @dark-panda!

==== rubygem-faraday ====
Version update (0.15.2 -> 0.15.4)

- updated to version 0.15.4
no changelog found

==== rubygem-ffi ====
Version update (1.9.25 -> 1.10.0)

- updated to version 1.10.0
Added:
* Add /opt/local/lib/ to ffi's fallback library search path. #638
* Add binary gem support for ruby-2.6 on Windows
* Add FreeBSD on AArch64 and ARM support. #644
* Add FFI::LastError.winapi_error on Windows native or Cygwin. #633
Changed:
* Update to rake-compiler-dock-0.7.0
* Use 64-bit inodes on FreeBSD >= 12. #644
* Switch time_t and suseconds_t types to long on FreeBSD. #627
* Make register_t long_long on 64-bit FreeBSD. #644
* Fix Pointer#write_array_of_type #637
Removed:
* Drop binary gem support for ruby-2.0 and 2.1 on Windows

==== rubygem-hashdiff ====
Version update (0.3.7 -> 0.3.8)

- updated to version 0.3.8
see installed changelog.md
[#]# v0.3.8 2018-12-30
* Add Rubocop and drops Ruby 1.9 support #47

==== rubygem-i18n ====
Version update (1.1.1 -> 1.5.2)

- updated to version 1.5.2
* Fixed a bug where the required_ruby_version was not set
correctly in the gemspec - #462
- updated to version 1.2.0
no changelog found

==== rubygem-liquid ====
Version update (4.0.0 -> 4.0.1)

- updated to version 4.0.1
see installed History.md

==== rubygem-mimemagic ====
Version update (0.3.2 -> 0.3.3)

- updated to version 0.3.3
* Upgrade to shared-mime-info-1.10

==== rubygem-mini_portile2 ====
Version update (2.3.0 -> 2.4.0)

- updated to version 2.4.0
see installed CHANGELOG.md

==== rubygem-mixlib-shellout ====
Version update (2.4.0 -> 2.4.2)

- updated to version 2.4.2
no changelog found

==== rubygem-msgpack ====
Version update (1.2.4 -> 1.2.6)

- updated to version 1.2.6
* Update Ruby version 2.6 dependency (especially for Windows environment)
* (version 1.2.4 and 1.2.5 were also releases for updated Ruby versions)

==== rubygem-mustache ====
Version update (1.0.5 -> 1.1.0)

- updated to version 1.1.0
no changelog found

==== rubygem-nokogiri ====
Version update (1.8.5 -> 1.10.1)

- updated to version 1.10.1
[#]## Features
* [MRI] During installation, handle Xcode 10's new library path. [#1801,
#1851] (Thanks, @mlj and @deepj!)
* Avoid unnecessary creation of `Proc`s in many methods. [#1776] (Thanks,
@chopraanmol1!)
[#]## Bug fixes
* CSS selector `:has()` now correctly matches against any descendant.
Previously this selector matched against only direct children). [#350] (Thanks,
@Phrogz!)
* `NodeSet#attr` now returns `nil` if it's empty. Previously this raised a
NoMethodError.
* [MRI] XPath errors are no longer suppressed during
`XSLT::Stylesheet#transform`. Previously these errors were suppressed which led
to silent failures and a subsequent segfault. [#1802]
- updated to version 1.9.1
CHANGELOG.md removed upstream

==== rubygem-passenger ====
Version update (6.0.0 -> 6.0.1)
Subpackages: ruby2.5-rubygem-passenger rubygem-passenger-apache2

- updated to version 6.0.1 (boo#1121748)
* Adds Ubuntu 18.10 "Cosmic" packages.
* Skips trying to set oom score in LXC container environments.
Closes GH-2143.
* Fixes an issue during the GLS startup handshake where ephemeral
ports could be exhausted. Closes GH-2144.
* Updated Ruby versions used in precompiled binaries (used for
e.g. gem installs) to include 2.5.3, and 2.4.5 (removed: 2.4.4).
* Bumps the preferred Nginx version to 1.15.8.
* Updated various library versions used in precompiled binaries
(used for e.g. gem installs):
- Curl: 7.62.0 -> 7.63.0
- Git: 2.19.2 -> 2.20.1
- Gnupg: 2.2.11 -> 2.2.12
- libassuan: 2.5.1 -> 2.5.2
- libgpg_error: 1.32 -> 1.33
- Ruby: 2.4.4 -> 2.4.5, + 2.5.3
- RubyGems: 2.7.6 -> 3.0.1

==== rubygem-rake ====
Version update (12.3.1 -> 12.3.2)

- updated to version 12.3.2
see installed History.rdoc
=== 12.3.2
==== Bug fixes
* Fixed test fails caused by 2.6 warnings.
Pull Request #297 by hsbt
==== Enhancements:
* Rdoc improvements.
Pull Request #293 by colby-swandale
* Improve multitask performance.
Pull Request #273 by jsm
* Add alias `prereqs`.
Pull Request #268 by take-cheeze

==== rubygem-ruby_parser ====
Version update (3.11.0 -> 3.12.0)

- updated to version 3.12.0
see installed History.rdoc
=== 3.12.0 / 2018-12-04
* 3 minor enhancements:
* 2.5: Allow rescue/ensure/else in normal do blocks. (presidentbeef)
* Added stabby proc with do/end as block call argument. (presidentbeef)
* Holy cow levels of optimization from presidentbeef. I write slow bad code.
* 1 bug fix:
* Improve handling of single-quoted symbols and labels. (mvz)

==== rubygem-sass ====
Version update (3.7.2 -> 3.7.3)

- updated to version 3.7.3
no changelog found

==== rubygem-stomp ====
Version update (1.4.6 -> 1.4.8)

- updated to version 1.4.8
see installed CHANGELOG.md
[#]# 1.4.8 20181219
* Fix missed merge from 1.4.7 release.
* Add global debug output flag to all unit tests.
- updated to version 1.4.7
see installed CHANGELOG.md
[#]# 1.4.7 20181210
* Support SSL cert/key in text format.
* Test adjustments for Artemis
* Correct missing variable name
* Fix Ruby 2.6 test indentation warning

==== rubygem-tilt ====
Version update (2.0.8 -> 2.0.9)

- updated to version 2.0.9
see installed CHANGELOG.md
[#]# 2.0.9 (2018-11-28)
* Use new ERB API in Ruby 2.6 (#329, koic)
* Support the new sassc gem (#336, jdickey, judofyr)

==== rubygem-tins ====
Version update (1.16.3 -> 1.20.2)

- updated to version 1.20.2
no changelog found

==== rubygem-tomlrb ====
Version update (1.2.7 -> 1.2.8)

- updated to version 1.2.8
CHANGELOG.md removed upstream

==== rubygem-tzinfo ====
Version update (1.2.5 -> 2.0.0)

- updated to version 2.0.0
see installed CHANGES.md

==== rubygem-tzinfo-data ====
Version update (1.2018.7 -> 1.2018.9)

- updated to version 1.2018.9
no changelog found

==== rubygem-vagrant_cloud ====
Version update (2.0.1 -> 2.0.2)

- updated to version 2.0.2
no changelog found

==== rubygem-winrm-fs ====
Version update (1.3.1 -> 1.3.2)

- updated to version 1.3.2
changelog.md removed upstream

==== samba ====
Version update (4.9.3+git.121.c328d5e9101 -> 4.9.4+git.126.aa8e79e6e87)
Subpackages: libdcerpc-binding0 libdcerpc-binding0-32bit libdcerpc0
libdcerpc0-32bit libndr-krb5pac0 libndr-krb5pac0-32bit libndr-nbt0
libndr-nbt0-32bit libndr-standard0 libndr-standard0-32bit libndr0 libndr0-32bit
libnetapi0 libnetapi0-32bit libsamba-credentials0 libsamba-credentials0-32bit
libsamba-errors0 libsamba-errors0-32bit libsamba-hostconfig0
libsamba-hostconfig0-32bit libsamba-passdb0 libsamba-passdb0-32bit
libsamba-util0 libsamba-util0-32bit libsamdb0 libsamdb0-32bit libsmbclient0
libsmbconf0 libsmbconf0-32bit libsmbldap2 libsmbldap2-32bit libtevent-util0
libtevent-util0-32bit libwbclient0 libwbclient0-32bit samba-client
samba-client-32bit samba-doc samba-libs samba-libs-32bit samba-libs-python
samba-winbind samba-winbind-32bit

- Update to samba-4.9.4
+ libcli/smb: Don't overwrite status code; (bso#9175).
+ wbinfo --group-info 'NT AUTHORITY\System' does not work; (bso#12164).
+ Session setup reauth fails to sign response; (bso#13661).
+ vfs_fruit: Validation of writes on AFP_AfpInfo stream; (bso#13677).
+ vfs_shadow_copy2: Nicely deal with attempts to open previous
version for writing; (bso#13688).
+ Restoring previous version of stream with vfs_shadow_copy2 fails
with NT_STATUS_OBJECT_NAME_INVALID fsp->base_fsp->fsp_name; (bso#13455).
+ CVE-2018-16853: Fix S4U2Self crash with MIT KDC build; (bso#13571).
+ s3-vfs: Prevent NULL pointer dereference in vfs_glusterfs; (bso#13708)
+ PEP8: fix E231: missing whitespace after ','.
+ winbindd: Fix crash when taking profiles;(bso#13629)
+ CVE-2018-14629 dns: Fix CNAME loop prevention using counter
regression; (bso#13600)
+ 'samba-tool user syscpasswords' fails on a domain with many DCs;
(bso#13686).
+ CVE-2018-16853: Do not segfault if client is not set; (bso#13571).
+ lib:util: Fix DEBUGCLASS pointer initializiation; (bso#13679)
+ ctdb-daemon: Exit with error if a database directory does not
exist; (bso#13696).
+ s3:libads: Add net ads leave keep-account option; (bso#13498).
- Drop more %if..%endif guards which are idempotent.
- Drop requires on ldconfig which are already auto-discovered.
- Do not ignore errors from useradd/groupadd.

==== solid ====
Version update (5.53.0 -> 5.54.0)
Subpackages: libKF5Solid5 libKF5Solid5-lang solid-imports solid-tools

- Update to 5.54.0
* New feature release
* For more details please see:
* https://www.kde.org/announcements/kde-frameworks-5.54.0.php
- Changes since 5.53.0:
* [UDisks2] Use MediaRemovable to determine if media can be ejected
* Use nullptr in more places
* lexer: disable input and unput functions
* Use nullptr in more places
* Support Bluetooth batteries

==== sonnet ====
Version update (5.53.0 -> 5.54.0)
Subpackages: libKF5SonnetCore5 libKF5SonnetCore5-lang libKF5SonnetUi5

- Update to 5.54.0
* New feature release
* For more details please see:
* https://www.kde.org/announcements/kde-frameworks-5.54.0.php
- Changes since 5.53.0:
* Add method to BackgroundChecker to add word to session
* Avoid Q_FOREACH
* DictionaryComboBox: Keep user preferred dictionaries on top
* Loader: Avoid Q_FOREACH
* Dialog: Use DictionaryComboBox instead of plain QComboBox

==== spectacle ====
Version update (18.12.0 -> 18.12.1)
Subpackages: spectacle-lang

- Update to 18.12.1
* New bugfix release
* For more details please see:
* https://www.kde.org/announcements/announce-applications-18.12.1.php
- Changes since 18.12.0:
* Use more https in links

==== subversion ====
Version update (1.11.0 -> 1.11.1)
Subpackages: libsvn_auth_gnome_keyring-1-0 libsvn_auth_kwallet-1-0
subversion-bash-completion subversion-perl subversion-python subversion-server
subversion-tools

- Apache Subversion 1.11.1:
* Add conflict resolver support for added vs unversioned file
* Add conflict resolver support for unversioned directories
* Various client-side bug fixes for working copy operations
* Server: fix unexpected SVN_ERR_FS_NOT_DIRECTORY errors
* Server: fix mod_dav_svn's SVNUseUTF8 had no effect in some setups
* Server: fix a crash in mod_http2
* JavaHL bindings: Fix crash in client code when using external
diff
- Move the bash completion to /usr as per rpmlint warning

==== syntax-highlighting ====
Version update (5.53.0 -> 5.54.0)
Subpackages: libKF5SyntaxHighlighting5 libKF5SyntaxHighlighting5-lang

- Update to 5.54.0
* New feature release
* For more details please see:
* https://www.kde.org/announcements/kde-frameworks-5.54.0.php
- Changes since 5.53.0:
* Update php syntax support
* WML: fix embedded Lua code & use new default styles
* highlight token strings and delimited strings
* fixups for `extern` and `pragma`
* Highlight CUDA .cu and .cuh files as C++
* TypeScript & TS/JS React: improve types detection, fix float-points & other
improvements/fixes
* Haskell: Highlight empty comments after 'import'
* WML: fix infinite loop in contexts switch & only highlight tags with valid
names (kde#402720)
* BrightScript: Add workaround for QtCreator 'endsub' highlighting
* improve highlighting of complex numbers (kde#402002)
* BrightScript: Remove unused keyword list 'end'
* increment file version
* add attributes `shared` and `__gshared`
* stay in context Linkage2/Pragma2 until closing paren
* BrightScript: Add function/sub folding

==== threadweaver ====
Version update (5.53.0 -> 5.54.0)

- Update to 5.54.0
* New feature release
* For more details please see:
* https://www.kde.org/announcements/kde-frameworks-5.54.0.php
- Changes since 5.53.0:
* No code changes since 5.53.0

==== valgrind ====

- split into a -32bit subpackage, fix buildrequires for older distros

==== virtualbox ====
Subpackages: virtualbox-guest-kmp-default virtualbox-guest-tools
virtualbox-guest-x11

- Remove test patch "change_default_net_adapter.patch". It was made obsolete by
upstream changes.
- Fix for latest gcc8 was incomplete.
- Fix builds for the latest version of gcc8 and above. File "fixes_for_gcc9" is
added.

==== vlc ====
Version update (3.0.4 -> 3.0.6)
Subpackages: libvlc5 libvlccore9 vlc-codec-gstreamer vlc-lang vlc-noX vlc-qt

- Update to version 3.0.6:
+ Core:
* Fix potential subtitle picture allocation failures
+ Codec:
* Add support for 12 bits decoding of AV1
* Fix HDR support in AV1 when the container provides the metadata
- Update to version 3.0.5:
+ Access:
* Improve RTSP playback
* BluRay fixes and improvements, notably for menus and seeking
* Improve the UDP/RTP truncated issue
+ Codec:
* Add a new AVI decoder based on the davld library
* Enable libaom decoder by default
* Fix decoding of some HEVC streams with macOS hardware decoding
+ Demux:
* MP4: Fix reading of some HDR metadata
* Miscellaneous AV1 demuxing improvements
* Fix CAF integer-underflow
* Fix an MKV crash on iOS 12.0 on iPhone XS phones
+ Packetizer:
* Add an AV1 packetizer
+ Audio output:
* Fix corking when the playback state is paused
* Improve corking on Android
+ Video Output:
* Fix Direct3D11 tone-mapping when HDR is displayed on SDR screen
* More accurate colors for SD sources in Direct3D11
* Disable hardware decoding on some old Intel GPUs
* Fix zero-copy GPU acceleration on AMD RX Vega
* Misc Direct3D11 fixes
+ Miscellaneous
* Improve ChromeCast
* Update numerous 3P libraries, including for minor security issues
* Update YouTube support
* Fix subtitles rendering with specific fonts with negative HA

==== xdg-desktop-portal-kde ====
Version update (5.14.4 -> 5.14.5)
Subpackages: xdg-desktop-portal-kde-lang

- Update to 5.14.5
* New bugfix release
* For more details please see:
* https://www.kde.org/announcements/plasma-5.14.5.php
- Changes since 5.14.4:
* Set parent window for dialogs
* Add workaround for gtk file chooser filter patterns (kde#399889)
* FileChooser: make use of current_name property in Save dialog (kde#402077)

==== xfce4-panel-plugin-battery ====
Version update (1.1.1 -> 1.1.2)
Subpackages: xfce4-panel-plugin-battery-lang

- update to version 1.1.2
- support for APM has been removed
- Listen for UPower events for power source changes (bxo#14978)
- Reset averages when a battery is removed/added (bxo#14930)
- Re-detect battery presence every 30 seconds (bxo#14930)
- Fix null pointer dereference with no battery present (bxo#14930)
- Remove deprecated /proc/acpi support in favor of sysfs
- Remove APM support on FreeBSD as well, it doesn't even build
- Remove historical APM support for Linux, support ACPI only
- Initially show/hide widgets according to user config (bxo#9594)


--
To unsubscribe, e-mail: opensuse-factory+unsubscribe@xxxxxxxxxxxx
To contact the owner, e-mail: opensuse-factory+owner@xxxxxxxxxxxx

< Previous Next >
This Thread
  • No further messages